You are viewing a plain text version of this content. The canonical link for it is here.
Posted to builds@solr.apache.org by Apache Jenkins Server <je...@builds.apache.org> on 2023/07/10 10:25:07 UTC
[JENKINS] Solr » Solr-Check-main - Build # 7389 - Unstable!
Build: https://ci-builds.apache.org/job/Solr/job/Solr-Check-main/7389/
2 tests failed.
FAILED: org.apache.solr.schema.DenseVectorFieldTest.denseVectorFieldOnAtomicUpdate_shouldBeUpdatedCorrectly
Error Message:
org.apache.solr.common.SolrException: Atomic document updates are not supported unless <updateLog/> is configured
Stack Trace:
org.apache.solr.common.SolrException: Atomic document updates are not supported unless <updateLog/> is configured
at __randomizedtesting.SeedInfo.seed([F404980FDB6AE07A:1E8900B7DC8537D1]:0)
at app//org.apache.solr.update.processor.DistributedUpdateProcessor.versionAdd(DistributedUpdateProcessor.java:297)
at app//org.apache.solr.update.processor.DistributedUpdateProcessor.processAdd(DistributedUpdateProcessor.java:234)
at app//org.apache.solr.update.processor.LogUpdateProcessorFactory$LogUpdateProcessor.processAdd(LogUpdateProcessorFactory.java:111)
at app//org.apache.solr.handler.loader.XMLLoader.processUpdate(XMLLoader.java:189)
at app//org.apache.solr.handler.loader.XMLLoader.load(XMLLoader.java:120)
at app//org.apache.solr.handler.UpdateRequestHandler$1.load(UpdateRequestHandler.java:102)
at app//org.apache.solr.handler.ContentStreamHandlerBase.handleRequestBody(ContentStreamHandlerBase.java:84)
at app//org.apache.solr.handler.RequestHandlerBase.handleRequest(RequestHandlerBase.java:224)
at app//org.apache.solr.core.SolrCore.execute(SolrCore.java:2893)
at app//org.apache.solr.servlet.DirectSolrConnection.request(DirectSolrConnection.java:113)
at app//org.apache.solr.util.TestHarness.update(TestHarness.java:295)
at app//org.apache.solr.util.BaseTestHarness.checkUpdateStatus(BaseTestHarness.java:270)
at app//org.apache.solr.util.BaseTestHarness.validateUpdate(BaseTestHarness.java:238)
at app//org.apache.solr.SolrTestCaseJ4.checkUpdateU(SolrTestCaseJ4.java:969)
at app//org.apache.solr.SolrTestCaseJ4.assertU(SolrTestCaseJ4.java:951)
at app//org.apache.solr.SolrTestCaseJ4.assertU(SolrTestCaseJ4.java:946)
at app//org.apache.solr.schema.DenseVectorFieldTest.denseVectorFieldOnAtomicUpdate_shouldBeUpdatedCorrectly(DenseVectorFieldTest.java:665)
at java.base@11.0.16.1/jdk.internal.reflect.NativeMethodAccessorImpl.invoke0(Native Method)
at java.base@11.0.16.1/jdk.internal.reflect.NativeMethodAccessorImpl.invoke(NativeMethodAccessorImpl.java:62)
at java.base@11.0.16.1/jdk.internal.reflect.DelegatingMethodAccessorImpl.invoke(DelegatingMethodAccessorImpl.java:43)
at java.base@11.0.16.1/java.lang.reflect.Method.invoke(Method.java:566)
at app//com.carrotsearch.randomizedtesting.RandomizedRunner.invoke(RandomizedRunner.java:1758)
at app//com.carrotsearch.randomizedtesting.RandomizedRunner$8.evaluate(RandomizedRunner.java:946)
at app//com.carrotsearch.randomizedtesting.RandomizedRunner$9.evaluate(RandomizedRunner.java:982)
at app//com.carrotsearch.randomizedtesting.RandomizedRunner$10.evaluate(RandomizedRunner.java:996)
at app//com.carrotsearch.randomizedtesting.rules.SystemPropertiesRestoreRule$1.evaluate(SystemPropertiesRestoreRule.java:80)
at app//org.junit.rules.RunRules.evaluate(RunRules.java:20)
at app//org.apache.lucene.tests.util.TestRuleSetupTeardownChained$1.evaluate(TestRuleSetupTeardownChained.java:48)
at app//org.apache.lucene.tests.util.AbstractBeforeAfterRule$1.evaluate(AbstractBeforeAfterRule.java:43)
at app//org.apache.lucene.tests.util.TestRuleThreadAndTestName$1.evaluate(TestRuleThreadAndTestName.java:45)
at app//org.apache.lucene.tests.util.TestRuleIgnoreAfterMaxFailures$1.evaluate(TestRuleIgnoreAfterMaxFailures.java:60)
at app//org.apache.lucene.tests.util.TestRuleMarkFailure$1.evaluate(TestRuleMarkFailure.java:44)
at app//org.junit.rules.RunRules.evaluate(RunRules.java:20)
at app//com.carrotsearch.randomizedtesting.rules.StatementAdapter.evaluate(StatementAdapter.java:36)
at app//com.carrotsearch.randomizedtesting.ThreadLeakControl$StatementRunner.run(ThreadLeakControl.java:390)
at app//com.carrotsearch.randomizedtesting.ThreadLeakControl.forkTimeoutingTask(ThreadLeakControl.java:843)
at app//com.carrotsearch.randomizedtesting.ThreadLeakControl$3.evaluate(ThreadLeakControl.java:490)
at app//com.carrotsearch.randomizedtesting.RandomizedRunner.runSingleTest(RandomizedRunner.java:955)
at app//com.carrotsearch.randomizedtesting.RandomizedRunner$5.evaluate(RandomizedRunner.java:840)
at app//com.carrotsearch.randomizedtesting.RandomizedRunner$6.evaluate(RandomizedRunner.java:891)
at app//com.carrotsearch.randomizedtesting.RandomizedRunner$7.evaluate(RandomizedRunner.java:902)
at app//com.carrotsearch.randomizedtesting.rules.StatementAdapter.evaluate(StatementAdapter.java:36)
at app//com.carrotsearch.randomizedtesting.rules.StatementAdapter.evaluate(StatementAdapter.java:36)
at app//org.apache.lucene.tests.util.AbstractBeforeAfterRule$1.evaluate(AbstractBeforeAfterRule.java:43)
at app//com.carrotsearch.randomizedtesting.rules.SystemPropertiesRestoreRule$1.evaluate(SystemPropertiesRestoreRule.java:80)
at app//org.junit.rules.RunRules.evaluate(RunRules.java:20)
at app//org.apache.lucene.tests.util.AbstractBeforeAfterRule$1.evaluate(AbstractBeforeAfterRule.java:43)
at app//com.carrotsearch.randomizedtesting.rules.StatementAdapter.evaluate(StatementAdapter.java:36)
at app//org.apache.lucene.tests.util.TestRuleStoreClassName$1.evaluate(TestRuleStoreClassName.java:38)
at app//com.carrotsearch.randomizedtesting.rules.NoShadowingOrOverridesOnMethodsRule$1.evaluate(NoShadowingOrOverridesOnMethodsRule.java:40)
at app//com.carrotsearch.randomizedtesting.rules.NoShadowingOrOverridesOnMethodsRule$1.evaluate(NoShadowingOrOverridesOnMethodsRule.java:40)
at app//com.carrotsearch.randomizedtesting.rules.StatementAdapter.evaluate(StatementAdapter.java:36)
at app//com.carrotsearch.randomizedtesting.rules.StatementAdapter.evaluate(StatementAdapter.java:36)
at app//org.apache.lucene.tests.util.TestRuleAssertionsRequired$1.evaluate(TestRuleAssertionsRequired.java:53)
at app//org.apache.lucene.tests.util.AbstractBeforeAfterRule$1.evaluate(AbstractBeforeAfterRule.java:43)
at app//org.apache.lucene.tests.util.TestRuleMarkFailure$1.evaluate(TestRuleMarkFailure.java:44)
at app//org.apache.lucene.tests.util.TestRuleIgnoreAfterMaxFailures$1.evaluate(TestRuleIgnoreAfterMaxFailures.java:60)
at app//org.apache.lucene.tests.util.TestRuleIgnoreTestSuites$1.evaluate(TestRuleIgnoreTestSuites.java:47)
at app//org.junit.rules.RunRules.evaluate(RunRules.java:20)
at app//com.carrotsearch.randomizedtesting.rules.StatementAdapter.evaluate(StatementAdapter.java:36)
at app//com.carrotsearch.randomizedtesting.ThreadLeakControl$StatementRunner.run(ThreadLeakControl.java:390)
at app//com.carrotsearch.randomizedtesting.ThreadLeakControl.lambda$forkTimeoutingTask$0(ThreadLeakControl.java:850)
at java.base@11.0.16.1/java.lang.Thread.run(Thread.java:829)
FAILED: org.apache.solr.schema.DenseVectorFieldTest.denseVectorField_shouldBePresentAfterAtomicUpdate
Error Message:
org.apache.solr.common.SolrException: Atomic document updates are not supported unless <updateLog/> is configured
Stack Trace:
org.apache.solr.common.SolrException: Atomic document updates are not supported unless <updateLog/> is configured
at __randomizedtesting.SeedInfo.seed([F404980FDB6AE07A:E1B37AB0E4E834F0]:0)
at app//org.apache.solr.update.processor.DistributedUpdateProcessor.versionAdd(DistributedUpdateProcessor.java:297)
at app//org.apache.solr.update.processor.DistributedUpdateProcessor.processAdd(DistributedUpdateProcessor.java:234)
at app//org.apache.solr.update.processor.LogUpdateProcessorFactory$LogUpdateProcessor.processAdd(LogUpdateProcessorFactory.java:111)
at app//org.apache.solr.handler.loader.XMLLoader.processUpdate(XMLLoader.java:189)
at app//org.apache.solr.handler.loader.XMLLoader.load(XMLLoader.java:120)
at app//org.apache.solr.handler.UpdateRequestHandler$1.load(UpdateRequestHandler.java:102)
at app//org.apache.solr.handler.ContentStreamHandlerBase.handleRequestBody(ContentStreamHandlerBase.java:84)
at app//org.apache.solr.handler.RequestHandlerBase.handleRequest(RequestHandlerBase.java:224)
at app//org.apache.solr.core.SolrCore.execute(SolrCore.java:2893)
at app//org.apache.solr.servlet.DirectSolrConnection.request(DirectSolrConnection.java:113)
at app//org.apache.solr.util.TestHarness.update(TestHarness.java:295)
at app//org.apache.solr.util.BaseTestHarness.checkUpdateStatus(BaseTestHarness.java:270)
at app//org.apache.solr.util.BaseTestHarness.validateUpdate(BaseTestHarness.java:238)
at app//org.apache.solr.SolrTestCaseJ4.checkUpdateU(SolrTestCaseJ4.java:969)
at app//org.apache.solr.SolrTestCaseJ4.assertU(SolrTestCaseJ4.java:951)
at app//org.apache.solr.SolrTestCaseJ4.assertU(SolrTestCaseJ4.java:946)
at app//org.apache.solr.schema.DenseVectorFieldTest.denseVectorField_shouldBePresentAfterAtomicUpdate(DenseVectorFieldTest.java:628)
at java.base@11.0.16.1/jdk.internal.reflect.NativeMethodAccessorImpl.invoke0(Native Method)
at java.base@11.0.16.1/jdk.internal.reflect.NativeMethodAccessorImpl.invoke(NativeMethodAccessorImpl.java:62)
at java.base@11.0.16.1/jdk.internal.reflect.DelegatingMethodAccessorImpl.invoke(DelegatingMethodAccessorImpl.java:43)
at java.base@11.0.16.1/java.lang.reflect.Method.invoke(Method.java:566)
at app//com.carrotsearch.randomizedtesting.RandomizedRunner.invoke(RandomizedRunner.java:1758)
at app//com.carrotsearch.randomizedtesting.RandomizedRunner$8.evaluate(RandomizedRunner.java:946)
at app//com.carrotsearch.randomizedtesting.RandomizedRunner$9.evaluate(RandomizedRunner.java:982)
at app//com.carrotsearch.randomizedtesting.RandomizedRunner$10.evaluate(RandomizedRunner.java:996)
at app//com.carrotsearch.randomizedtesting.rules.SystemPropertiesRestoreRule$1.evaluate(SystemPropertiesRestoreRule.java:80)
at app//org.junit.rules.RunRules.evaluate(RunRules.java:20)
at app//org.apache.lucene.tests.util.TestRuleSetupTeardownChained$1.evaluate(TestRuleSetupTeardownChained.java:48)
at app//org.apache.lucene.tests.util.AbstractBeforeAfterRule$1.evaluate(AbstractBeforeAfterRule.java:43)
at app//org.apache.lucene.tests.util.TestRuleThreadAndTestName$1.evaluate(TestRuleThreadAndTestName.java:45)
at app//org.apache.lucene.tests.util.TestRuleIgnoreAfterMaxFailures$1.evaluate(TestRuleIgnoreAfterMaxFailures.java:60)
at app//org.apache.lucene.tests.util.TestRuleMarkFailure$1.evaluate(TestRuleMarkFailure.java:44)
at app//org.junit.rules.RunRules.evaluate(RunRules.java:20)
at app//com.carrotsearch.randomizedtesting.rules.StatementAdapter.evaluate(StatementAdapter.java:36)
at app//com.carrotsearch.randomizedtesting.ThreadLeakControl$StatementRunner.run(ThreadLeakControl.java:390)
at app//com.carrotsearch.randomizedtesting.ThreadLeakControl.forkTimeoutingTask(ThreadLeakControl.java:843)
at app//com.carrotsearch.randomizedtesting.ThreadLeakControl$3.evaluate(ThreadLeakControl.java:490)
at app//com.carrotsearch.randomizedtesting.RandomizedRunner.runSingleTest(RandomizedRunner.java:955)
at app//com.carrotsearch.randomizedtesting.RandomizedRunner$5.evaluate(RandomizedRunner.java:840)
at app//com.carrotsearch.randomizedtesting.RandomizedRunner$6.evaluate(RandomizedRunner.java:891)
at app//com.carrotsearch.randomizedtesting.RandomizedRunner$7.evaluate(RandomizedRunner.java:902)
at app//com.carrotsearch.randomizedtesting.rules.StatementAdapter.evaluate(StatementAdapter.java:36)
at app//com.carrotsearch.randomizedtesting.rules.StatementAdapter.evaluate(StatementAdapter.java:36)
at app//org.apache.lucene.tests.util.AbstractBeforeAfterRule$1.evaluate(AbstractBeforeAfterRule.java:43)
at app//com.carrotsearch.randomizedtesting.rules.SystemPropertiesRestoreRule$1.evaluate(SystemPropertiesRestoreRule.java:80)
at app//org.junit.rules.RunRules.evaluate(RunRules.java:20)
at app//org.apache.lucene.tests.util.AbstractBeforeAfterRule$1.evaluate(AbstractBeforeAfterRule.java:43)
at app//com.carrotsearch.randomizedtesting.rules.StatementAdapter.evaluate(StatementAdapter.java:36)
at app//org.apache.lucene.tests.util.TestRuleStoreClassName$1.evaluate(TestRuleStoreClassName.java:38)
at app//com.carrotsearch.randomizedtesting.rules.NoShadowingOrOverridesOnMethodsRule$1.evaluate(NoShadowingOrOverridesOnMethodsRule.java:40)
at app//com.carrotsearch.randomizedtesting.rules.NoShadowingOrOverridesOnMethodsRule$1.evaluate(NoShadowingOrOverridesOnMethodsRule.java:40)
at app//com.carrotsearch.randomizedtesting.rules.StatementAdapter.evaluate(StatementAdapter.java:36)
at app//com.carrotsearch.randomizedtesting.rules.StatementAdapter.evaluate(StatementAdapter.java:36)
at app//org.apache.lucene.tests.util.TestRuleAssertionsRequired$1.evaluate(TestRuleAssertionsRequired.java:53)
at app//org.apache.lucene.tests.util.AbstractBeforeAfterRule$1.evaluate(AbstractBeforeAfterRule.java:43)
at app//org.apache.lucene.tests.util.TestRuleMarkFailure$1.evaluate(TestRuleMarkFailure.java:44)
at app//org.apache.lucene.tests.util.TestRuleIgnoreAfterMaxFailures$1.evaluate(TestRuleIgnoreAfterMaxFailures.java:60)
at app//org.apache.lucene.tests.util.TestRuleIgnoreTestSuites$1.evaluate(TestRuleIgnoreTestSuites.java:47)
at app//org.junit.rules.RunRules.evaluate(RunRules.java:20)
at app//com.carrotsearch.randomizedtesting.rules.StatementAdapter.evaluate(StatementAdapter.java:36)
at app//com.carrotsearch.randomizedtesting.ThreadLeakControl$StatementRunner.run(ThreadLeakControl.java:390)
at app//com.carrotsearch.randomizedtesting.ThreadLeakControl.lambda$forkTimeoutingTask$0(ThreadLeakControl.java:850)
at java.base@11.0.16.1/java.lang.Thread.run(Thread.java:829)
Build Log:
[...truncated 971 lines...]
2> => org.apache.solr.common.SolrException: ERROR: [doc=0] Error adding field 'vector'='5.4' msg=Error while creating field 'vector{type=knn_vector,properties=indexed,stored}' from value '5.4'
2> at org.apache.solr.update.DocumentBuilder.toDocument(DocumentBuilder.java:248)
2> org.apache.solr.common.SolrException: ERROR: [doc=0] Error adding field 'vector'='5.4' msg=Error while creating field 'vector{type=knn_vector,properties=indexed,stored}' from value '5.4'
2> at org.apache.solr.update.DocumentBuilder.toDocument(DocumentBuilder.java:248) ~[main/:?]
2> at org.apache.solr.update.AddUpdateCommand.makeLuceneDocs(AddUpdateCommand.java:213) ~[main/:?]
2> at org.apache.solr.update.DirectUpdateHandler2.updateDocOrDocValues(DirectUpdateHandler2.java:1057) ~[main/:?]
2> at org.apache.solr.update.DirectUpdateHandler2.doNormalUpdate(DirectUpdateHandler2.java:421) ~[main/:?]
2> at org.apache.solr.update.DirectUpdateHandler2.addDoc0(DirectUpdateHandler2.java:374) ~[main/:?]
2> at org.apache.solr.update.DirectUpdateHandler2.addDoc(DirectUpdateHandler2.java:311) ~[main/:?]
2> at org.apache.solr.update.processor.RunUpdateProcessorFactory$RunUpdateProcessor.processAdd(RunUpdateProcessorFactory.java:76) ~[main/:?]
2> at org.apache.solr.update.processor.UpdateRequestProcessor.processAdd(UpdateRequestProcessor.java:54) ~[main/:?]
2> at org.apache.solr.update.processor.DistributedUpdateProcessor.versionAdd(DistributedUpdateProcessor.java:301) ~[main/:?]
2> at org.apache.solr.update.processor.DistributedUpdateProcessor.processAdd(DistributedUpdateProcessor.java:234) ~[main/:?]
2> at org.apache.solr.update.processor.LogUpdateProcessorFactory$LogUpdateProcessor.processAdd(LogUpdateProcessorFactory.java:111) ~[main/:?]
2> at org.apache.solr.handler.loader.XMLLoader.processUpdate(XMLLoader.java:189) ~[main/:?]
2> at org.apache.solr.handler.loader.XMLLoader.load(XMLLoader.java:120) ~[main/:?]
2> at org.apache.solr.handler.UpdateRequestHandler$1.load(UpdateRequestHandler.java:102) ~[main/:?]
2> at org.apache.solr.handler.ContentStreamHandlerBase.handleRequestBody(ContentStreamHandlerBase.java:84) ~[main/:?]
2> at org.apache.solr.handler.RequestHandlerBase.handleRequest(RequestHandlerBase.java:224) [main/:?]
2> at org.apache.solr.core.SolrCore.execute(SolrCore.java:2893) [main/:?]
2> at org.apache.solr.servlet.DirectSolrConnection.request(DirectSolrConnection.java:113) [main/:?]
2> at org.apache.solr.util.TestHarness.update(TestHarness.java:295) [solr-test-framework-10.0.0-SNAPSHOT.jar:10.0.0-SNAPSHOT d713595bb70bb654c9e9f0cb13f9e40890d4891b [snapshot build, details omitted]]
2> at org.apache.solr.util.BaseTestHarness.checkUpdateStatus(BaseTestHarness.java:270) [solr-test-framework-10.0.0-SNAPSHOT.jar:10.0.0-SNAPSHOT d713595bb70bb654c9e9f0cb13f9e40890d4891b [snapshot build, details omitted]]
2> at org.apache.solr.util.BaseTestHarness.validateErrorUpdate(BaseTestHarness.java:252) [solr-test-framework-10.0.0-SNAPSHOT.jar:10.0.0-SNAPSHOT d713595bb70bb654c9e9f0cb13f9e40890d4891b [snapshot build, details omitted]]
2> at org.apache.solr.SolrTestCaseJ4.checkUpdateU(SolrTestCaseJ4.java:972) [solr-test-framework-10.0.0-SNAPSHOT.jar:?]
2> at org.apache.solr.SolrTestCaseJ4.assertFailedU(SolrTestCaseJ4.java:961) [solr-test-framework-10.0.0-SNAPSHOT.jar:?]
2> at org.apache.solr.SolrTestCaseJ4.assertFailedU(SolrTestCaseJ4.java:956) [solr-test-framework-10.0.0-SNAPSHOT.jar:?]
2> at org.apache.solr.schema.DenseVectorFieldTest.indexing_notAVectorValue_shouldThrowException(DenseVectorFieldTest.java:418) [test/:?]
2> at jdk.internal.reflect.NativeMethodAccessorImpl.invoke0(Native Method) ~[?:?]
2> at jdk.internal.reflect.NativeMethodAccessorImpl.invoke(NativeMethodAccessorImpl.java:62) ~[?:?]
2> at jdk.internal.reflect.DelegatingMethodAccessorImpl.invoke(DelegatingMethodAccessorImpl.java:43) ~[?:?]
2> at java.lang.reflect.Method.invoke(Method.java:566) ~[?:?]
2> at com.carrotsearch.randomizedtesting.RandomizedRunner.invoke(RandomizedRunner.java:1758) [randomizedtesting-runner-2.8.1.jar:?]
2> at com.carrotsearch.randomizedtesting.RandomizedRunner$8.evaluate(RandomizedRunner.java:946) [randomizedtesting-runner-2.8.1.jar:?]
2> at com.carrotsearch.randomizedtesting.RandomizedRunner$9.evaluate(RandomizedRunner.java:982) [randomizedtesting-runner-2.8.1.jar:?]
2> at com.carrotsearch.randomizedtesting.RandomizedRunner$10.evaluate(RandomizedRunner.java:996) [randomizedtesting-runner-2.8.1.jar:?]
2> at com.carrotsearch.randomizedtesting.rules.SystemPropertiesRestoreRule$1.evaluate(SystemPropertiesRestoreRule.java:80) [randomizedtesting-runner-2.8.1.jar:?]
2> at org.junit.rules.RunRules.evaluate(RunRules.java:20) [junit-4.13.2.jar:4.13.2]
2> at org.apache.lucene.tests.util.TestRuleSetupTeardownChained$1.evaluate(TestRuleSetupTeardownChained.java:48) [lucene-test-framework-9.7.0.jar:9.7.0 ccf4b198ec328095d45d2746189dc8ca633e8bcf - 2023-06-21 11:48:16]
2> at org.apache.lucene.tests.util.AbstractBeforeAfterRule$1.evaluate(AbstractBeforeAfterRule.java:43) [lucene-test-framework-9.7.0.jar:9.7.0 ccf4b198ec328095d45d2746189dc8ca633e8bcf - 2023-06-21 11:48:16]
2> at org.apache.lucene.tests.util.TestRuleThreadAndTestName$1.evaluate(TestRuleThreadAndTestName.java:45) [lucene-test-framework-9.7.0.jar:9.7.0 ccf4b198ec328095d45d2746189dc8ca633e8bcf - 2023-06-21 11:48:16]
2> at org.apache.lucene.tests.util.TestRuleIgnoreAfterMaxFailures$1.evaluate(TestRuleIgnoreAfterMaxFailures.java:60) [lucene-test-framework-9.7.0.jar:9.7.0 ccf4b198ec328095d45d2746189dc8ca633e8bcf - 2023-06-21 11:48:16]
2> at org.apache.lucene.tests.util.TestRuleMarkFailure$1.evaluate(TestRuleMarkFailure.java:44) [lucene-test-framework-9.7.0.jar:9.7.0 ccf4b198ec328095d45d2746189dc8ca633e8bcf - 2023-06-21 11:48:16]
2> at org.junit.rules.RunRules.evaluate(RunRules.java:20) [junit-4.13.2.jar:4.13.2]
2> at com.carrotsearch.randomizedtesting.rules.StatementAdapter.evaluate(StatementAdapter.java:36) [randomizedtesting-runner-2.8.1.jar:?]
2> at com.carrotsearch.randomizedtesting.ThreadLeakControl$StatementRunner.run(ThreadLeakControl.java:390) [randomizedtesting-runner-2.8.1.jar:?]
2> at com.carrotsearch.randomizedtesting.ThreadLeakControl.forkTimeoutingTask(ThreadLeakControl.java:843) [randomizedtesting-runner-2.8.1.jar:?]
2> at com.carrotsearch.randomizedtesting.ThreadLeakControl$3.evaluate(ThreadLeakControl.java:490) [randomizedtesting-runner-2.8.1.jar:?]
2> at com.carrotsearch.randomizedtesting.RandomizedRunner.runSingleTest(RandomizedRunner.java:955) [randomizedtesting-runner-2.8.1.jar:?]
2> at com.carrotsearch.randomizedtesting.RandomizedRunner$5.evaluate(RandomizedRunner.java:840) [randomizedtesting-runner-2.8.1.jar:?]
2> at com.carrotsearch.randomizedtesting.RandomizedRunner$6.evaluate(RandomizedRunner.java:891) [randomizedtesting-runner-2.8.1.jar:?]
2> at com.carrotsearch.randomizedtesting.RandomizedRunner$7.evaluate(RandomizedRunner.java:902) [randomizedtesting-runner-2.8.1.jar:?]
2> at com.carrotsearch.randomizedtesting.rules.StatementAdapter.evaluate(StatementAdapter.java:36) [randomizedtesting-runner-2.8.1.jar:?]
2> at com.carrotsearch.randomizedtesting.rules.StatementAdapter.evaluate(StatementAdapter.java:36) [randomizedtesting-runner-2.8.1.jar:?]
2> at org.apache.lucene.tests.util.AbstractBeforeAfterRule$1.evaluate(AbstractBeforeAfterRule.java:43) [lucene-test-framework-9.7.0.jar:9.7.0 ccf4b198ec328095d45d2746189dc8ca633e8bcf - 2023-06-21 11:48:16]
2> at com.carrotsearch.randomizedtesting.rules.SystemPropertiesRestoreRule$1.evaluate(SystemPropertiesRestoreRule.java:80) [randomizedtesting-runner-2.8.1.jar:?]
2> at org.junit.rules.RunRules.evaluate(RunRules.java:20) [junit-4.13.2.jar:4.13.2]
2> at org.apache.lucene.tests.util.AbstractBeforeAfterRule$1.evaluate(AbstractBeforeAfterRule.java:43) [lucene-test-framework-9.7.0.jar:9.7.0 ccf4b198ec328095d45d2746189dc8ca633e8bcf - 2023-06-21 11:48:16]
2> at com.carrotsearch.randomizedtesting.rules.StatementAdapter.evaluate(StatementAdapter.java:36) [randomizedtesting-runner-2.8.1.jar:?]
2> at org.apache.lucene.tests.util.TestRuleStoreClassName$1.evaluate(TestRuleStoreClassName.java:38) [lucene-test-framework-9.7.0.jar:9.7.0 ccf4b198ec328095d45d2746189dc8ca633e8bcf - 2023-06-21 11:48:16]
2> at com.carrotsearch.randomizedtesting.rules.NoShadowingOrOverridesOnMethodsRule$1.evaluate(NoShadowingOrOverridesOnMethodsRule.java:40) [randomizedtesting-runner-2.8.1.jar:?]
2> at com.carrotsearch.randomizedtesting.rules.NoShadowingOrOverridesOnMethodsRule$1.evaluate(NoShadowingOrOverridesOnMethodsRule.java:40) [randomizedtesting-runner-2.8.1.jar:?]
2> at com.carrotsearch.randomizedtesting.rules.StatementAdapter.evaluate(StatementAdapter.java:36) [randomizedtesting-runner-2.8.1.jar:?]
2> at com.carrotsearch.randomizedtesting.rules.StatementAdapter.evaluate(StatementAdapter.java:36) [randomizedtesting-runner-2.8.1.jar:?]
2> at org.apache.lucene.tests.util.TestRuleAssertionsRequired$1.evaluate(TestRuleAssertionsRequired.java:53) [lucene-test-framework-9.7.0.jar:9.7.0 ccf4b198ec328095d45d2746189dc8ca633e8bcf - 2023-06-21 11:48:16]
2> at org.apache.lucene.tests.util.AbstractBeforeAfterRule$1.evaluate(AbstractBeforeAfterRule.java:43) [lucene-test-framework-9.7.0.jar:9.7.0 ccf4b198ec328095d45d2746189dc8ca633e8bcf - 2023-06-21 11:48:16]
2> at org.apache.lucene.tests.util.TestRuleMarkFailure$1.evaluate(TestRuleMarkFailure.java:44) [lucene-test-framework-9.7.0.jar:9.7.0 ccf4b198ec328095d45d2746189dc8ca633e8bcf - 2023-06-21 11:48:16]
2> at org.apache.lucene.tests.util.TestRuleIgnoreAfterMaxFailures$1.evaluate(TestRuleIgnoreAfterMaxFailures.java:60) [lucene-test-framework-9.7.0.jar:9.7.0 ccf4b198ec328095d45d2746189dc8ca633e8bcf - 2023-06-21 11:48:16]
2> at org.apache.lucene.tests.util.TestRuleIgnoreTestSuites$1.evaluate(TestRuleIgnoreTestSuites.java:47) [lucene-test-framework-9.7.0.jar:9.7.0 ccf4b198ec328095d45d2746189dc8ca633e8bcf - 2023-06-21 11:48:16]
2> at org.junit.rules.RunRules.evaluate(RunRules.java:20) [junit-4.13.2.jar:4.13.2]
2> at com.carrotsearch.randomizedtesting.rules.StatementAdapter.evaluate(StatementAdapter.java:36) [randomizedtesting-runner-2.8.1.jar:?]
2> at com.carrotsearch.randomizedtesting.ThreadLeakControl$StatementRunner.run(ThreadLeakControl.java:390) [randomizedtesting-runner-2.8.1.jar:?]
2> at com.carrotsearch.randomizedtesting.ThreadLeakControl.lambda$forkTimeoutingTask$0(ThreadLeakControl.java:850) [randomizedtesting-runner-2.8.1.jar:?]
2> at java.lang.Thread.run(Thread.java:829) [?:?]
2> Caused by: org.apache.solr.common.SolrException: Error while creating field 'vector{type=knn_vector,properties=indexed,stored}' from value '5.4'
2> at org.apache.solr.schema.DenseVectorField.createFields(DenseVectorField.java:246) ~[main/:?]
2> at org.apache.solr.update.DocumentBuilder.addField(DocumentBuilder.java:67) ~[main/:?]
2> at org.apache.solr.update.DocumentBuilder.addOriginalField(DocumentBuilder.java:304) ~[main/:?]
2> at org.apache.solr.update.DocumentBuilder.toDocument(DocumentBuilder.java:193) ~[main/:?]
2> ... 70 more
2> Caused by: org.apache.solr.common.SolrException: incorrect vector format. The expected format is:'[f1,f2..f3]' where each element f is a float
2> at org.apache.solr.util.vector.DenseVectorParser.parseIndexVector(DenseVectorParser.java:56) ~[main/:?]
2> at org.apache.solr.util.vector.DenseVectorParser.parseVector(DenseVectorParser.java:45) ~[main/:?]
2> at org.apache.solr.util.vector.FloatDenseVectorParser.getFloatVector(FloatDenseVectorParser.java:34) ~[main/:?]
2> at org.apache.solr.schema.DenseVectorField.createField(DenseVectorField.java:265) ~[main/:?]
2> at org.apache.solr.schema.DenseVectorField.createFields(DenseVectorField.java:229) ~[main/:?]
2> at org.apache.solr.update.DocumentBuilder.addField(DocumentBuilder.java:67) ~[main/:?]
2> at org.apache.solr.update.DocumentBuilder.addOriginalField(DocumentBuilder.java:304) ~[main/:?]
2> at org.apache.solr.update.DocumentBuilder.toDocument(DocumentBuilder.java:193) ~[main/:?]
2> ... 70 more
2> 838845 INFO (TEST-DenseVectorFieldTest.indexing_notAVectorValue_shouldThrowException-seed#[F404980FDB6AE07A]) [ x:collection1] o.a.s.u.p.LogUpdateProcessorFactory webapp=null path=null params={}{} 0 0
2> 838845 ERROR (TEST-DenseVectorFieldTest.indexing_notAVectorValue_shouldThrowException-seed#[F404980FDB6AE07A]) [ x:collection1] o.a.s.h.RequestHandlerBase Server exception
2> => org.apache.solr.common.SolrException: ERROR: [doc=0] Error adding field 'vector'='string' msg=Error while creating field 'vector{type=knn_vector,properties=indexed,stored}' from value 'string'
2> at org.apache.solr.update.DocumentBuilder.toDocument(DocumentBuilder.java:248)
2> org.apache.solr.common.SolrException: ERROR: [doc=0] Error adding field 'vector'='string' msg=Error while creating field 'vector{type=knn_vector,properties=indexed,stored}' from value 'string'
2> at org.apache.solr.update.DocumentBuilder.toDocument(DocumentBuilder.java:248) ~[main/:?]
2> at org.apache.solr.update.AddUpdateCommand.makeLuceneDocs(AddUpdateCommand.java:213) ~[main/:?]
2> at org.apache.solr.update.DirectUpdateHandler2.updateDocOrDocValues(DirectUpdateHandler2.java:1057) ~[main/:?]
2> at org.apache.solr.update.DirectUpdateHandler2.doNormalUpdate(DirectUpdateHandler2.java:421) ~[main/:?]
2> at org.apache.solr.update.DirectUpdateHandler2.addDoc0(DirectUpdateHandler2.java:374) ~[main/:?]
2> at org.apache.solr.update.DirectUpdateHandler2.addDoc(DirectUpdateHandler2.java:311) ~[main/:?]
2> at org.apache.solr.update.processor.RunUpdateProcessorFactory$RunUpdateProcessor.processAdd(RunUpdateProcessorFactory.java:76) ~[main/:?]
2> at org.apache.solr.update.processor.UpdateRequestProcessor.processAdd(UpdateRequestProcessor.java:54) ~[main/:?]
2> at org.apache.solr.update.processor.DistributedUpdateProcessor.versionAdd(DistributedUpdateProcessor.java:301) ~[main/:?]
2> at org.apache.solr.update.processor.DistributedUpdateProcessor.processAdd(DistributedUpdateProcessor.java:234) ~[main/:?]
2> at org.apache.solr.update.processor.LogUpdateProcessorFactory$LogUpdateProcessor.processAdd(LogUpdateProcessorFactory.java:111) ~[main/:?]
2> at org.apache.solr.handler.loader.XMLLoader.processUpdate(XMLLoader.java:189) ~[main/:?]
2> at org.apache.solr.handler.loader.XMLLoader.load(XMLLoader.java:120) ~[main/:?]
2> at org.apache.solr.handler.UpdateRequestHandler$1.load(UpdateRequestHandler.java:102) ~[main/:?]
2> at org.apache.solr.handler.ContentStreamHandlerBase.handleRequestBody(ContentStreamHandlerBase.java:84) ~[main/:?]
2> at org.apache.solr.handler.RequestHandlerBase.handleRequest(RequestHandlerBase.java:224) [main/:?]
2> at org.apache.solr.core.SolrCore.execute(SolrCore.java:2893) [main/:?]
2> at org.apache.solr.servlet.DirectSolrConnection.request(DirectSolrConnection.java:113) [main/:?]
2> at org.apache.solr.util.TestHarness.update(TestHarness.java:295) [solr-test-framework-10.0.0-SNAPSHOT.jar:10.0.0-SNAPSHOT d713595bb70bb654c9e9f0cb13f9e40890d4891b [snapshot build, details omitted]]
2> at org.apache.solr.util.BaseTestHarness.checkUpdateStatus(BaseTestHarness.java:270) [solr-test-framework-10.0.0-SNAPSHOT.jar:10.0.0-SNAPSHOT d713595bb70bb654c9e9f0cb13f9e40890d4891b [snapshot build, details omitted]]
2> at org.apache.solr.util.BaseTestHarness.validateErrorUpdate(BaseTestHarness.java:252) [solr-test-framework-10.0.0-SNAPSHOT.jar:10.0.0-SNAPSHOT d713595bb70bb654c9e9f0cb13f9e40890d4891b [snapshot build, details omitted]]
2> at org.apache.solr.SolrTestCaseJ4.checkUpdateU(SolrTestCaseJ4.java:972) [solr-test-framework-10.0.0-SNAPSHOT.jar:?]
2> at org.apache.solr.SolrTestCaseJ4.assertFailedU(SolrTestCaseJ4.java:961) [solr-test-framework-10.0.0-SNAPSHOT.jar:?]
2> at org.apache.solr.SolrTestCaseJ4.assertFailedU(SolrTestCaseJ4.java:956) [solr-test-framework-10.0.0-SNAPSHOT.jar:?]
2> at org.apache.solr.schema.DenseVectorFieldTest.indexing_notAVectorValue_shouldThrowException(DenseVectorFieldTest.java:419) [test/:?]
2> at jdk.internal.reflect.NativeMethodAccessorImpl.invoke0(Native Method) ~[?:?]
2> at jdk.internal.reflect.NativeMethodAccessorImpl.invoke(NativeMethodAccessorImpl.java:62) ~[?:?]
2> at jdk.internal.reflect.DelegatingMethodAccessorImpl.invoke(DelegatingMethodAccessorImpl.java:43) ~[?:?]
2> at java.lang.reflect.Method.invoke(Method.java:566) ~[?:?]
2> at com.carrotsearch.randomizedtesting.RandomizedRunner.invoke(RandomizedRunner.java:1758) [randomizedtesting-runner-2.8.1.jar:?]
2> at com.carrotsearch.randomizedtesting.RandomizedRunner$8.evaluate(RandomizedRunner.java:946) [randomizedtesting-runner-2.8.1.jar:?]
2> at com.carrotsearch.randomizedtesting.RandomizedRunner$9.evaluate(RandomizedRunner.java:982) [randomizedtesting-runner-2.8.1.jar:?]
2> at com.carrotsearch.randomizedtesting.RandomizedRunner$10.evaluate(RandomizedRunner.java:996) [randomizedtesting-runner-2.8.1.jar:?]
2> at com.carrotsearch.randomizedtesting.rules.SystemPropertiesRestoreRule$1.evaluate(SystemPropertiesRestoreRule.java:80) [randomizedtesting-runner-2.8.1.jar:?]
2> at org.junit.rules.RunRules.evaluate(RunRules.java:20) [junit-4.13.2.jar:4.13.2]
2> at org.apache.lucene.tests.util.TestRuleSetupTeardownChained$1.evaluate(TestRuleSetupTeardownChained.java:48) [lucene-test-framework-9.7.0.jar:9.7.0 ccf4b198ec328095d45d2746189dc8ca633e8bcf - 2023-06-21 11:48:16]
2> at org.apache.lucene.tests.util.AbstractBeforeAfterRule$1.evaluate(AbstractBeforeAfterRule.java:43) [lucene-test-framework-9.7.0.jar:9.7.0 ccf4b198ec328095d45d2746189dc8ca633e8bcf - 2023-06-21 11:48:16]
2> at org.apache.lucene.tests.util.TestRuleThreadAndTestName$1.evaluate(TestRuleThreadAndTestName.java:45) [lucene-test-framework-9.7.0.jar:9.7.0 ccf4b198ec328095d45d2746189dc8ca633e8bcf - 2023-06-21 11:48:16]
2> at org.apache.lucene.tests.util.TestRuleIgnoreAfterMaxFailures$1.evaluate(TestRuleIgnoreAfterMaxFailures.java:60) [lucene-test-framework-9.7.0.jar:9.7.0 ccf4b198ec328095d45d2746189dc8ca633e8bcf - 2023-06-21 11:48:16]
2> at org.apache.lucene.tests.util.TestRuleMarkFailure$1.evaluate(TestRuleMarkFailure.java:44) [lucene-test-framework-9.7.0.jar:9.7.0 ccf4b198ec328095d45d2746189dc8ca633e8bcf - 2023-06-21 11:48:16]
2> at org.junit.rules.RunRules.evaluate(RunRules.java:20) [junit-4.13.2.jar:4.13.2]
2> at com.carrotsearch.randomizedtesting.rules.StatementAdapter.evaluate(StatementAdapter.java:36) [randomizedtesting-runner-2.8.1.jar:?]
2> at com.carrotsearch.randomizedtesting.ThreadLeakControl$StatementRunner.run(ThreadLeakControl.java:390) [randomizedtesting-runner-2.8.1.jar:?]
2> at com.carrotsearch.randomizedtesting.ThreadLeakControl.forkTimeoutingTask(ThreadLeakControl.java:843) [randomizedtesting-runner-2.8.1.jar:?]
2> at com.carrotsearch.randomizedtesting.ThreadLeakControl$3.evaluate(ThreadLeakControl.java:490) [randomizedtesting-runner-2.8.1.jar:?]
2> at com.carrotsearch.randomizedtesting.RandomizedRunner.runSingleTest(RandomizedRunner.java:955) [randomizedtesting-runner-2.8.1.jar:?]
2> at com.carrotsearch.randomizedtesting.RandomizedRunner$5.evaluate(RandomizedRunner.java:840) [randomizedtesting-runner-2.8.1.jar:?]
2> at com.carrotsearch.randomizedtesting.RandomizedRunner$6.evaluate(RandomizedRunner.java:891) [randomizedtesting-runner-2.8.1.jar:?]
2> at com.carrotsearch.randomizedtesting.RandomizedRunner$7.evaluate(RandomizedRunner.java:902) [randomizedtesting-runner-2.8.1.jar:?]
2> at com.carrotsearch.randomizedtesting.rules.StatementAdapter.evaluate(StatementAdapter.java:36) [randomizedtesting-runner-2.8.1.jar:?]
2> at com.carrotsearch.randomizedtesting.rules.StatementAdapter.evaluate(StatementAdapter.java:36) [randomizedtesting-runner-2.8.1.jar:?]
2> at org.apache.lucene.tests.util.AbstractBeforeAfterRule$1.evaluate(AbstractBeforeAfterRule.java:43) [lucene-test-framework-9.7.0.jar:9.7.0 ccf4b198ec328095d45d2746189dc8ca633e8bcf - 2023-06-21 11:48:16]
2> at com.carrotsearch.randomizedtesting.rules.SystemPropertiesRestoreRule$1.evaluate(SystemPropertiesRestoreRule.java:80) [randomizedtesting-runner-2.8.1.jar:?]
2> at org.junit.rules.RunRules.evaluate(RunRules.java:20) [junit-4.13.2.jar:4.13.2]
2> at org.apache.lucene.tests.util.AbstractBeforeAfterRule$1.evaluate(AbstractBeforeAfterRule.java:43) [lucene-test-framework-9.7.0.jar:9.7.0 ccf4b198ec328095d45d2746189dc8ca633e8bcf - 2023-06-21 11:48:16]
2> at com.carrotsearch.randomizedtesting.rules.StatementAdapter.evaluate(StatementAdapter.java:36) [randomizedtesting-runner-2.8.1.jar:?]
2> at org.apache.lucene.tests.util.TestRuleStoreClassName$1.evaluate(TestRuleStoreClassName.java:38) [lucene-test-framework-9.7.0.jar:9.7.0 ccf4b198ec328095d45d2746189dc8ca633e8bcf - 2023-06-21 11:48:16]
2> at com.carrotsearch.randomizedtesting.rules.NoShadowingOrOverridesOnMethodsRule$1.evaluate(NoShadowingOrOverridesOnMethodsRule.java:40) [randomizedtesting-runner-2.8.1.jar:?]
2> at com.carrotsearch.randomizedtesting.rules.NoShadowingOrOverridesOnMethodsRule$1.evaluate(NoShadowingOrOverridesOnMethodsRule.java:40) [randomizedtesting-runner-2.8.1.jar:?]
2> at com.carrotsearch.randomizedtesting.rules.StatementAdapter.evaluate(StatementAdapter.java:36) [randomizedtesting-runner-2.8.1.jar:?]
2> at com.carrotsearch.randomizedtesting.rules.StatementAdapter.evaluate(StatementAdapter.java:36) [randomizedtesting-runner-2.8.1.jar:?]
2> at org.apache.lucene.tests.util.TestRuleAssertionsRequired$1.evaluate(TestRuleAssertionsRequired.java:53) [lucene-test-framework-9.7.0.jar:9.7.0 ccf4b198ec328095d45d2746189dc8ca633e8bcf - 2023-06-21 11:48:16]
2> at org.apache.lucene.tests.util.AbstractBeforeAfterRule$1.evaluate(AbstractBeforeAfterRule.java:43) [lucene-test-framework-9.7.0.jar:9.7.0 ccf4b198ec328095d45d2746189dc8ca633e8bcf - 2023-06-21 11:48:16]
2> at org.apache.lucene.tests.util.TestRuleMarkFailure$1.evaluate(TestRuleMarkFailure.java:44) [lucene-test-framework-9.7.0.jar:9.7.0 ccf4b198ec328095d45d2746189dc8ca633e8bcf - 2023-06-21 11:48:16]
2> at org.apache.lucene.tests.util.TestRuleIgnoreAfterMaxFailures$1.evaluate(TestRuleIgnoreAfterMaxFailures.java:60) [lucene-test-framework-9.7.0.jar:9.7.0 ccf4b198ec328095d45d2746189dc8ca633e8bcf - 2023-06-21 11:48:16]
2> at org.apache.lucene.tests.util.TestRuleIgnoreTestSuites$1.evaluate(TestRuleIgnoreTestSuites.java:47) [lucene-test-framework-9.7.0.jar:9.7.0 ccf4b198ec328095d45d2746189dc8ca633e8bcf - 2023-06-21 11:48:16]
2> at org.junit.rules.RunRules.evaluate(RunRules.java:20) [junit-4.13.2.jar:4.13.2]
2> at com.carrotsearch.randomizedtesting.rules.StatementAdapter.evaluate(StatementAdapter.java:36) [randomizedtesting-runner-2.8.1.jar:?]
2> at com.carrotsearch.randomizedtesting.ThreadLeakControl$StatementRunner.run(ThreadLeakControl.java:390) [randomizedtesting-runner-2.8.1.jar:?]
2> at com.carrotsearch.randomizedtesting.ThreadLeakControl.lambda$forkTimeoutingTask$0(ThreadLeakControl.java:850) [randomizedtesting-runner-2.8.1.jar:?]
2> at java.lang.Thread.run(Thread.java:829) [?:?]
2> Caused by: org.apache.solr.common.SolrException: Error while creating field 'vector{type=knn_vector,properties=indexed,stored}' from value 'string'
2> at org.apache.solr.schema.DenseVectorField.createFields(DenseVectorField.java:246) ~[main/:?]
2> at org.apache.solr.update.DocumentBuilder.addField(DocumentBuilder.java:67) ~[main/:?]
2> at org.apache.solr.update.DocumentBuilder.addOriginalField(DocumentBuilder.java:304) ~[main/:?]
2> at org.apache.solr.update.DocumentBuilder.toDocument(DocumentBuilder.java:193) ~[main/:?]
2> ... 70 more
2> Caused by: org.apache.solr.common.SolrException: incorrect vector format. The expected format is:'[f1,f2..f3]' where each element f is a float
2> at org.apache.solr.util.vector.DenseVectorParser.parseIndexVector(DenseVectorParser.java:56) ~[main/:?]
2> at org.apache.solr.util.vector.DenseVectorParser.parseVector(DenseVectorParser.java:45) ~[main/:?]
2> at org.apache.solr.util.vector.FloatDenseVectorParser.getFloatVector(FloatDenseVectorParser.java:34) ~[main/:?]
2> at org.apache.solr.schema.DenseVectorField.createField(DenseVectorField.java:265) ~[main/:?]
2> at org.apache.solr.schema.DenseVectorField.createFields(DenseVectorField.java:229) ~[main/:?]
2> at org.apache.solr.update.DocumentBuilder.addField(DocumentBuilder.java:67) ~[main/:?]
2> at org.apache.solr.update.DocumentBuilder.addOriginalField(DocumentBuilder.java:304) ~[main/:?]
2> at org.apache.solr.update.DocumentBuilder.toDocument(DocumentBuilder.java:193) ~[main/:?]
2> ... 70 more
2> 838847 INFO (TEST-DenseVectorFieldTest.indexing_notAVectorValue_shouldThrowException-seed#[F404980FDB6AE07A]) [] o.a.s.SolrTestCaseJ4 ###deleteCore
2> 838847 INFO (TEST-DenseVectorFieldTest.indexing_notAVectorValue_shouldThrowException-seed#[F404980FDB6AE07A]) [] o.a.s.c.CoreContainer Shutting down CoreContainer instance=1596361912
2> 838847 INFO (coreCloseExecutor-10786-thread-1) [ x:collection1] o.a.s.c.SolrCore CLOSING SolrCore org.apache.solr.core.SolrCore@2b3353e7 collection1
2> 838847 INFO (coreCloseExecutor-10786-thread-1) [ x:collection1] o.a.s.m.SolrMetricManager Closing metric reporters for registry=solr.core.collection1 tag=SolrCore@2b3353e7
2> 838856 INFO (coreCloseExecutor-10786-thread-1) [ x:collection1] o.a.s.u.DirectUpdateHandler2 Committing on IndexWriter.close() ... SKIPPED (unnecessary).
2> 838856 INFO (TEST-DenseVectorFieldTest.indexing_notAVectorValue_shouldThrowException-seed#[F404980FDB6AE07A]) [] o.a.s.m.SolrMetricManager Closing metric reporters for registry=solr.node tag=null
2> 838862 INFO (TEST-DenseVectorFieldTest.indexing_notAVectorValue_shouldThrowException-seed#[F404980FDB6AE07A]) [] o.a.s.m.SolrMetricManager Closing metric reporters for registry=solr.jvm tag=null
2> 838864 INFO (TEST-DenseVectorFieldTest.indexing_notAVectorValue_shouldThrowException-seed#[F404980FDB6AE07A]) [] o.a.s.m.SolrMetricManager Closing metric reporters for registry=solr.jetty tag=null
2> 838866 INFO (TEST-DenseVectorFieldTest.indexing_notAVectorValue_shouldThrowException-seed#[F404980FDB6AE07A]) [] o.a.s.SolrTestCaseJ4 ###Ending indexing_notAVectorValue_shouldThrowException
2> 838870 INFO (TEST-DenseVectorFieldTest.denseVectorFieldOnAtomicUpdate_shouldBeUpdatedCorrectly-seed#[F404980FDB6AE07A]) [] o.a.s.SolrTestCaseJ4 ###Starting denseVectorFieldOnAtomicUpdate_shouldBeUpdatedCorrectly
2> 838870 INFO (TEST-DenseVectorFieldTest.denseVectorFieldOnAtomicUpdate_shouldBeUpdatedCorrectly-seed#[F404980FDB6AE07A]) [] o.a.s.SolrTestCaseJ4 ####initCore
2> 838873 INFO (TEST-DenseVectorFieldTest.denseVectorFieldOnAtomicUpdate_shouldBeUpdatedCorrectly-seed#[F404980FDB6AE07A]) [] o.a.s.c.SolrResourceLoader Added 2 libs to classloader, from paths: [/home/jenkins/jenkins-slave/workspace/Solr/Solr-Check-main/solr/core/build/resources/test/solr/collection1/lib, /home/jenkins/jenkins-slave/workspace/Solr/Solr-Check-main/solr/core/build/resources/test/solr/collection1/lib/classes]
2> 838883 INFO (TEST-DenseVectorFieldTest.denseVectorFieldOnAtomicUpdate_shouldBeUpdatedCorrectly-seed#[F404980FDB6AE07A]) [] o.a.s.c.SolrConfig Using Lucene MatchVersion: 9.7.0
2> 838884 WARN (TEST-DenseVectorFieldTest.denseVectorFieldOnAtomicUpdate_shouldBeUpdatedCorrectly-seed#[F404980FDB6AE07A]) [] o.a.s.c.SolrConfig solrconfig.xml: <boolTofilterOptimizer> is currently not implemented and has no effect.
2> 838884 INFO (TEST-DenseVectorFieldTest.denseVectorFieldOnAtomicUpdate_shouldBeUpdatedCorrectly-seed#[F404980FDB6AE07A]) [] o.a.s.SolrTestCaseJ4 Created dataDir: /home/jenkins/jenkins-slave/workspace/Solr/Solr-Check-main/solr/core/build/tmp/tests-tmp/solr.schema.DenseVectorFieldTest_F404980FDB6AE07A-001/data-dir-151-001
2> 838885 INFO (TEST-DenseVectorFieldTest.denseVectorFieldOnAtomicUpdate_shouldBeUpdatedCorrectly-seed#[F404980FDB6AE07A]) [] o.a.s.s.IndexSchema Schema name=schema-densevector
2> 838885 WARN (TEST-DenseVectorFieldTest.denseVectorFieldOnAtomicUpdate_shouldBeUpdatedCorrectly-seed#[F404980FDB6AE07A]) [] o.a.s.s.DenseVectorField The vector dimension 2048 specified for field 2048_byte_vector exceeds the current Lucene default max dimension of 1024. It's un-tested territory, extra caution and benchmarks are recommended for production systems.
2> 838885 WARN (TEST-DenseVectorFieldTest.denseVectorFieldOnAtomicUpdate_shouldBeUpdatedCorrectly-seed#[F404980FDB6AE07A]) [] o.a.s.s.DenseVectorField The vector dimension 2048 specified for field 2048_float_vector exceeds the current Lucene default max dimension of 1024. It's un-tested territory, extra caution and benchmarks are recommended for production systems.
2> 838885 INFO (TEST-DenseVectorFieldTest.denseVectorFieldOnAtomicUpdate_shouldBeUpdatedCorrectly-seed#[F404980FDB6AE07A]) [] o.a.s.s.IndexSchema Loaded schema schema-densevector/1.0 with uniqueid field id
2> 839809 WARN (TEST-DenseVectorFieldTest.denseVectorFieldOnAtomicUpdate_shouldBeUpdatedCorrectly-seed#[F404980FDB6AE07A]) [] o.a.s.c.CoreContainer Not all security plugins configured! authentication=disabled authorization=disabled. Solr is only as secure as you make it. Consider configuring authentication/authorization before exposing Solr to users internal or external. See https://s.apache.org/solrsecurity for more info
2> 839832 INFO (coreLoadExecutor-10796-thread-1) [ x:collection1] o.a.s.c.SolrResourceLoader Added 2 libs to classloader, from paths: [/home/jenkins/jenkins-slave/workspace/Solr/Solr-Check-main/solr/core/build/resources/test/solr/collection1/lib, /home/jenkins/jenkins-slave/workspace/Solr/Solr-Check-main/solr/core/build/resources/test/solr/collection1/lib/classes]
2> 839844 INFO (coreLoadExecutor-10796-thread-1) [ x:collection1] o.a.s.c.SolrConfig Using Lucene MatchVersion: 9.7.0
2> 839845 WARN (coreLoadExecutor-10796-thread-1) [ x:collection1] o.a.s.c.SolrConfig solrconfig.xml: <boolTofilterOptimizer> is currently not implemented and has no effect.
2> 839846 INFO (coreLoadExecutor-10796-thread-1) [ x:collection1] o.a.s.s.IndexSchema Schema name=schema-densevector
2> 839846 WARN (coreLoadExecutor-10796-thread-1) [ x:collection1] o.a.s.s.DenseVectorField The vector dimension 2048 specified for field 2048_byte_vector exceeds the current Lucene default max dimension of 1024. It's un-tested territory, extra caution and benchmarks are recommended for production systems.
2> 839846 WARN (coreLoadExecutor-10796-thread-1) [ x:collection1] o.a.s.s.DenseVectorField The vector dimension 2048 specified for field 2048_float_vector exceeds the current Lucene default max dimension of 1024. It's un-tested territory, extra caution and benchmarks are recommended for production systems.
2> 839847 INFO (coreLoadExecutor-10796-thread-1) [ x:collection1] o.a.s.s.IndexSchema Loaded schema schema-densevector/1.0 with uniqueid field id
2> 839848 INFO (coreLoadExecutor-10796-thread-1) [ x:collection1] o.a.s.c.CoreContainer Creating SolrCore 'collection1' using configuration from instancedir /home/jenkins/jenkins-slave/workspace/Solr/Solr-Check-main/solr/core/build/resources/test/solr/collection1, trusted=true
2> 839848 INFO (coreLoadExecutor-10796-thread-1) [ x:collection1] o.a.s.c.SolrCore Opening new SolrCore at [/home/jenkins/jenkins-slave/workspace/Solr/Solr-Check-main/solr/core/build/resources/test/solr/collection1], dataDir=[/home/jenkins/jenkins-slave/workspace/Solr/Solr-Check-main/solr/core/build/tmp/tests-tmp/solr.schema.DenseVectorFieldTest_F404980FDB6AE07A-001/data-dir-151-001/]
2> 839849 INFO (coreLoadExecutor-10796-thread-1) [ x:collection1] o.a.s.u.RandomMergePolicy RandomMergePolicy wrapping class org.apache.lucene.index.LogByteSizeMergePolicy: [LogByteSizeMergePolicy: minMergeSize=1677721, mergeFactor=40, maxMergeSize=2147483648, maxMergeSizeForForcedMerge=9223372036854775807, calibrateSizeByDeletes=false, maxMergeDocs=2147483647, maxCFSSegmentSizeMB=8.796093022208E12, noCFSRatio=0.0]
2> 839878 INFO (coreLoadExecutor-10796-thread-1) [ x:collection1] o.a.s.j.SolrRequestAuthorizer Creating a new SolrRequestAuthorizer
2> 839882 INFO (coreLoadExecutor-10796-thread-1) [ x:collection1] o.a.s.u.CommitTracker Hard AutoCommit: disabled
2> 839882 INFO (coreLoadExecutor-10796-thread-1) [ x:collection1] o.a.s.u.CommitTracker Soft AutoCommit: disabled
2> 839882 INFO (coreLoadExecutor-10796-thread-1) [ x:collection1] o.a.s.u.RandomMergePolicy RandomMergePolicy wrapping class org.apache.lucene.index.TieredMergePolicy: [TieredMergePolicy: maxMergeAtOnce=26, maxMergedSegmentMB=40.57908630371094, floorSegmentMB=1.9960556030273438, forceMergeDeletesPctAllowed=2.8236748783044394, segmentsPerTier=26.0, maxCFSSegmentSizeMB=8.796093022208E12, noCFSRatio=1.0, deletesPctAllowed=29.233385841956945
2> 839895 INFO (coreLoadExecutor-10796-thread-1) [ x:collection1] o.a.s.s.DirectSolrSpellChecker init: {minQueryLength=3, name=direct, classname=DirectSolrSpellChecker, field=lowerfilt}
2> 839895 INFO (coreLoadExecutor-10796-thread-1) [ x:collection1] o.a.s.s.DirectSolrSpellChecker init: {minQueryLength=3, maxQueryFrequency=2, name=directMQF2, classname=DirectSolrSpellChecker, field=lowerfilt}
2> 839953 INFO (coreLoadExecutor-10796-thread-1) [ x:collection1] o.a.s.h.ReplicationHandler Commits will be reserved for 10000 ms
2> 839954 INFO (searcherExecutor-10798-thread-1-processing-collection1) [ x:collection1] o.a.s.h.c.SpellCheckComponent Loading spell index for spellchecker: default
2> 839954 INFO (searcherExecutor-10798-thread-1-processing-collection1) [ x:collection1] o.a.s.h.c.SpellCheckComponent Loading spell index for spellchecker: direct
2> 839954 INFO (searcherExecutor-10798-thread-1-processing-collection1) [ x:collection1] o.a.s.h.c.SpellCheckComponent Loading spell index for spellchecker: directMQF2
2> 839954 INFO (searcherExecutor-10798-thread-1-processing-collection1) [ x:collection1] o.a.s.h.c.SpellCheckComponent Loading spell index for spellchecker: wordbreak
2> 839954 INFO (searcherExecutor-10798-thread-1-processing-collection1) [ x:collection1] o.a.s.h.c.SpellCheckComponent Loading spell index for spellchecker: multipleFields
2> 839954 INFO (searcherExecutor-10798-thread-1-processing-collection1) [ x:collection1] o.a.s.h.c.SpellCheckComponent Loading spell index for spellchecker: jarowinkler
2> 839954 INFO (searcherExecutor-10798-thread-1-processing-collection1) [ x:collection1] o.a.s.h.c.SpellCheckComponent Loading spell index for spellchecker: external
2> 839955 INFO (searcherExecutor-10798-thread-1-processing-collection1) [ x:collection1] o.a.s.h.c.SpellCheckComponent Loading spell index for spellchecker: freq
2> 839955 INFO (searcherExecutor-10798-thread-1-processing-collection1) [ x:collection1] o.a.s.h.c.SpellCheckComponent Loading spell index for spellchecker: fqcn
2> 839955 INFO (searcherExecutor-10798-thread-1-processing-collection1) [ x:collection1] o.a.s.h.c.SpellCheckComponent Loading spell index for spellchecker: perDict
2> 839956 INFO (searcherExecutor-10798-thread-1-processing-collection1) [ x:collection1] o.a.s.c.SolrCore Registered new searcher autowarm time: 0 ms
2> 839975 INFO (TEST-DenseVectorFieldTest.denseVectorFieldOnAtomicUpdate_shouldBeUpdatedCorrectly-seed#[F404980FDB6AE07A]) [] o.a.s.j.SolrRequestAuthorizer Creating a new SolrRequestAuthorizer
2> 839984 INFO (TEST-DenseVectorFieldTest.denseVectorFieldOnAtomicUpdate_shouldBeUpdatedCorrectly-seed#[F404980FDB6AE07A]) [] o.a.s.SolrTestCaseJ4 ####initCore end
2> 839997 INFO (TEST-DenseVectorFieldTest.denseVectorFieldOnAtomicUpdate_shouldBeUpdatedCorrectly-seed#[F404980FDB6AE07A]) [ x:collection1] o.a.s.u.p.LogUpdateProcessorFactory webapp=null path=null params={}{add=[0]} 0 11
2> 840031 INFO (searcherExecutor-10798-thread-1-processing-collection1) [ x:collection1] o.a.s.c.SolrCore Registered new searcher autowarm time: 0 ms
2> 840032 INFO (TEST-DenseVectorFieldTest.denseVectorFieldOnAtomicUpdate_shouldBeUpdatedCorrectly-seed#[F404980FDB6AE07A]) [ x:collection1] o.a.s.u.p.LogUpdateProcessorFactory webapp=null path=null params={}{commit=} 0 34
2> 840033 INFO (TEST-DenseVectorFieldTest.denseVectorFieldOnAtomicUpdate_shouldBeUpdatedCorrectly-seed#[F404980FDB6AE07A]) [] o.a.s.c.S.Request webapp=null path=null params={q=id:0&fl=*&wt=xml} hits=1 status=0 QTime=0
1> IN-PUT: {
1> "responseHeader":{
1> "status":0,
1> "QTime":0
1> },
1> "response":{
1> "numFound":1,
1> "start":0,
1> "numFoundExact":true,
1> "docs":[{
1> "id":"0",
1> "vector":[1.1,2.2,3.3,4.4],
1> "vector_byte_encoding":[5,6,7,8],
1> "string_field":"test"
1> }]
1> }
1> }
1> IN-PUT: {
1> "responseHeader":{
1> "status":0,
1> "QTime":0
1> },
1> "response":{
1> "numFound":1,
1> "start":0,
1> "numFoundExact":true,
1> "docs":[{
1> "id":"0",
1> "vector":[1.1,2.2,3.3,4.4],
1> "vector_byte_encoding":[5,6,7,8],
1> "string_field":"test"
1> }]
1> }
1> }
1> IN-PUT: {
1> "responseHeader":{
1> "status":0,
1> "QTime":0
1> },
1> "response":{
1> "numFound":1,
1> "start":0,
1> "numFoundExact":true,
1> "docs":[{
1> "id":"0",
1> "vector":[1.1,2.2,3.3,4.4],
1> "vector_byte_encoding":[5,6,7,8],
1> "string_field":"test"
1> }]
1> }
1> }
2> 840034 INFO (TEST-DenseVectorFieldTest.denseVectorFieldOnAtomicUpdate_shouldBeUpdatedCorrectly-seed#[F404980FDB6AE07A]) [ x:collection1] o.a.s.u.p.LogUpdateProcessorFactory webapp=null path=null params={}{} 0 0
2> 840034 ERROR (TEST-DenseVectorFieldTest.denseVectorFieldOnAtomicUpdate_shouldBeUpdatedCorrectly-seed#[F404980FDB6AE07A]) [ x:collection1] o.a.s.h.RequestHandlerBase Client exception
2> => org.apache.solr.common.SolrException: Atomic document updates are not supported unless <updateLog/> is configured
2> at org.apache.solr.update.processor.DistributedUpdateProcessor.versionAdd(DistributedUpdateProcessor.java:297)
2> org.apache.solr.common.SolrException: Atomic document updates are not supported unless <updateLog/> is configured
2> at org.apache.solr.update.processor.DistributedUpdateProcessor.versionAdd(DistributedUpdateProcessor.java:297) ~[main/:?]
2> at org.apache.solr.update.processor.DistributedUpdateProcessor.processAdd(DistributedUpdateProcessor.java:234) ~[main/:?]
2> at org.apache.solr.update.processor.LogUpdateProcessorFactory$LogUpdateProcessor.processAdd(LogUpdateProcessorFactory.java:111) ~[main/:?]
2> at org.apache.solr.handler.loader.XMLLoader.processUpdate(XMLLoader.java:189) ~[main/:?]
2> at org.apache.solr.handler.loader.XMLLoader.load(XMLLoader.java:120) ~[main/:?]
2> at org.apache.solr.handler.UpdateRequestHandler$1.load(UpdateRequestHandler.java:102) ~[main/:?]
2> at org.apache.solr.handler.ContentStreamHandlerBase.handleRequestBody(ContentStreamHandlerBase.java:84) ~[main/:?]
2> at org.apache.solr.handler.RequestHandlerBase.handleRequest(RequestHandlerBase.java:224) [main/:?]
2> at org.apache.solr.core.SolrCore.execute(SolrCore.java:2893) [main/:?]
2> at org.apache.solr.servlet.DirectSolrConnection.request(DirectSolrConnection.java:113) [main/:?]
2> at org.apache.solr.util.TestHarness.update(TestHarness.java:295) [solr-test-framework-10.0.0-SNAPSHOT.jar:10.0.0-SNAPSHOT d713595bb70bb654c9e9f0cb13f9e40890d4891b [snapshot build, details omitted]]
2> at org.apache.solr.util.BaseTestHarness.checkUpdateStatus(BaseTestHarness.java:270) [solr-test-framework-10.0.0-SNAPSHOT.jar:10.0.0-SNAPSHOT d713595bb70bb654c9e9f0cb13f9e40890d4891b [snapshot build, details omitted]]
2> at org.apache.solr.util.BaseTestHarness.validateUpdate(BaseTestHarness.java:238) [solr-test-framework-10.0.0-SNAPSHOT.jar:10.0.0-SNAPSHOT d713595bb70bb654c9e9f0cb13f9e40890d4891b [snapshot build, details omitted]]
2> at org.apache.solr.SolrTestCaseJ4.checkUpdateU(SolrTestCaseJ4.java:969) [solr-test-framework-10.0.0-SNAPSHOT.jar:?]
2> at org.apache.solr.SolrTestCaseJ4.assertU(SolrTestCaseJ4.java:951) [solr-test-framework-10.0.0-SNAPSHOT.jar:?]
2> at org.apache.solr.SolrTestCaseJ4.assertU(SolrTestCaseJ4.java:946) [solr-test-framework-10.0.0-SNAPSHOT.jar:?]
2> at org.apache.solr.schema.DenseVectorFieldTest.denseVectorFieldOnAtomicUpdate_shouldBeUpdatedCorrectly(DenseVectorFieldTest.java:665) [test/:?]
2> at jdk.internal.reflect.NativeMethodAccessorImpl.invoke0(Native Method) ~[?:?]
2> at jdk.internal.reflect.NativeMethodAccessorImpl.invoke(NativeMethodAccessorImpl.java:62) ~[?:?]
2> at jdk.internal.reflect.DelegatingMethodAccessorImpl.invoke(DelegatingMethodAccessorImpl.java:43) ~[?:?]
2> at java.lang.reflect.Method.invoke(Method.java:566) ~[?:?]
2> at com.carrotsearch.randomizedtesting.RandomizedRunner.invoke(RandomizedRunner.java:1758) [randomizedtesting-runner-2.8.1.jar:?]
2> at com.carrotsearch.randomizedtesting.RandomizedRunner$8.evaluate(RandomizedRunner.java:946) [randomizedtesting-runner-2.8.1.jar:?]
2> at com.carrotsearch.randomizedtesting.RandomizedRunner$9.evaluate(RandomizedRunner.java:982) [randomizedtesting-runner-2.8.1.jar:?]
2> at com.carrotsearch.randomizedtesting.RandomizedRunner$10.evaluate(RandomizedRunner.java:996) [randomizedtesting-runner-2.8.1.jar:?]
2> at com.carrotsearch.randomizedtesting.rules.SystemPropertiesRestoreRule$1.evaluate(SystemPropertiesRestoreRule.java:80) [randomizedtesting-runner-2.8.1.jar:?]
2> at org.junit.rules.RunRules.evaluate(RunRules.java:20) [junit-4.13.2.jar:4.13.2]
2> at org.apache.lucene.tests.util.TestRuleSetupTeardownChained$1.evaluate(TestRuleSetupTeardownChained.java:48) [lucene-test-framework-9.7.0.jar:9.7.0 ccf4b198ec328095d45d2746189dc8ca633e8bcf - 2023-06-21 11:48:16]
2> at org.apache.lucene.tests.util.AbstractBeforeAfterRule$1.evaluate(AbstractBeforeAfterRule.java:43) [lucene-test-framework-9.7.0.jar:9.7.0 ccf4b198ec328095d45d2746189dc8ca633e8bcf - 2023-06-21 11:48:16]
2> at org.apache.lucene.tests.util.TestRuleThreadAndTestName$1.evaluate(TestRuleThreadAndTestName.java:45) [lucene-test-framework-9.7.0.jar:9.7.0 ccf4b198ec328095d45d2746189dc8ca633e8bcf - 2023-06-21 11:48:16]
2> at org.apache.lucene.tests.util.TestRuleIgnoreAfterMaxFailures$1.evaluate(TestRuleIgnoreAfterMaxFailures.java:60) [lucene-test-framework-9.7.0.jar:9.7.0 ccf4b198ec328095d45d2746189dc8ca633e8bcf - 2023-06-21 11:48:16]
2> at org.apache.lucene.tests.util.TestRuleMarkFailure$1.evaluate(TestRuleMarkFailure.java:44) [lucene-test-framework-9.7.0.jar:9.7.0 ccf4b198ec328095d45d2746189dc8ca633e8bcf - 2023-06-21 11:48:16]
2> at org.junit.rules.RunRules.evaluate(RunRules.java:20) [junit-4.13.2.jar:4.13.2]
2> at com.carrotsearch.randomizedtesting.rules.StatementAdapter.evaluate(StatementAdapter.java:36) [randomizedtesting-runner-2.8.1.jar:?]
2> at com.carrotsearch.randomizedtesting.ThreadLeakControl$StatementRunner.run(ThreadLeakControl.java:390) [randomizedtesting-runner-2.8.1.jar:?]
2> at com.carrotsearch.randomizedtesting.ThreadLeakControl.forkTimeoutingTask(ThreadLeakControl.java:843) [randomizedtesting-runner-2.8.1.jar:?]
2> at com.carrotsearch.randomizedtesting.ThreadLeakControl$3.evaluate(ThreadLeakControl.java:490) [randomizedtesting-runner-2.8.1.jar:?]
2> at com.carrotsearch.randomizedtesting.RandomizedRunner.runSingleTest(RandomizedRunner.java:955) [randomizedtesting-runner-2.8.1.jar:?]
2> at com.carrotsearch.randomizedtesting.RandomizedRunner$5.evaluate(RandomizedRunner.java:840) [randomizedtesting-runner-2.8.1.jar:?]
2> at com.carrotsearch.randomizedtesting.RandomizedRunner$6.evaluate(RandomizedRunner.java:891) [randomizedtesting-runner-2.8.1.jar:?]
2> at com.carrotsearch.randomizedtesting.RandomizedRunner$7.evaluate(RandomizedRunner.java:902) [randomizedtesting-runner-2.8.1.jar:?]
2> at com.carrotsearch.randomizedtesting.rules.StatementAdapter.evaluate(StatementAdapter.java:36) [randomizedtesting-runner-2.8.1.jar:?]
2> at com.carrotsearch.randomizedtesting.rules.StatementAdapter.evaluate(StatementAdapter.java:36) [randomizedtesting-runner-2.8.1.jar:?]
2> at org.apache.lucene.tests.util.AbstractBeforeAfterRule$1.evaluate(AbstractBeforeAfterRule.java:43) [lucene-test-framework-9.7.0.jar:9.7.0 ccf4b198ec328095d45d2746189dc8ca633e8bcf - 2023-06-21 11:48:16]
2> at com.carrotsearch.randomizedtesting.rules.SystemPropertiesRestoreRule$1.evaluate(SystemPropertiesRestoreRule.java:80) [randomizedtesting-runner-2.8.1.jar:?]
2> at org.junit.rules.RunRules.evaluate(RunRules.java:20) [junit-4.13.2.jar:4.13.2]
2> at org.apache.lucene.tests.util.AbstractBeforeAfterRule$1.evaluate(AbstractBeforeAfterRule.java:43) [lucene-test-framework-9.7.0.jar:9.7.0 ccf4b198ec328095d45d2746189dc8ca633e8bcf - 2023-06-21 11:48:16]
2> at com.carrotsearch.randomizedtesting.rules.StatementAdapter.evaluate(StatementAdapter.java:36) [randomizedtesting-runner-2.8.1.jar:?]
2> at org.apache.lucene.tests.util.TestRuleStoreClassName$1.evaluate(TestRuleStoreClassName.java:38) [lucene-test-framework-9.7.0.jar:9.7.0 ccf4b198ec328095d45d2746189dc8ca633e8bcf - 2023-06-21 11:48:16]
2> at com.carrotsearch.randomizedtesting.rules.NoShadowingOrOverridesOnMethodsRule$1.evaluate(NoShadowingOrOverridesOnMethodsRule.java:40) [randomizedtesting-runner-2.8.1.jar:?]
2> at com.carrotsearch.randomizedtesting.rules.NoShadowingOrOverridesOnMethodsRule$1.evaluate(NoShadowingOrOverridesOnMethodsRule.java:40) [randomizedtesting-runner-2.8.1.jar:?]
2> at com.carrotsearch.randomizedtesting.rules.StatementAdapter.evaluate(StatementAdapter.java:36) [randomizedtesting-runner-2.8.1.jar:?]
2> at com.carrotsearch.randomizedtesting.rules.StatementAdapter.evaluate(StatementAdapter.java:36) [randomizedtesting-runner-2.8.1.jar:?]
2> at org.apache.lucene.tests.util.TestRuleAssertionsRequired$1.evaluate(TestRuleAssertionsRequired.java:53) [lucene-test-framework-9.7.0.jar:9.7.0 ccf4b198ec328095d45d2746189dc8ca633e8bcf - 2023-06-21 11:48:16]
2> at org.apache.lucene.tests.util.AbstractBeforeAfterRule$1.evaluate(AbstractBeforeAfterRule.java:43) [lucene-test-framework-9.7.0.jar:9.7.0 ccf4b198ec328095d45d2746189dc8ca633e8bcf - 2023-06-21 11:48:16]
2> at org.apache.lucene.tests.util.TestRuleMarkFailure$1.evaluate(TestRuleMarkFailure.java:44) [lucene-test-framework-9.7.0.jar:9.7.0 ccf4b198ec328095d45d2746189dc8ca633e8bcf - 2023-06-21 11:48:16]
2> at org.apache.lucene.tests.util.TestRuleIgnoreAfterMaxFailures$1.evaluate(TestRuleIgnoreAfterMaxFailures.java:60) [lucene-test-framework-9.7.0.jar:9.7.0 ccf4b198ec328095d45d2746189dc8ca633e8bcf - 2023-06-21 11:48:16]
2> at org.apache.lucene.tests.util.TestRuleIgnoreTestSuites$1.evaluate(TestRuleIgnoreTestSuites.java:47) [lucene-test-framework-9.7.0.jar:9.7.0 ccf4b198ec328095d45d2746189dc8ca633e8bcf - 2023-06-21 11:48:16]
2> at org.junit.rules.RunRules.evaluate(RunRules.java:20) [junit-4.13.2.jar:4.13.2]
2> at com.carrotsearch.randomizedtesting.rules.StatementAdapter.evaluate(StatementAdapter.java:36) [randomizedtesting-runner-2.8.1.jar:?]
2> at com.carrotsearch.randomizedtesting.ThreadLeakControl$StatementRunner.run(ThreadLeakControl.java:390) [randomizedtesting-runner-2.8.1.jar:?]
2> at com.carrotsearch.randomizedtesting.ThreadLeakControl.lambda$forkTimeoutingTask$0(ThreadLeakControl.java:850) [randomizedtesting-runner-2.8.1.jar:?]
2> at java.lang.Thread.run(Thread.java:829) [?:?]
2> 840035 INFO (TEST-DenseVectorFieldTest.denseVectorFieldOnAtomicUpdate_shouldBeUpdatedCorrectly-seed#[F404980FDB6AE07A]) [] o.a.s.SolrTestCaseJ4 ###deleteCore
2> 840035 INFO (TEST-DenseVectorFieldTest.denseVectorFieldOnAtomicUpdate_shouldBeUpdatedCorrectly-seed#[F404980FDB6AE07A]) [] o.a.s.c.CoreContainer Shutting down CoreContainer instance=311680689
2> 840036 INFO (coreCloseExecutor-10803-thread-1) [ x:collection1] o.a.s.c.SolrCore CLOSING SolrCore org.apache.solr.core.SolrCore@5243c68b collection1
2> 840036 INFO (coreCloseExecutor-10803-thread-1) [ x:collection1] o.a.s.m.SolrMetricManager Closing metric reporters for registry=solr.core.collection1 tag=SolrCore@5243c68b
2> 840051 INFO (coreCloseExecutor-10803-thread-1) [ x:collection1] o.a.s.u.DirectUpdateHandler2 Committing on IndexWriter.close() ... SKIPPED (unnecessary).
2> 840052 INFO (TEST-DenseVectorFieldTest.denseVectorFieldOnAtomicUpdate_shouldBeUpdatedCorrectly-seed#[F404980FDB6AE07A]) [] o.a.s.m.SolrMetricManager Closing metric reporters for registry=solr.node tag=null
2> 840058 INFO (TEST-DenseVectorFieldTest.denseVectorFieldOnAtomicUpdate_shouldBeUpdatedCorrectly-seed#[F404980FDB6AE07A]) [] o.a.s.m.SolrMetricManager Closing metric reporters for registry=solr.jvm tag=null
2> 840061 INFO (TEST-DenseVectorFieldTest.denseVectorFieldOnAtomicUpdate_shouldBeUpdatedCorrectly-seed#[F404980FDB6AE07A]) [] o.a.s.m.SolrMetricManager Closing metric reporters for registry=solr.jetty tag=null
2> 840422 INFO (TEST-DenseVectorFieldTest.denseVectorFieldOnAtomicUpdate_shouldBeUpdatedCorrectly-seed#[F404980FDB6AE07A]) [] o.a.s.SolrTestCaseJ4 ###Ending denseVectorFieldOnAtomicUpdate_shouldBeUpdatedCorrectly
> org.apache.solr.common.SolrException: Atomic document updates are not supported unless <updateLog/> is configured
> at __randomizedtesting.SeedInfo.seed([F404980FDB6AE07A:1E8900B7DC8537D1]:0)
> at app//org.apache.solr.update.processor.DistributedUpdateProcessor.versionAdd(DistributedUpdateProcessor.java:297)
> at app//org.apache.solr.update.processor.DistributedUpdateProcessor.processAdd(DistributedUpdateProcessor.java:234)
> at app//org.apache.solr.update.processor.LogUpdateProcessorFactory$LogUpdateProcessor.processAdd(LogUpdateProcessorFactory.java:111)
> at app//org.apache.solr.handler.loader.XMLLoader.processUpdate(XMLLoader.java:189)
> at app//org.apache.solr.handler.loader.XMLLoader.load(XMLLoader.java:120)
> at app//org.apache.solr.handler.UpdateRequestHandler$1.load(UpdateRequestHandler.java:102)
> at app//org.apache.solr.handler.ContentStreamHandlerBase.handleRequestBody(ContentStreamHandlerBase.java:84)
> at app//org.apache.solr.handler.RequestHandlerBase.handleRequest(RequestHandlerBase.java:224)
> at app//org.apache.solr.core.SolrCore.execute(SolrCore.java:2893)
> at app//org.apache.solr.servlet.DirectSolrConnection.request(DirectSolrConnection.java:113)
> at app//org.apache.solr.util.TestHarness.update(TestHarness.java:295)
> at app//org.apache.solr.util.BaseTestHarness.checkUpdateStatus(BaseTestHarness.java:270)
> at app//org.apache.solr.util.BaseTestHarness.validateUpdate(BaseTestHarness.java:238)
> at app//org.apache.solr.SolrTestCaseJ4.checkUpdateU(SolrTestCaseJ4.java:969)
> at app//org.apache.solr.SolrTestCaseJ4.assertU(SolrTestCaseJ4.java:951)
> at app//org.apache.solr.SolrTestCaseJ4.assertU(SolrTestCaseJ4.java:946)
> at app//org.apache.solr.schema.DenseVectorFieldTest.denseVectorFieldOnAtomicUpdate_shouldBeUpdatedCorrectly(DenseVectorFieldTest.java:665)
> at java.base@11.0.16.1/jdk.internal.reflect.NativeMethodAccessorImpl.invoke0(Native Method)
> at java.base@11.0.16.1/jdk.internal.reflect.NativeMethodAccessorImpl.invoke(NativeMethodAccessorImpl.java:62)
> at java.base@11.0.16.1/jdk.internal.reflect.DelegatingMethodAccessorImpl.invoke(DelegatingMethodAccessorImpl.java:43)
> at java.base@11.0.16.1/java.lang.reflect.Method.invoke(Method.java:566)
> at app//com.carrotsearch.randomizedtesting.RandomizedRunner.invoke(RandomizedRunner.java:1758)
> at app//com.carrotsearch.randomizedtesting.RandomizedRunner$8.evaluate(RandomizedRunner.java:946)
> at app//com.carrotsearch.randomizedtesting.RandomizedRunner$9.evaluate(RandomizedRunner.java:982)
> at app//com.carrotsearch.randomizedtesting.RandomizedRunner$10.evaluate(RandomizedRunner.java:996)
> at app//com.carrotsearch.randomizedtesting.rules.SystemPropertiesRestoreRule$1.evaluate(SystemPropertiesRestoreRule.java:80)
> at app//org.junit.rules.RunRules.evaluate(RunRules.java:20)
> at app//org.apache.lucene.tests.util.TestRuleSetupTeardownChained$1.evaluate(TestRuleSetupTeardownChained.java:48)
> at app//org.apache.lucene.tests.util.AbstractBeforeAfterRule$1.evaluate(AbstractBeforeAfterRule.java:43)
> at app//org.apache.lucene.tests.util.TestRuleThreadAndTestName$1.evaluate(TestRuleThreadAndTestName.java:45)
> at app//org.apache.lucene.tests.util.TestRuleIgnoreAfterMaxFailures$1.evaluate(TestRuleIgnoreAfterMaxFailures.java:60)
> at app//org.apache.lucene.tests.util.TestRuleMarkFailure$1.evaluate(TestRuleMarkFailure.java:44)
> at app//org.junit.rules.RunRules.evaluate(RunRules.java:20)
> at app//com.carrotsearch.randomizedtesting.rules.StatementAdapter.evaluate(StatementAdapter.java:36)
> at app//com.carrotsearch.randomizedtesting.ThreadLeakControl$StatementRunner.run(ThreadLeakControl.java:390)
> at app//com.carrotsearch.randomizedtesting.ThreadLeakControl.forkTimeoutingTask(ThreadLeakControl.java:843)
> at app//com.carrotsearch.randomizedtesting.ThreadLeakControl$3.evaluate(ThreadLeakControl.java:490)
> at app//com.carrotsearch.randomizedtesting.RandomizedRunner.runSingleTest(RandomizedRunner.java:955)
> at app//com.carrotsearch.randomizedtesting.RandomizedRunner$5.evaluate(RandomizedRunner.java:840)
> at app//com.carrotsearch.randomizedtesting.RandomizedRunner$6.evaluate(RandomizedRunner.java:891)
> at app//com.carrotsearch.randomizedtesting.RandomizedRunner$7.evaluate(RandomizedRunner.java:902)
> at app//com.carrotsearch.randomizedtesting.rules.StatementAdapter.evaluate(StatementAdapter.java:36)
> at app//com.carrotsearch.randomizedtesting.rules.StatementAdapter.evaluate(StatementAdapter.java:36)
> at app//org.apache.lucene.tests.util.AbstractBeforeAfterRule$1.evaluate(AbstractBeforeAfterRule.java:43)
> at app//com.carrotsearch.randomizedtesting.rules.SystemPropertiesRestoreRule$1.evaluate(SystemPropertiesRestoreRule.java:80)
> at app//org.junit.rules.RunRules.evaluate(RunRules.java:20)
> at app//org.apache.lucene.tests.util.AbstractBeforeAfterRule$1.evaluate(AbstractBeforeAfterRule.java:43)
> at app//com.carrotsearch.randomizedtesting.rules.StatementAdapter.evaluate(StatementAdapter.java:36)
> at app//org.apache.lucene.tests.util.TestRuleStoreClassName$1.evaluate(TestRuleStoreClassName.java:38)
> at app//com.carrotsearch.randomizedtesting.rules.NoShadowingOrOverridesOnMethodsRule$1.evaluate(NoShadowingOrOverridesOnMethodsRule.java:40)
> at app//com.carrotsearch.randomizedtesting.rules.NoShadowingOrOverridesOnMethodsRule$1.evaluate(NoShadowingOrOverridesOnMethodsRule.java:40)
> at app//com.carrotsearch.randomizedtesting.rules.StatementAdapter.evaluate(StatementAdapter.java:36)
> at app//com.carrotsearch.randomizedtesting.rules.StatementAdapter.evaluate(StatementAdapter.java:36)
> at app//org.apache.lucene.tests.util.TestRuleAssertionsRequired$1.evaluate(TestRuleAssertionsRequired.java:53)
> at app//org.apache.lucene.tests.util.AbstractBeforeAfterRule$1.evaluate(AbstractBeforeAfterRule.java:43)
> at app//org.apache.lucene.tests.util.TestRuleMarkFailure$1.evaluate(TestRuleMarkFailure.java:44)
> at app//org.apache.lucene.tests.util.TestRuleIgnoreAfterMaxFailures$1.evaluate(TestRuleIgnoreAfterMaxFailures.java:60)
> at app//org.apache.lucene.tests.util.TestRuleIgnoreTestSuites$1.evaluate(TestRuleIgnoreTestSuites.java:47)
> at app//org.junit.rules.RunRules.evaluate(RunRules.java:20)
> at app//com.carrotsearch.randomizedtesting.rules.StatementAdapter.evaluate(StatementAdapter.java:36)
> at app//com.carrotsearch.randomizedtesting.ThreadLeakControl$StatementRunner.run(ThreadLeakControl.java:390)
> at app//com.carrotsearch.randomizedtesting.ThreadLeakControl.lambda$forkTimeoutingTask$0(ThreadLeakControl.java:850)
> at java.base@11.0.16.1/java.lang.Thread.run(Thread.java:829)
2> NOTE: reproduce with: gradlew test --tests DenseVectorFieldTest.denseVectorFieldOnAtomicUpdate_shouldBeUpdatedCorrectly -Dtests.seed=F404980FDB6AE07A -Dtests.multiplier=2 -Dtests.locale=bo -Dtests.timezone=Etc/GMT-9 -Dtests.asserts=true -Dtests.file.encoding=UTF-8
2> 840431 INFO (TEST-DenseVectorFieldTest.parseVector_incorrectVectorDimension_shouldThrowException-seed#[F404980FDB6AE07A]) [] o.a.s.SolrTestCaseJ4 ###Starting parseVector_incorrectVectorDimension_shouldThrowException
2> 840433 INFO (TEST-DenseVectorFieldTest.parseVector_incorrectVectorDimension_shouldThrowException-seed#[F404980FDB6AE07A]) [] o.a.s.SolrTestCaseJ4 ###Ending parseVector_incorrectVectorDimension_shouldThrowException
2> 840445 INFO (TEST-DenseVectorFieldTest.query_vectorByteEncoded_storedField_shouldBeReturnedInResults-seed#[F404980FDB6AE07A]) [] o.a.s.SolrTestCaseJ4 ###Starting query_vectorByteEncoded_storedField_shouldBeReturnedInResults
2> 840445 INFO (TEST-DenseVectorFieldTest.query_vectorByteEncoded_storedField_shouldBeReturnedInResults-seed#[F404980FDB6AE07A]) [] o.a.s.SolrTestCaseJ4 ####initCore
2> 840447 INFO (TEST-DenseVectorFieldTest.query_vectorByteEncoded_storedField_shouldBeReturnedInResults-seed#[F404980FDB6AE07A]) [] o.a.s.c.SolrResourceLoader Added 2 libs to classloader, from paths: [/home/jenkins/jenkins-slave/workspace/Solr/Solr-Check-main/solr/core/build/resources/test/solr/collection1/lib, /home/jenkins/jenkins-slave/workspace/Solr/Solr-Check-main/solr/core/build/resources/test/solr/collection1/lib/classes]
2> 840458 INFO (TEST-DenseVectorFieldTest.query_vectorByteEncoded_storedField_shouldBeReturnedInResults-seed#[F404980FDB6AE07A]) [] o.a.s.c.SolrConfig Using Lucene MatchVersion: 9.7.0
2> 840459 INFO (TEST-DenseVectorFieldTest.query_vectorByteEncoded_storedField_shouldBeReturnedInResults-seed#[F404980FDB6AE07A]) [] o.a.s.SolrTestCaseJ4 Created dataDir: /home/jenkins/jenkins-slave/workspace/Solr/Solr-Check-main/solr/core/build/tmp/tests-tmp/solr.schema.DenseVectorFieldTest_F404980FDB6AE07A-001/data-dir-152-001
2> 840459 INFO (TEST-DenseVectorFieldTest.query_vectorByteEncoded_storedField_shouldBeReturnedInResults-seed#[F404980FDB6AE07A]) [] o.a.s.s.IndexSchema Schema name=schema-densevector
2> 840460 WARN (TEST-DenseVectorFieldTest.query_vectorByteEncoded_storedField_shouldBeReturnedInResults-seed#[F404980FDB6AE07A]) [] o.a.s.s.DenseVectorField The vector dimension 2048 specified for field 2048_byte_vector exceeds the current Lucene default max dimension of 1024. It's un-tested territory, extra caution and benchmarks are recommended for production systems.
2> 840460 WARN (TEST-DenseVectorFieldTest.query_vectorByteEncoded_storedField_shouldBeReturnedInResults-seed#[F404980FDB6AE07A]) [] o.a.s.s.DenseVectorField The vector dimension 2048 specified for field 2048_float_vector exceeds the current Lucene default max dimension of 1024. It's un-tested territory, extra caution and benchmarks are recommended for production systems.
2> 840460 INFO (TEST-DenseVectorFieldTest.query_vectorByteEncoded_storedField_shouldBeReturnedInResults-seed#[F404980FDB6AE07A]) [] o.a.s.s.IndexSchema Loaded schema schema-densevector/1.0 with uniqueid field id
2> 841147 WARN (TEST-DenseVectorFieldTest.query_vectorByteEncoded_storedField_shouldBeReturnedInResults-seed#[F404980FDB6AE07A]) [] o.a.s.c.CoreContainer Not all security plugins configured! authentication=disabled authorization=disabled. Solr is only as secure as you make it. Consider configuring authentication/authorization before exposing Solr to users internal or external. See https://s.apache.org/solrsecurity for more info
2> 841168 INFO (coreLoadExecutor-10813-thread-1) [ x:collection1] o.a.s.c.SolrResourceLoader Added 2 libs to classloader, from paths: [/home/jenkins/jenkins-slave/workspace/Solr/Solr-Check-main/solr/core/build/resources/test/solr/collection1/lib, /home/jenkins/jenkins-slave/workspace/Solr/Solr-Check-main/solr/core/build/resources/test/solr/collection1/lib/classes]
2> 841180 INFO (coreLoadExecutor-10813-thread-1) [ x:collection1] o.a.s.c.SolrConfig Using Lucene MatchVersion: 9.7.0
2> 841181 INFO (coreLoadExecutor-10813-thread-1) [ x:collection1] o.a.s.s.IndexSchema Schema name=schema-densevector
2> 841182 WARN (coreLoadExecutor-10813-thread-1) [ x:collection1] o.a.s.s.DenseVectorField The vector dimension 2048 specified for field 2048_byte_vector exceeds the current Lucene default max dimension of 1024. It's un-tested territory, extra caution and benchmarks are recommended for production systems.
2> 841182 WARN (coreLoadExecutor-10813-thread-1) [ x:collection1] o.a.s.s.DenseVectorField The vector dimension 2048 specified for field 2048_float_vector exceeds the current Lucene default max dimension of 1024. It's un-tested territory, extra caution and benchmarks are recommended for production systems.
2> 841182 INFO (coreLoadExecutor-10813-thread-1) [ x:collection1] o.a.s.s.IndexSchema Loaded schema schema-densevector/1.0 with uniqueid field id
2> 841183 INFO (coreLoadExecutor-10813-thread-1) [ x:collection1] o.a.s.c.CoreContainer Creating SolrCore 'collection1' using configuration from instancedir /home/jenkins/jenkins-slave/workspace/Solr/Solr-Check-main/solr/core/build/resources/test/solr/collection1, trusted=true
2> 841183 INFO (coreLoadExecutor-10813-thread-1) [ x:collection1] o.a.s.c.SolrCore Opening new SolrCore at [/home/jenkins/jenkins-slave/workspace/Solr/Solr-Check-main/solr/core/build/resources/test/solr/collection1], dataDir=[/home/jenkins/jenkins-slave/workspace/Solr/Solr-Check-main/solr/core/build/tmp/tests-tmp/solr.schema.DenseVectorFieldTest_F404980FDB6AE07A-001/data-dir-152-001/]
2> 841184 INFO (coreLoadExecutor-10813-thread-1) [ x:collection1] o.a.s.u.RandomMergePolicy RandomMergePolicy wrapping class org.apache.lucene.index.LogByteSizeMergePolicy: [LogByteSizeMergePolicy: minMergeSize=1677721, mergeFactor=40, maxMergeSize=2147483648, maxMergeSizeForForcedMerge=9223372036854775807, calibrateSizeByDeletes=false, maxMergeDocs=2147483647, maxCFSSegmentSizeMB=8.796093022208E12, noCFSRatio=0.0]
2> 841209 INFO (coreLoadExecutor-10813-thread-1) [ x:collection1] o.a.s.j.SolrRequestAuthorizer Creating a new SolrRequestAuthorizer
2> 841213 INFO (coreLoadExecutor-10813-thread-1) [ x:collection1] o.a.s.u.CommitTracker Hard AutoCommit: disabled
2> 841213 INFO (coreLoadExecutor-10813-thread-1) [ x:collection1] o.a.s.u.CommitTracker Soft AutoCommit: disabled
2> 841214 INFO (coreLoadExecutor-10813-thread-1) [ x:collection1] o.a.s.u.RandomMergePolicy RandomMergePolicy wrapping class org.apache.lucene.index.TieredMergePolicy: [TieredMergePolicy: maxMergeAtOnce=26, maxMergedSegmentMB=40.57908630371094, floorSegmentMB=1.9960556030273438, forceMergeDeletesPctAllowed=2.8236748783044394, segmentsPerTier=26.0, maxCFSSegmentSizeMB=8.796093022208E12, noCFSRatio=1.0, deletesPctAllowed=29.233385841956945
2> 841214 WARN (coreLoadExecutor-10813-thread-1) [ x:collection1] o.a.s.r.ManagedResourceStorage Cannot write to config directory /home/jenkins/jenkins-slave/workspace/Solr/Solr-Check-main/solr/core/build/resources/test/solr/collection1/conf ; switching to use InMemory storage instead.
2> 841214 INFO (coreLoadExecutor-10813-thread-1) [ x:collection1] o.a.s.h.ReplicationHandler Commits will be reserved for 10000 ms
2> 841215 INFO (searcherExecutor-10815-thread-1-processing-collection1) [ x:collection1] o.a.s.c.SolrCore Registered new searcher autowarm time: 0 ms
2> 841238 INFO (TEST-DenseVectorFieldTest.query_vectorByteEncoded_storedField_shouldBeReturnedInResults-seed#[F404980FDB6AE07A]) [] o.a.s.j.SolrRequestAuthorizer Creating a new SolrRequestAuthorizer
2> 841247 INFO (TEST-DenseVectorFieldTest.query_vectorByteEncoded_storedField_shouldBeReturnedInResults-seed#[F404980FDB6AE07A]) [] o.a.s.SolrTestCaseJ4 ####initCore end
2> 841248 INFO (TEST-DenseVectorFieldTest.query_vectorByteEncoded_storedField_shouldBeReturnedInResults-seed#[F404980FDB6AE07A]) [ x:collection1] o.a.s.u.p.LogUpdateProcessorFactory webapp=null path=null params={}{add=[0]} 0 0
2> 841252 INFO (searcherExecutor-10815-thread-1-processing-collection1) [ x:collection1] o.a.s.c.SolrCore Registered new searcher autowarm time: 0 ms
2> 841252 INFO (TEST-DenseVectorFieldTest.query_vectorByteEncoded_storedField_shouldBeReturnedInResults-seed#[F404980FDB6AE07A]) [ x:collection1] o.a.s.u.p.LogUpdateProcessorFactory webapp=null path=null params={}{commit=} 0 3
2> 841253 INFO (TEST-DenseVectorFieldTest.query_vectorByteEncoded_storedField_shouldBeReturnedInResults-seed#[F404980FDB6AE07A]) [] o.a.s.c.S.Request webapp=null path=null params={q=id:0&fl=vector_byte_encoding&wt=xml} hits=1 status=0 QTime=0
1> IN-PUT: {
1> "responseHeader":{
1> "status":0,
1> "QTime":0
1> },
1> "response":{
1> "numFound":1,
1> "start":0,
1> "numFoundExact":true,
1> "docs":[{
1> "vector_byte_encoding":[1,2,3,4]
1> }]
1> }
1> }
2> 841253 INFO (TEST-DenseVectorFieldTest.query_vectorByteEncoded_storedField_shouldBeReturnedInResults-seed#[F404980FDB6AE07A]) [] o.a.s.SolrTestCaseJ4 ###deleteCore
2> 841253 INFO (TEST-DenseVectorFieldTest.query_vectorByteEncoded_storedField_shouldBeReturnedInResults-seed#[F404980FDB6AE07A]) [] o.a.s.c.CoreContainer Shutting down CoreContainer instance=1068224327
2> 841253 INFO (coreCloseExecutor-10820-thread-1) [ x:collection1] o.a.s.c.SolrCore CLOSING SolrCore org.apache.solr.core.SolrCore@68f69949 collection1
2> 841253 INFO (coreCloseExecutor-10820-thread-1) [ x:collection1] o.a.s.m.SolrMetricManager Closing metric reporters for registry=solr.core.collection1 tag=SolrCore@68f69949
2> 841262 INFO (coreCloseExecutor-10820-thread-1) [ x:collection1] o.a.s.u.DirectUpdateHandler2 Committing on IndexWriter.close() ... SKIPPED (unnecessary).
2> 841266 INFO (TEST-DenseVectorFieldTest.query_vectorByteEncoded_storedField_shouldBeReturnedInResults-seed#[F404980FDB6AE07A]) [] o.a.s.m.SolrMetricManager Closing metric reporters for registry=solr.node tag=null
2> 841272 INFO (TEST-DenseVectorFieldTest.query_vectorByteEncoded_storedField_shouldBeReturnedInResults-seed#[F404980FDB6AE07A]) [] o.a.s.m.SolrMetricManager Closing metric reporters for registry=solr.jvm tag=null
2> 841275 INFO (TEST-DenseVectorFieldTest.query_vectorByteEncoded_storedField_shouldBeReturnedInResults-seed#[F404980FDB6AE07A]) [] o.a.s.m.SolrMetricManager Closing metric reporters for registry=solr.jetty tag=null
2> 841277 INFO (TEST-DenseVectorFieldTest.query_vectorByteEncoded_storedField_shouldBeReturnedInResults-seed#[F404980FDB6AE07A]) [] o.a.s.SolrTestCaseJ4 ###Ending query_vectorByteEncoded_storedField_shouldBeReturnedInResults
2> 841281 INFO (TEST-DenseVectorFieldTest.fieldTypeDefinition_badSimilarityDistance_shouldThrowException-seed#[F404980FDB6AE07A]) [] o.a.s.SolrTestCaseJ4 ###Starting fieldTypeDefinition_badSimilarityDistance_shouldThrowException
2> 841282 INFO (TEST-DenseVectorFieldTest.fieldTypeDefinition_badSimilarityDistance_shouldThrowException-seed#[F404980FDB6AE07A]) [] o.a.s.u.ErrorLogMuter Creating ErrorLogMuter-regex-339 for ERROR logs matching regex: \QNo enum constant org.apache.lucene.index.VectorSimilarityFunction.NOT_EXISTENT\E
2> 841282 INFO (TEST-DenseVectorFieldTest.fieldTypeDefinition_badSimilarityDistance_shouldThrowException-seed#[F404980FDB6AE07A]) [] o.a.s.SolrTestCaseJ4 ####initCore
2> 841284 INFO (TEST-DenseVectorFieldTest.fieldTypeDefinition_badSimilarityDistance_shouldThrowException-seed#[F404980FDB6AE07A]) [] o.a.s.c.SolrResourceLoader Added 2 libs to classloader, from paths: [/home/jenkins/jenkins-slave/workspace/Solr/Solr-Check-main/solr/core/build/resources/test/solr/collection1/lib, /home/jenkins/jenkins-slave/workspace/Solr/Solr-Check-main/solr/core/build/resources/test/solr/collection1/lib/classes]
2> 841296 INFO (TEST-DenseVectorFieldTest.fieldTypeDefinition_badSimilarityDistance_shouldThrowException-seed#[F404980FDB6AE07A]) [] o.a.s.c.SolrConfig Using Lucene MatchVersion: 9.7.0
2> 841296 INFO (TEST-DenseVectorFieldTest.fieldTypeDefinition_badSimilarityDistance_shouldThrowException-seed#[F404980FDB6AE07A]) [] o.a.s.SolrTestCaseJ4 Created dataDir: /home/jenkins/jenkins-slave/workspace/Solr/Solr-Check-main/solr/core/build/tmp/tests-tmp/solr.schema.DenseVectorFieldTest_F404980FDB6AE07A-001/data-dir-153-001
2> 841297 INFO (TEST-DenseVectorFieldTest.fieldTypeDefinition_badSimilarityDistance_shouldThrowException-seed#[F404980FDB6AE07A]) [] o.a.s.s.IndexSchema Schema name=bad-schema-densevector-similarity
2> 841298 INFO (TEST-DenseVectorFieldTest.fieldTypeDefinition_badSimilarityDistance_shouldThrowException-seed#[F404980FDB6AE07A]) [] o.a.s.u.ErrorLogMuter Closing ErrorLogMuter-regex-339 after mutting 0 log messages
2> 841298 INFO (TEST-DenseVectorFieldTest.fieldTypeDefinition_badSimilarityDistance_shouldThrowException-seed#[F404980FDB6AE07A]) [] o.a.s.u.ErrorLogMuter Closing ErrorLogMuter-regex-338 after mutting 0 log messages
2> 841298 INFO (TEST-DenseVectorFieldTest.fieldTypeDefinition_badSimilarityDistance_shouldThrowException-seed#[F404980FDB6AE07A]) [] o.a.s.u.ErrorLogMuter Creating ErrorLogMuter-regex-340 for ERROR logs matching regex: ignore_exception
2> 841299 INFO (TEST-DenseVectorFieldTest.fieldTypeDefinition_badSimilarityDistance_shouldThrowException-seed#[F404980FDB6AE07A]) [] o.a.s.SolrTestCaseJ4 ###Ending fieldTypeDefinition_badSimilarityDistance_shouldThrowException
2> 841303 INFO (TEST-DenseVectorFieldTest.parseVector_IntArrayList_shouldParseByteArray-seed#[F404980FDB6AE07A]) [] o.a.s.SolrTestCaseJ4 ###Starting parseVector_IntArrayList_shouldParseByteArray
2> 841304 INFO (TEST-DenseVectorFieldTest.parseVector_IntArrayList_shouldParseByteArray-seed#[F404980FDB6AE07A]) [] o.a.s.SolrTestCaseJ4 ###Ending parseVector_IntArrayList_shouldParseByteArray
2> 841307 INFO (TEST-DenseVectorFieldTest.denseVectorByteEncoding_shouldRaiseExceptionWithFloatValues-seed#[F404980FDB6AE07A]) [] o.a.s.SolrTestCaseJ4 ###Starting denseVectorByteEncoding_shouldRaiseExceptionWithFloatValues
2> 841307 INFO (TEST-DenseVectorFieldTest.denseVectorByteEncoding_shouldRaiseExceptionWithFloatValues-seed#[F404980FDB6AE07A]) [] o.a.s.SolrTestCaseJ4 ####initCore
2> 841310 INFO (TEST-DenseVectorFieldTest.denseVectorByteEncoding_shouldRaiseExceptionWithFloatValues-seed#[F404980FDB6AE07A]) [] o.a.s.c.SolrResourceLoader Added 2 libs to classloader, from paths: [/home/jenkins/jenkins-slave/workspace/Solr/Solr-Check-main/solr/core/build/resources/test/solr/collection1/lib, /home/jenkins/jenkins-slave/workspace/Solr/Solr-Check-main/solr/core/build/resources/test/solr/collection1/lib/classes]
2> 841321 INFO (TEST-DenseVectorFieldTest.denseVectorByteEncoding_shouldRaiseExceptionWithFloatValues-seed#[F404980FDB6AE07A]) [] o.a.s.c.SolrConfig Using Lucene MatchVersion: 9.7.0
2> 841321 WARN (TEST-DenseVectorFieldTest.denseVectorByteEncoding_shouldRaiseExceptionWithFloatValues-seed#[F404980FDB6AE07A]) [] o.a.s.c.SolrConfig solrconfig.xml: <boolTofilterOptimizer> is currently not implemented and has no effect.
2> 841322 INFO (TEST-DenseVectorFieldTest.denseVectorByteEncoding_shouldRaiseExceptionWithFloatValues-seed#[F404980FDB6AE07A]) [] o.a.s.SolrTestCaseJ4 Created dataDir: /home/jenkins/jenkins-slave/workspace/Solr/Solr-Check-main/solr/core/build/tmp/tests-tmp/solr.schema.DenseVectorFieldTest_F404980FDB6AE07A-001/data-dir-154-001
2> 841323 INFO (TEST-DenseVectorFieldTest.denseVectorByteEncoding_shouldRaiseExceptionWithFloatValues-seed#[F404980FDB6AE07A]) [] o.a.s.s.IndexSchema Schema name=schema-densevector
2> 841323 WARN (TEST-DenseVectorFieldTest.denseVectorByteEncoding_shouldRaiseExceptionWithFloatValues-seed#[F404980FDB6AE07A]) [] o.a.s.s.DenseVectorField The vector dimension 2048 specified for field 2048_byte_vector exceeds the current Lucene default max dimension of 1024. It's un-tested territory, extra caution and benchmarks are recommended for production systems.
2> 841323 WARN (TEST-DenseVectorFieldTest.denseVectorByteEncoding_shouldRaiseExceptionWithFloatValues-seed#[F404980FDB6AE07A]) [] o.a.s.s.DenseVectorField The vector dimension 2048 specified for field 2048_float_vector exceeds the current Lucene default max dimension of 1024. It's un-tested territory, extra caution and benchmarks are recommended for production systems.
2> 841323 INFO (TEST-DenseVectorFieldTest.denseVectorByteEncoding_shouldRaiseExceptionWithFloatValues-seed#[F404980FDB6AE07A]) [] o.a.s.s.IndexSchema Loaded schema schema-densevector/1.0 with uniqueid field id
2> 842762 WARN (TEST-DenseVectorFieldTest.denseVectorByteEncoding_shouldRaiseExceptionWithFloatValues-seed#[F404980FDB6AE07A]) [] o.a.s.c.CoreContainer Not all security plugins configured! authentication=disabled authorization=disabled. Solr is only as secure as you make it. Consider configuring authentication/authorization before exposing Solr to users internal or external. See https://s.apache.org/solrsecurity for more info
2> 842785 INFO (coreLoadExecutor-10830-thread-1) [ x:collection1] o.a.s.c.SolrResourceLoader Added 2 libs to classloader, from paths: [/home/jenkins/jenkins-slave/workspace/Solr/Solr-Check-main/solr/core/build/resources/test/solr/collection1/lib, /home/jenkins/jenkins-slave/workspace/Solr/Solr-Check-main/solr/core/build/resources/test/solr/collection1/lib/classes]
2> 842797 INFO (coreLoadExecutor-10830-thread-1) [ x:collection1] o.a.s.c.SolrConfig Using Lucene MatchVersion: 9.7.0
2> 842797 WARN (coreLoadExecutor-10830-thread-1) [ x:collection1] o.a.s.c.SolrConfig solrconfig.xml: <boolTofilterOptimizer> is currently not implemented and has no effect.
2> 842798 INFO (coreLoadExecutor-10830-thread-1) [ x:collection1] o.a.s.s.IndexSchema Schema name=schema-densevector
2> 842799 WARN (coreLoadExecutor-10830-thread-1) [ x:collection1] o.a.s.s.DenseVectorField The vector dimension 2048 specified for field 2048_byte_vector exceeds the current Lucene default max dimension of 1024. It's un-tested territory, extra caution and benchmarks are recommended for production systems.
2> 842799 WARN (coreLoadExecutor-10830-thread-1) [ x:collection1] o.a.s.s.DenseVectorField The vector dimension 2048 specified for field 2048_float_vector exceeds the current Lucene default max dimension of 1024. It's un-tested territory, extra caution and benchmarks are recommended for production systems.
2> 842799 INFO (coreLoadExecutor-10830-thread-1) [ x:collection1] o.a.s.s.IndexSchema Loaded schema schema-densevector/1.0 with uniqueid field id
2> 842800 INFO (coreLoadExecutor-10830-thread-1) [ x:collection1] o.a.s.c.CoreContainer Creating SolrCore 'collection1' using configuration from instancedir /home/jenkins/jenkins-slave/workspace/Solr/Solr-Check-main/solr/core/build/resources/test/solr/collection1, trusted=true
2> 842800 INFO (coreLoadExecutor-10830-thread-1) [ x:collection1] o.a.s.c.SolrCore Opening new SolrCore at [/home/jenkins/jenkins-slave/workspace/Solr/Solr-Check-main/solr/core/build/resources/test/solr/collection1], dataDir=[/home/jenkins/jenkins-slave/workspace/Solr/Solr-Check-main/solr/core/build/tmp/tests-tmp/solr.schema.DenseVectorFieldTest_F404980FDB6AE07A-001/data-dir-154-001/]
2> 842801 INFO (coreLoadExecutor-10830-thread-1) [ x:collection1] o.a.s.u.RandomMergePolicy RandomMergePolicy wrapping class org.apache.lucene.index.LogByteSizeMergePolicy: [LogByteSizeMergePolicy: minMergeSize=1677721, mergeFactor=40, maxMergeSize=2147483648, maxMergeSizeForForc
[...truncated too long message...]
flag prints help in 884ms
ok 36 create help flag prints help in 869ms
ok 37 createcore help flag prints help in 862ms
ok 38 createcollection help flag prints help in 850ms
ok 39 delete help flag prints help in 889ms
ok 40 version help flag prints help in 47ms # skip Currently the version -help flag doesn't return nice help text!
ok 41 zk help flag prints help in 146ms
ok 42 auth help flag prints help in 146ms
ok 43 assert help flag prints help in 874ms
ok 44 post help flag prints help in 892ms
ok 45 SQL Module in 16555ms
ok 46 Hadoop-Auth Module: KerberosPlugin Classloading in 24210ms
ok 47 icu collation in analysis-extras module in 13111ms
ok 48 package detects no running solr in 222ms
ok 49 lifecycle of package in 9321ms
ok 50 deploying and undeploying of packages in 13521ms
ok 51 Affinity placement plugin using sysprop in 15524ms
ok 52 Random placement plugin using ENV in 17202ms
ok 53 Check help command in 3949ms
ok 54 basic post with a type specified in 5355ms
ok 55 basic post WITHOUT a type specified in 11436ms
ok 56 crawling a directory in 4384ms
ok 57 crawling a web site in 4337ms
ok 58 commit and optimize and delete in 3741ms
ok 59 args mode in 6119ms
ok 60 stdin mode in 3190ms
ok 61 post solr log into solr in 12025ms
ok 62 start solr with ssl in 13346ms
ok 63 start solr with ssl and auth in 16121ms
ok 64 SOLR-11740 check 'solr stop' connection in 14853ms
ok 65 status detects locally running solr in 8645ms
ok 66 status shell script ignores passed in -solrUrl cli parameter from user in 6923ms
ok 67 status help flag outputs message highlighting not to use solrUrl. in 952ms
ok 68 listing out files in 3577ms
ok 69 copying files around in 7141ms
ok 70 upconfig in 2679ms
The slowest tests (exceeding 500 ms) during this run:
56.06s PeerSyncReplicationTest.test (:solr:core)
55.38s TestRandomCollapseQParserPlugin.testRandomCollapseWithSort (:solr:core)
51.14s TestRangeQuery.testRandomRangeQueries (:solr:core)
47.16s ReplicationFactorTest.test (:solr:core)
45.99s TestRandomFlRTGCloud.testRandomizedUpdatesAndRTGs (:solr:core)
44.57s TestRandomFaceting.testRandomFaceting (:solr:core)
42.44s SyncSliceTest.test (:solr:core)
40.21s UnloadDistributedZkTest.test (:solr:core)
39.66s TestRangeQuery.testCompareTypesRandomRangeQueries (:solr:core)
38.42s TestCloudJSONFacetSKG.testRandom (:solr:core)
The slowest suites (exceeding 1s) during this run:
129.28s TestRecoveryHdfs (:solr:modules:hdfs)
101.68s TestRecovery (:solr:core)
92.73s TestRangeQuery (:solr:core)
85.76s TestPullReplica (:solr:core)
63.57s TestRandomCollapseQParserPlugin (:solr:core)
61.59s TestCoordinatorRole (:solr:core)
58.56s ReindexCollectionTest (:solr:core)
56.43s MultiThreadedOCPTest (:solr:core)
56.25s PeerSyncReplicationTest (:solr:core)
53.89s HdfsCloudIncrementalBackupTest (:solr:modules:hdfs)
ERROR: The following test(s) have failed:
- org.apache.solr.schema.DenseVectorFieldTest.denseVectorFieldOnAtomicUpdate_shouldBeUpdatedCorrectly (:solr:core)
Test output: /home/jenkins/jenkins-slave/workspace/Solr/Solr-Check-main/solr/core/build/test-results/test/outputs/OUTPUT-org.apache.solr.schema.DenseVectorFieldTest.txt
Reproduce with: gradlew :solr:core:test --tests "org.apache.solr.schema.DenseVectorFieldTest.denseVectorFieldOnAtomicUpdate_shouldBeUpdatedCorrectly" -Ptests.jvms=4 -Ptests.haltonfailure=false "-Ptests.jvmargs=-XX:TieredStopAtLevel=1 -XX:+UseParallelGC -XX:ActiveProcessorCount=1 -XX:ReservedCodeCacheSize=120m" -Ptests.seed=F404980FDB6AE07A -Ptests.multiplier=2 -Ptests.badapples=false -Ptests.file.encoding=UTF-8
- org.apache.solr.schema.DenseVectorFieldTest.denseVectorField_shouldBePresentAfterAtomicUpdate (:solr:core)
Test output: /home/jenkins/jenkins-slave/workspace/Solr/Solr-Check-main/solr/core/build/test-results/test/outputs/OUTPUT-org.apache.solr.schema.DenseVectorFieldTest.txt
Reproduce with: gradlew :solr:core:test --tests "org.apache.solr.schema.DenseVectorFieldTest.denseVectorField_shouldBePresentAfterAtomicUpdate" -Ptests.jvms=4 -Ptests.haltonfailure=false "-Ptests.jvmargs=-XX:TieredStopAtLevel=1 -XX:+UseParallelGC -XX:ActiveProcessorCount=1 -XX:ReservedCodeCacheSize=120m" -Ptests.seed=F404980FDB6AE07A -Ptests.multiplier=2 -Ptests.badapples=false -Ptests.file.encoding=UTF-8
Deprecated Gradle features were used in this build, making it incompatible with Gradle 8.0.
You can use '--warning-mode all' to show the individual deprecation warnings and determine if they come from your own scripts or plugins.
See https://docs.gradle.org/7.6/userguide/command_line_interface.html#sec:command_line_warnings
BUILD SUCCESSFUL in 54m 35s
595 actionable tasks: 595 executed
Publishing build scan...
https://ge.apache.org/s/nzafjkgdc2vke
Build step 'Invoke Gradle script' changed build result to SUCCESS
Archiving artifacts
hudson.FilePath$ValidateAntFileMask$1Cancel
at hudson.FilePath$ValidateAntFileMask$1.isCaseSensitive(FilePath.java:3300)
at org.apache.tools.ant.DirectoryScanner.isIncluded(DirectoryScanner.java:1370)
at org.apache.tools.ant.DirectoryScanner.scandir(DirectoryScanner.java:1241)
at org.apache.tools.ant.DirectoryScanner.scandir(DirectoryScanner.java:1267)
at org.apache.tools.ant.DirectoryScanner.scandir(DirectoryScanner.java:1267)
at org.apache.tools.ant.DirectoryScanner.scandir(DirectoryScanner.java:1267)
at org.apache.tools.ant.DirectoryScanner.scandir(DirectoryScanner.java:1267)
at org.apache.tools.ant.DirectoryScanner.scandir(DirectoryScanner.java:1267)
at org.apache.tools.ant.DirectoryScanner.scandir(DirectoryScanner.java:1267)
at org.apache.tools.ant.DirectoryScanner.scandir(DirectoryScanner.java:1267)
at org.apache.tools.ant.DirectoryScanner.scandir(DirectoryScanner.java:1267)
at org.apache.tools.ant.DirectoryScanner.scandir(DirectoryScanner.java:1267)
at org.apache.tools.ant.DirectoryScanner.scandir(DirectoryScanner.java:1267)
at org.apache.tools.ant.DirectoryScanner.scandir(DirectoryScanner.java:1194)
at org.apache.tools.ant.DirectoryScanner.scandir(DirectoryScanner.java:1156)
at org.apache.tools.ant.DirectoryScanner.checkIncludePatterns(DirectoryScanner.java:954)
at org.apache.tools.ant.DirectoryScanner.scan(DirectoryScanner.java:912)
at hudson.FilePath$ValidateAntFileMask.hasMatch(FilePath.java:3313)
Caused: hudson.FilePath$FileMaskNoMatchesFoundException: no matches found within 10000
at hudson.FilePath$ValidateAntFileMask.hasMatch(FilePath.java:3318)
at hudson.FilePath$ValidateAntFileMask.invoke(FilePath.java:3196)
at hudson.FilePath$ValidateAntFileMask.invoke(FilePath.java:3174)
at hudson.FilePath$FileCallableWrapper.call(FilePath.java:3578)
Also: hudson.remoting.Channel$CallSiteStackTrace: Remote call to lucene-solr-1
at hudson.remoting.Channel.attachCallSiteStackTrace(Channel.java:1784)
at hudson.remoting.UserRequest$ExceptionResponse.retrieve(UserRequest.java:356)
at hudson.remoting.Channel.call(Channel.java:1000)
at hudson.FilePath.act(FilePath.java:1192)
at hudson.FilePath.act(FilePath.java:1181)
at hudson.FilePath.validateAntFileMask(FilePath.java:3171)
at hudson.tasks.ArtifactArchiver.perform(ArtifactArchiver.java:271)
at hudson.tasks.BuildStepCompatibilityLayer.perform(BuildStepCompatibilityLayer.java:80)
at hudson.tasks.BuildStepMonitor$1.perform(BuildStepMonitor.java:20)
at hudson.model.AbstractBuild$AbstractBuildExecution.perform(AbstractBuild.java:818)
at hudson.model.AbstractBuild$AbstractBuildExecution.performAllBuildSteps(AbstractBuild.java:767)
at hudson.model.Build$BuildExecution.post2(Build.java:179)
at hudson.model.AbstractBuild$AbstractBuildExecution.post(AbstractBuild.java:711)
at hudson.model.Run.execute(Run.java:1925)
at hudson.model.FreeStyleBuild.run(FreeStyleBuild.java:44)
at hudson.model.ResourceController.execute(ResourceController.java:101)
at hudson.model.Executor.run(Executor.java:442)
Caused: hudson.FilePath$TunneledInterruptedException
at hudson.FilePath$FileCallableWrapper.call(FilePath.java:3580)
at hudson.remoting.UserRequest.perform(UserRequest.java:211)
at hudson.remoting.UserRequest.perform(UserRequest.java:54)
at hudson.remoting.Request$2.run(Request.java:377)
at hudson.remoting.InterceptingExecutorService.lambda$wrap$0(InterceptingExecutorService.java:78)
at java.base/java.util.concurrent.FutureTask.run(FutureTask.java:264)
at java.base/java.util.concurrent.ThreadPoolExecutor.runWorker(ThreadPoolExecutor.java:1128)
at java.base/java.util.concurrent.ThreadPoolExecutor$Worker.run(ThreadPoolExecutor.java:628)
at java.base/java.lang.Thread.run(Thread.java:829)
Caused: java.lang.InterruptedException: hudson.FilePath$FileMaskNoMatchesFoundException: no matches found within 10000
at hudson.FilePath.act(FilePath.java:1194)
at hudson.FilePath.act(FilePath.java:1181)
at hudson.FilePath.validateAntFileMask(FilePath.java:3171)
at hudson.tasks.ArtifactArchiver.perform(ArtifactArchiver.java:271)
at hudson.tasks.BuildStepCompatibilityLayer.perform(BuildStepCompatibilityLayer.java:80)
at hudson.tasks.BuildStepMonitor$1.perform(BuildStepMonitor.java:20)
at hudson.model.AbstractBuild$AbstractBuildExecution.perform(AbstractBuild.java:818)
at hudson.model.AbstractBuild$AbstractBuildExecution.performAllBuildSteps(AbstractBuild.java:767)
at hudson.model.Build$BuildExecution.post2(Build.java:179)
at hudson.model.AbstractBuild$AbstractBuildExecution.post(AbstractBuild.java:711)
at hudson.model.Run.execute(Run.java:1925)
at hudson.model.FreeStyleBuild.run(FreeStyleBuild.java:44)
at hudson.model.ResourceController.execute(ResourceController.java:101)
at hudson.model.Executor.run(Executor.java:442)
No artifacts found that match the file pattern "**/*.events,heapdumps/**,**/hs_err_pid*". Configuration error?
Recording test results
[Checks API] No suitable checks publisher found.
Build step 'Publish JUnit test result report' changed build result to UNSTABLE
Email was triggered for: Unstable (Test Failures)
Sending email for trigger: Unstable (Test Failures)