You are viewing a plain text version of this content. The canonical link for it is here.
Posted to builds@beam.apache.org by Apache Jenkins Server <je...@builds.apache.org> on 2021/06/18 14:09:17 UTC
Build failed in Jenkins: beam_PostCommit_Py_VR_Dataflow #8042
See <https://ci-beam.apache.org/job/beam_PostCommit_Py_VR_Dataflow/8042/display/redirect>
Changes:
------------------------------------------
[...truncated 257.62 KB...]
apache_beam/io/filesystems_test.py:54
apache_beam/io/filesystems_test.py:54
apache_beam/io/filesystems_test.py:54
apache_beam/io/filesystems_test.py:54
apache_beam/io/filesystems_test.py:54
apache_beam/io/filesystems_test.py:54
<https://ci-beam.apache.org/job/beam_PostCommit_Py_VR_Dataflow/ws/src/sdks/python/apache_beam/io/filesystems_test.py>:54: DeprecationWarning: invalid escape sequence \c
self.assertIsNone(FileSystems.get_scheme('c:\\abc\cdf')) # pylint: disable=anomalous-backslash-in-string
apache_beam/io/filesystems_test.py:62
apache_beam/io/filesystems_test.py:62
apache_beam/io/filesystems_test.py:62
apache_beam/io/filesystems_test.py:62
apache_beam/io/filesystems_test.py:62
apache_beam/io/filesystems_test.py:62
apache_beam/io/filesystems_test.py:62
apache_beam/io/filesystems_test.py:62
<https://ci-beam.apache.org/job/beam_PostCommit_Py_VR_Dataflow/ws/src/sdks/python/apache_beam/io/filesystems_test.py>:62: DeprecationWarning: invalid escape sequence \d
self.assertTrue(isinstance(FileSystems.get_filesystem('c:\\abc\def'), # pylint: disable=anomalous-backslash-in-string
-- Docs: https://docs.pytest.org/en/latest/warnings.html
- generated xml file: <https://ci-beam.apache.org/job/beam_PostCommit_Py_VR_Dataflow/ws/src/sdks/python/pytest_validatesRunnerBatchTests-df-py37.xml> -
[31m[1m======== 1 failed, 31 passed, 3 skipped, 16 warnings in 5144.26 seconds ========[0m
> Task :sdks:python:test-suites:dataflow:py37:validatesRunnerBatchTests FAILED
> Task :sdks:python:test-suites:dataflow:py37:validatesRunnerStreamingTests
>>> RUNNING integration tests with pipeline options: --runner=TestDataflowRunner --project=apache-beam-testing --region=us-central1 --staging_location=gs://temp-storage-for-end-to-end-tests/staging-it --temp_location=gs://temp-storage-for-end-to-end-tests/temp-it --output=gs://temp-storage-for-end-to-end-tests/py-it-cloud/output --sdk_location=<https://ci-beam.apache.org/job/beam_PostCommit_Py_VR_Dataflow/ws/src/sdks/python/build/apache-beam.tar.gz> --requirements_file=postcommit_requirements.txt --num_workers=1 --sleep_secs=20 --streaming --dataflow_worker_jar=<https://ci-beam.apache.org/job/beam_PostCommit_Py_VR_Dataflow/ws/src/runners/google-cloud-dataflow-java/worker/build/libs/beam-runners-google-cloud-dataflow-java-fn-api-worker-2.32.0-SNAPSHOT.jar> --kms_key_name=projects/apache-beam-testing/locations/global/keyRings/beam-it/cryptoKeys/test --dataflow_kms_key=projects/apache-beam-testing/locations/global/keyRings/beam-it/cryptoKeys/test
>>> pytest options: --capture=no --timeout=4500 --color=yes --log-cli-level=INFO --numprocesses=8
>>> collect markers: -m=it_validatesrunner and not no_sickbay_streaming and not no_xdist
[1m============================= test session starts ==============================[0m
platform linux -- Python 3.7.3, pytest-4.6.11, py-1.10.0, pluggy-0.13.1
rootdir: <https://ci-beam.apache.org/job/beam_PostCommit_Py_VR_Dataflow/ws/src/sdks/python,> inifile: pytest.ini
plugins: xdist-1.34.0, timeout-1.4.2, forked-1.3.0, requests-mock-1.9.3
timeout: 4500.0s
timeout method: signal
timeout func_only: False
gw0 I / gw1 I / gw2 I / gw3 I / gw4 I / gw5 I / gw6 I / gw7 I
[1m[gw0] Python 3.7.3 (default, Mar 26 2019, 01:59:45) -- [GCC 5.4.0 20160609]
[0m[1m[gw1] Python 3.7.3 (default, Mar 26 2019, 01:59:45) -- [GCC 5.4.0 20160609]
[0m[1m[gw2] Python 3.7.3 (default, Mar 26 2019, 01:59:45) -- [GCC 5.4.0 20160609]
[0m[1m[gw4] Python 3.7.3 (default, Mar 26 2019, 01:59:45) -- [GCC 5.4.0 20160609]
[0m[1m[gw3] Python 3.7.3 (default, Mar 26 2019, 01:59:45) -- [GCC 5.4.0 20160609]
[0m[1m[gw5] Python 3.7.3 (default, Mar 26 2019, 01:59:45) -- [GCC 5.4.0 20160609]
[0m[1m[gw6] Python 3.7.3 (default, Mar 26 2019, 01:59:45) -- [GCC 5.4.0 20160609]
[0m[1m[gw7] Python 3.7.3 (default, Mar 26 2019, 01:59:45) -- [GCC 5.4.0 20160609]
[0mgw0 [32] / gw1 [32] / gw2 [32] / gw3 [32] / gw4 [32] / gw5 [32] / gw6 [32] / gw7 [32]
scheduling tests via LoadScheduling
apache_beam/transforms/combinefn_lifecycle_test.py::CombineFnLifecycleTest::test_combining_value_state
apache_beam/pipeline_test.py::DoFnTest::test_key_param
apache_beam/runners/portability/fn_api_runner/translations_test.py::TranslationsTest::test_run_packable_combine_globally
apache_beam/pipeline_test.py::DoFnTest::test_element_param
apache_beam/transforms/combinefn_lifecycle_test.py::CombineFnLifecycleTest::test_combine
apache_beam/runners/portability/fn_api_runner/fn_runner_test.py::FnApiBasedStateBackedCoderTest::test_gbk_many_values
apache_beam/metrics/metric_test.py::MetricsTest::test_user_counter_using_pardo
apache_beam/runners/portability/fn_api_runner/translations_test.py::TranslationsTest::test_run_packable_combine_per_key
[gw7] [33mSKIPPED[0m apache_beam/transforms/combinefn_lifecycle_test.py::CombineFnLifecycleTest::test_combining_value_state
apache_beam/transforms/ptransform_test.py::PTransformTest::test_flatten_pcollections
[gw6] [33mSKIPPED[0m apache_beam/transforms/combinefn_lifecycle_test.py::CombineFnLifecycleTest::test_combine
apache_beam/transforms/ptransform_test.py::PTransformTest::test_flatten_one_single_pcollection
[gw4] [32mPASSED[0m apache_beam/runners/portability/fn_api_runner/fn_runner_test.py::FnApiBasedStateBackedCoderTest::test_gbk_many_values
apache_beam/transforms/dofn_lifecycle_test.py::DoFnLifecycleTest::test_dofn_lifecycle
[gw2] [32mPASSED[0m apache_beam/metrics/metric_test.py::MetricsTest::test_user_counter_using_pardo
apache_beam/transforms/combiners_test.py::TimestampCombinerTest::test_combiner_latest
[gw2] [32mPASSED[0m apache_beam/transforms/combiners_test.py::TimestampCombinerTest::test_combiner_latest
apache_beam/transforms/ptransform_test.py::PTransformTest::test_par_do_with_multiple_outputs_and_using_yield
[gw0] [32mPASSED[0m apache_beam/pipeline_test.py::DoFnTest::test_element_param
apache_beam/transforms/combinefn_lifecycle_test.py::CombineFnLifecycleTest::test_non_liftable_combine
[gw0] [33mSKIPPED[0m apache_beam/transforms/combinefn_lifecycle_test.py::CombineFnLifecycleTest::test_non_liftable_combine
apache_beam/transforms/sideinputs_test.py::SideInputsTest::test_as_dict_twice
[gw1] [32mPASSED[0m apache_beam/pipeline_test.py::DoFnTest::test_key_param
apache_beam/transforms/combiners_test.py::TimestampCombinerTest::test_combiner_earliest
[gw1] [32mPASSED[0m apache_beam/transforms/combiners_test.py::TimestampCombinerTest::test_combiner_earliest
apache_beam/transforms/sideinputs_test.py::SideInputsTest::test_as_list_twice
[gw4] [32mPASSED[0m apache_beam/transforms/dofn_lifecycle_test.py::DoFnLifecycleTest::test_dofn_lifecycle
apache_beam/transforms/ptransform_test.py::PTransformTest::test_par_do_with_multiple_outputs_and_using_return
[gw7] [32mPASSED[0m apache_beam/transforms/ptransform_test.py::PTransformTest::test_flatten_pcollections
apache_beam/transforms/ptransform_test.py::PTransformTest::test_impulse
[gw6] [32mPASSED[0m apache_beam/transforms/ptransform_test.py::PTransformTest::test_flatten_one_single_pcollection
apache_beam/transforms/ptransform_test.py::PTransformTest::test_multiple_empty_outputs
[gw5] [32mPASSED[0m apache_beam/runners/portability/fn_api_runner/translations_test.py::TranslationsTest::test_run_packable_combine_per_key
apache_beam/transforms/ptransform_test.py::PTransformTest::test_flatten_multiple_pcollections_having_multiple_consumers
[gw3] [32mPASSED[0m apache_beam/runners/portability/fn_api_runner/translations_test.py::TranslationsTest::test_run_packable_combine_globally
apache_beam/transforms/ptransform_test.py::PTransformTest::test_flatten_a_flattened_pcollection
[gw2] [32mPASSED[0m apache_beam/transforms/ptransform_test.py::PTransformTest::test_par_do_with_multiple_outputs_and_using_yield
apache_beam/transforms/ptransform_test.py::PTransformTest::test_undeclared_outputs
[gw6] [32mPASSED[0m apache_beam/transforms/ptransform_test.py::PTransformTest::test_multiple_empty_outputs
apache_beam/transforms/sideinputs_test.py::SideInputsTest::test_empty_singleton_side_input
[gw4] [32mPASSED[0m apache_beam/transforms/ptransform_test.py::PTransformTest::test_par_do_with_multiple_outputs_and_using_return
apache_beam/transforms/sideinputs_test.py::SideInputsTest::test_as_singleton_without_unique_labels
[gw7] [32mPASSED[0m apache_beam/transforms/ptransform_test.py::PTransformTest::test_impulse
apache_beam/transforms/sideinputs_test.py::SideInputsTest::test_default_value_singleton_side_input
[gw0] [32mPASSED[0m apache_beam/transforms/sideinputs_test.py::SideInputsTest::test_as_dict_twice
apache_beam/transforms/sideinputs_test.py::SideInputsTest::test_as_list_and_as_dict_side_inputs
[gw3] [32mPASSED[0m apache_beam/transforms/ptransform_test.py::PTransformTest::test_flatten_a_flattened_pcollection
apache_beam/transforms/sideinputs_test.py::SideInputsTest::test_iterable_side_input
[gw5] [32mPASSED[0m apache_beam/transforms/ptransform_test.py::PTransformTest::test_flatten_multiple_pcollections_having_multiple_consumers
apache_beam/transforms/sideinputs_test.py::SideInputsTest::test_flattened_side_input
[gw1] [32mPASSED[0m apache_beam/transforms/sideinputs_test.py::SideInputsTest::test_as_list_twice
apache_beam/transforms/sideinputs_test.py::SideInputsTest::test_as_singleton_with_different_defaults
[gw2] [32mPASSED[0m apache_beam/transforms/ptransform_test.py::PTransformTest::test_undeclared_outputs
apache_beam/transforms/sideinputs_test.py::SideInputsTest::test_reiterable_side_input
[gw6] [32mPASSED[0m apache_beam/transforms/sideinputs_test.py::SideInputsTest::test_empty_singleton_side_input
apache_beam/transforms/util_test.py::ReshuffleTest::test_reshuffle_preserves_timestamps
[gw7] [32mPASSED[0m apache_beam/transforms/sideinputs_test.py::SideInputsTest::test_default_value_singleton_side_input
[gw4] [32mPASSED[0m apache_beam/transforms/sideinputs_test.py::SideInputsTest::test_as_singleton_without_unique_labels
[gw3] [32mPASSED[0m apache_beam/transforms/sideinputs_test.py::SideInputsTest::test_iterable_side_input
[gw0] [32mPASSED[0m apache_beam/transforms/sideinputs_test.py::SideInputsTest::test_as_list_and_as_dict_side_inputs
[gw5] [32mPASSED[0m apache_beam/transforms/sideinputs_test.py::SideInputsTest::test_flattened_side_input
[gw1] [32mPASSED[0m apache_beam/transforms/sideinputs_test.py::SideInputsTest::test_as_singleton_with_different_defaults
[gw6] [32mPASSED[0m apache_beam/transforms/util_test.py::ReshuffleTest::test_reshuffle_preserves_timestamps
[gw2] [32mPASSED[0m apache_beam/transforms/sideinputs_test.py::SideInputsTest::test_reiterable_side_input
- generated xml file: <https://ci-beam.apache.org/job/beam_PostCommit_Py_VR_Dataflow/ws/src/sdks/python/pytest_validatesRunnerStreamingTests-df-py37-xdist.xml> -
[32m[1m=================== 29 passed, 3 skipped in 1996.12 seconds ====================[0m
>>> RUNNING integration tests with pipeline options: --runner=TestDataflowRunner --project=apache-beam-testing --region=us-central1 --staging_location=gs://temp-storage-for-end-to-end-tests/staging-it --temp_location=gs://temp-storage-for-end-to-end-tests/temp-it --output=gs://temp-storage-for-end-to-end-tests/py-it-cloud/output --sdk_location=<https://ci-beam.apache.org/job/beam_PostCommit_Py_VR_Dataflow/ws/src/sdks/python/build/apache-beam.tar.gz> --requirements_file=postcommit_requirements.txt --num_workers=1 --sleep_secs=20 --streaming --dataflow_worker_jar=<https://ci-beam.apache.org/job/beam_PostCommit_Py_VR_Dataflow/ws/src/runners/google-cloud-dataflow-java/worker/build/libs/beam-runners-google-cloud-dataflow-java-fn-api-worker-2.32.0-SNAPSHOT.jar> --kms_key_name=projects/apache-beam-testing/locations/global/keyRings/beam-it/cryptoKeys/test --dataflow_kms_key=projects/apache-beam-testing/locations/global/keyRings/beam-it/cryptoKeys/test
>>> pytest options: --capture=no --timeout=4500 --color=yes --log-cli-level=INFO
>>> collect markers: -m=it_validatesrunner and not no_sickbay_streaming and no_xdist
[1m============================= test session starts ==============================[0m
platform linux -- Python 3.7.3, pytest-4.6.11, py-1.10.0, pluggy-0.13.1
rootdir: <https://ci-beam.apache.org/job/beam_PostCommit_Py_VR_Dataflow/ws/src/sdks/python,> inifile: pytest.ini
plugins: xdist-1.34.0, timeout-1.4.2, forked-1.3.0, requests-mock-1.9.3
timeout: 4500.0s
timeout method: signal
timeout func_only: False
[1m----------------------------- live log collection ------------------------------[0m
[33mWARNING [0m root:avroio_test.py:56 python-snappy is not installed; some tests will be skipped.
[33mWARNING [0m root:tfrecordio_test.py:55 Tensorflow is not installed, so skipping some tests.
[33mWARNING [0m apache_beam.runners.interactive.interactive_environment:interactive_environment.py:181 Dependencies required for Interactive Beam PCollection visualization are not available, please use: `pip install apache-beam[interactive]` to install necessary dependencies to enable all data visualization features.
[33mWARNING [0m apache_beam.runners.interactive.interactive_environment:interactive_environment.py:190 You cannot use Interactive Beam features when you are not in an interactive environment such as a Jupyter notebook or ipython terminal.
[33mWARNING [0m root:environments.py:374 Make sure that locally built Python SDK docker image has Python 3.7 interpreter.
[32mINFO [0m root:environments.py:380 Default Python SDK image for environment is apache/beam_python3.7_sdk:2.32.0.dev
collected 4756 items / 4755 deselected / 1 selected
apache_beam/runners/dataflow/dataflow_exercise_streaming_metrics_pipeline_test.py::ExerciseStreamingMetricsPipelineTest::test_streaming_pipeline_returns_expected_user_metrics_fnapi_it
[1m-------------------------------- live log call ---------------------------------[0m
[32mINFO [0m apache_beam.runners.portability.stager:stager.py:644 Executing command: ['<https://ci-beam.apache.org/job/beam_PostCommit_Py_VR_Dataflow/ws/src/build/gradleenv/-1734967052/bin/python3.7',> '-m', 'pip', 'download', '--dest', '/tmp/dataflow-requirements-cache', '-r', 'postcommit_requirements.txt', '--exists-action', 'i', '--no-binary', ':all:']
[32mINFO [0m apache_beam.runners.portability.stager:stager.py:300 Copying Beam SDK "<https://ci-beam.apache.org/job/beam_PostCommit_Py_VR_Dataflow/ws/src/sdks/python/build/apache-beam.tar.gz"> to staging location.
[33mWARNING [0m root:environments.py:374 Make sure that locally built Python SDK docker image has Python 3.7 interpreter.
[32mINFO [0m root:environments.py:380 Default Python SDK image for environment is apache/beam_python3.7_sdk:2.32.0.dev
[32mINFO [0m root:environments.py:296 Using provided Python SDK container image: gcr.io/cloud-dataflow/v1beta3/python37-fnapi:beam-master-20210615
[32mINFO [0m root:environments.py:304 Python SDK container image set to "gcr.io/cloud-dataflow/v1beta3/python37-fnapi:beam-master-20210615" for Docker environment
[32mINFO [0m apache_beam.internal.gcp.auth:auth.py:106 Setting socket default timeout to 60 seconds.
[32mINFO [0m apache_beam.internal.gcp.auth:auth.py:109 socket default timeout is 60.0 seconds.
[32mINFO [0m apache_beam.runners.dataflow.internal.apiclient:apiclient.py:632 Starting GCS upload to gs://temp-storage-for-end-to-end-tests/staging-it/beamapp-jenkins-0618140152-389655.1624024912.389792/requirements.txt...
[32mINFO [0m oauth2client.transport:transport.py:157 Attempting refresh to obtain initial access_token
[32mINFO [0m oauth2client.transport:transport.py:157 Attempting refresh to obtain initial access_token
[32mINFO [0m apache_beam.runners.dataflow.internal.apiclient:apiclient.py:651 Completed GCS upload to gs://temp-storage-for-end-to-end-tests/staging-it/beamapp-jenkins-0618140152-389655.1624024912.389792/requirements.txt in 0 seconds.
[32mINFO [0m apache_beam.runners.dataflow.internal.apiclient:apiclient.py:632 Starting GCS upload to gs://temp-storage-for-end-to-end-tests/staging-it/beamapp-jenkins-0618140152-389655.1624024912.389792/pickled_main_session...
[32mINFO [0m apache_beam.runners.dataflow.internal.apiclient:apiclient.py:651 Completed GCS upload to gs://temp-storage-for-end-to-end-tests/staging-it/beamapp-jenkins-0618140152-389655.1624024912.389792/pickled_main_session in 0 seconds.
[32mINFO [0m apache_beam.runners.dataflow.internal.apiclient:apiclient.py:632 Starting GCS upload to gs://temp-storage-for-end-to-end-tests/staging-it/beamapp-jenkins-0618140152-389655.1624024912.389792/pbr-5.6.0.tar.gz...
[32mINFO [0m apache_beam.runners.dataflow.internal.apiclient:apiclient.py:651 Completed GCS upload to gs://temp-storage-for-end-to-end-tests/staging-it/beamapp-jenkins-0618140152-389655.1624024912.389792/pbr-5.6.0.tar.gz in 0 seconds.
[32mINFO [0m apache_beam.runners.dataflow.internal.apiclient:apiclient.py:632 Starting GCS upload to gs://temp-storage-for-end-to-end-tests/staging-it/beamapp-jenkins-0618140152-389655.1624024912.389792/mock-2.0.0.tar.gz...
[32mINFO [0m apache_beam.runners.dataflow.internal.apiclient:apiclient.py:651 Completed GCS upload to gs://temp-storage-for-end-to-end-tests/staging-it/beamapp-jenkins-0618140152-389655.1624024912.389792/mock-2.0.0.tar.gz in 0 seconds.
[32mINFO [0m apache_beam.runners.dataflow.internal.apiclient:apiclient.py:632 Starting GCS upload to gs://temp-storage-for-end-to-end-tests/staging-it/beamapp-jenkins-0618140152-389655.1624024912.389792/six-1.16.0.tar.gz...
[32mINFO [0m apache_beam.runners.dataflow.internal.apiclient:apiclient.py:651 Completed GCS upload to gs://temp-storage-for-end-to-end-tests/staging-it/beamapp-jenkins-0618140152-389655.1624024912.389792/six-1.16.0.tar.gz in 0 seconds.
[32mINFO [0m apache_beam.runners.dataflow.internal.apiclient:apiclient.py:632 Starting GCS upload to gs://temp-storage-for-end-to-end-tests/staging-it/beamapp-jenkins-0618140152-389655.1624024912.389792/soupsieve-2.1.tar.gz...
[32mINFO [0m apache_beam.runners.dataflow.internal.apiclient:apiclient.py:651 Completed GCS upload to gs://temp-storage-for-end-to-end-tests/staging-it/beamapp-jenkins-0618140152-389655.1624024912.389792/soupsieve-2.1.tar.gz in 0 seconds.
[32mINFO [0m apache_beam.runners.dataflow.internal.apiclient:apiclient.py:632 Starting GCS upload to gs://temp-storage-for-end-to-end-tests/staging-it/beamapp-jenkins-0618140152-389655.1624024912.389792/soupsieve-2.2.1.tar.gz...
[32mINFO [0m apache_beam.runners.dataflow.internal.apiclient:apiclient.py:651 Completed GCS upload to gs://temp-storage-for-end-to-end-tests/staging-it/beamapp-jenkins-0618140152-389655.1624024912.389792/soupsieve-2.2.1.tar.gz in 0 seconds.
[32mINFO [0m apache_beam.runners.dataflow.internal.apiclient:apiclient.py:632 Starting GCS upload to gs://temp-storage-for-end-to-end-tests/staging-it/beamapp-jenkins-0618140152-389655.1624024912.389792/PyHamcrest-1.10.1.tar.gz...
[32mINFO [0m apache_beam.runners.dataflow.internal.apiclient:apiclient.py:651 Completed GCS upload to gs://temp-storage-for-end-to-end-tests/staging-it/beamapp-jenkins-0618140152-389655.1624024912.389792/PyHamcrest-1.10.1.tar.gz in 0 seconds.
[32mINFO [0m apache_beam.runners.dataflow.internal.apiclient:apiclient.py:632 Starting GCS upload to gs://temp-storage-for-end-to-end-tests/staging-it/beamapp-jenkins-0618140152-389655.1624024912.389792/parameterized-0.7.5.tar.gz...
[32mINFO [0m apache_beam.runners.dataflow.internal.apiclient:apiclient.py:651 Completed GCS upload to gs://temp-storage-for-end-to-end-tests/staging-it/beamapp-jenkins-0618140152-389655.1624024912.389792/parameterized-0.7.5.tar.gz in 0 seconds.
[32mINFO [0m apache_beam.runners.dataflow.internal.apiclient:apiclient.py:632 Starting GCS upload to gs://temp-storage-for-end-to-end-tests/staging-it/beamapp-jenkins-0618140152-389655.1624024912.389792/beautifulsoup4-4.9.3.tar.gz...
[32mINFO [0m apache_beam.runners.dataflow.internal.apiclient:apiclient.py:651 Completed GCS upload to gs://temp-storage-for-end-to-end-tests/staging-it/beamapp-jenkins-0618140152-389655.1624024912.389792/beautifulsoup4-4.9.3.tar.gz in 0 seconds.
[32mINFO [0m apache_beam.runners.dataflow.internal.apiclient:apiclient.py:632 Starting GCS upload to gs://temp-storage-for-end-to-end-tests/staging-it/beamapp-jenkins-0618140152-389655.1624024912.389792/dataflow_python_sdk.tar...
[32mINFO [0m apache_beam.runners.dataflow.internal.apiclient:apiclient.py:651 Completed GCS upload to gs://temp-storage-for-end-to-end-tests/staging-it/beamapp-jenkins-0618140152-389655.1624024912.389792/dataflow_python_sdk.tar in 0 seconds.
[32mINFO [0m apache_beam.runners.dataflow.internal.apiclient:apiclient.py:632 Starting GCS upload to gs://temp-storage-for-end-to-end-tests/staging-it/beamapp-jenkins-0618140152-389655.1624024912.389792/dataflow-worker.jar...
[32mINFO [0m apache_beam.runners.dataflow.internal.apiclient:apiclient.py:651 Completed GCS upload to gs://temp-storage-for-end-to-end-tests/staging-it/beamapp-jenkins-0618140152-389655.1624024912.389792/dataflow-worker.jar in 5 seconds.
[32mINFO [0m apache_beam.runners.dataflow.internal.apiclient:apiclient.py:632 Starting GCS upload to gs://temp-storage-for-end-to-end-tests/staging-it/beamapp-jenkins-0618140152-389655.1624024912.389792/pipeline.pb...
[32mINFO [0m apache_beam.runners.dataflow.internal.apiclient:apiclient.py:651 Completed GCS upload to gs://temp-storage-for-end-to-end-tests/staging-it/beamapp-jenkins-0618140152-389655.1624024912.389792/pipeline.pb in 0 seconds.
[33mWARNING [0m apache_beam.options.pipeline_options:pipeline_options.py:309 Discarding unparseable args: ['--sleep_secs=20', '--kms_key_name=projects/apache-beam-testing/locations/global/keyRings/beam-it/cryptoKeys/test']
[33mWARNING [0m apache_beam.options.pipeline_options:pipeline_options.py:309 Discarding unparseable args: ['--sleep_secs=20', '--kms_key_name=projects/apache-beam-testing/locations/global/keyRings/beam-it/cryptoKeys/test']
[32mINFO [0m apache_beam.runners.dataflow.internal.apiclient:apiclient.py:798 Create job: <Job
createTime: '2021-06-18T14:02:00.708318Z'
currentStateTime: '1970-01-01T00:00:00Z'
id: '2021-06-18_07_01_59-5712331605803490283'
location: 'us-central1'
name: 'beamapp-jenkins-0618140152-389655'
projectId: 'apache-beam-testing'
stageStates: []
startTime: '2021-06-18T14:02:00.708318Z'
steps: []
tempFiles: []
type: TypeValueValuesEnum(JOB_TYPE_STREAMING, 2)>
[32mINFO [0m apache_beam.runners.dataflow.internal.apiclient:apiclient.py:800 Created job with id: [2021-06-18_07_01_59-5712331605803490283]
[32mINFO [0m apache_beam.runners.dataflow.internal.apiclient:apiclient.py:801 Submitted job: 2021-06-18_07_01_59-5712331605803490283
[32mINFO [0m apache_beam.runners.dataflow.internal.apiclient:apiclient.py:807 To access the Dataflow monitoring console, please navigate to https://console.cloud.google.com/dataflow/jobs/us-central1/2021-06-18_07_01_59-5712331605803490283?project=apache-beam-testing
Worker logs: https://console.cloud.google.com/dataflow/jobs/us-central1/2021-06-18_07_01_59-5712331605803490283?project=apache-beam-testing
[32mINFO [0m apache_beam.runners.dataflow.dataflow_runner:dataflow_runner.py:191 Job 2021-06-18_07_01_59-5712331605803490283 is in state JOB_STATE_RUNNING
[32mINFO [0m apache_beam.runners.dataflow.dataflow_runner:dataflow_runner.py:236 2021-06-18T14:02:05.318Z: JOB_MESSAGE_BASIC: Worker configuration: n1-standard-4 in us-central1-f.
[32mINFO [0m apache_beam.runners.dataflow.dataflow_runner:dataflow_runner.py:236 2021-06-18T14:02:06.302Z: JOB_MESSAGE_DETAILED: Expanding SplittableParDo operations into optimizable parts.
[32mINFO [0m apache_beam.runners.dataflow.dataflow_runner:dataflow_runner.py:236 2021-06-18T14:02:06.333Z: JOB_MESSAGE_DETAILED: Expanding CollectionToSingleton operations into optimizable parts.
[32mINFO [0m apache_beam.runners.dataflow.dataflow_runner:dataflow_runner.py:236 2021-06-18T14:02:06.400Z: JOB_MESSAGE_DETAILED: Expanding CoGroupByKey operations into optimizable parts.
[32mINFO [0m apache_beam.runners.dataflow.dataflow_runner:dataflow_runner.py:236 2021-06-18T14:02:06.483Z: JOB_MESSAGE_DETAILED: Expanding SplittableProcessKeyed operations into optimizable parts.
[32mINFO [0m apache_beam.runners.dataflow.dataflow_runner:dataflow_runner.py:236 2021-06-18T14:02:06.511Z: JOB_MESSAGE_DETAILED: Expanding GroupByKey operations into streaming Read/Write steps
[32mINFO [0m apache_beam.runners.dataflow.dataflow_runner:dataflow_runner.py:236 2021-06-18T14:02:06.543Z: JOB_MESSAGE_DEBUG: Annotating graph with Autotuner information.
[32mINFO [0m apache_beam.runners.dataflow.dataflow_runner:dataflow_runner.py:236 2021-06-18T14:02:06.583Z: JOB_MESSAGE_DETAILED: Fusing adjacent ParDo, Read, Write, and Flatten operations
[32mINFO [0m apache_beam.runners.dataflow.dataflow_runner:dataflow_runner.py:236 2021-06-18T14:02:06.607Z: JOB_MESSAGE_DETAILED: Fusing consumer generate_metrics into ReadFromPubSub/Read
[32mINFO [0m apache_beam.runners.dataflow.dataflow_runner:dataflow_runner.py:236 2021-06-18T14:02:06.640Z: JOB_MESSAGE_DETAILED: Fusing consumer dump_to_pub/ToProtobuf into generate_metrics
[32mINFO [0m apache_beam.runners.dataflow.dataflow_runner:dataflow_runner.py:236 2021-06-18T14:02:06.675Z: JOB_MESSAGE_DETAILED: Fusing consumer dump_to_pub/Write/NativeWrite into dump_to_pub/ToProtobuf
[32mINFO [0m apache_beam.runners.dataflow.dataflow_runner:dataflow_runner.py:236 2021-06-18T14:02:06.711Z: JOB_MESSAGE_DEBUG: Workflow config is missing a default resource spec.
[32mINFO [0m apache_beam.runners.dataflow.dataflow_runner:dataflow_runner.py:236 2021-06-18T14:02:06.740Z: JOB_MESSAGE_DEBUG: Adding StepResource setup and teardown to workflow graph.
[32mINFO [0m apache_beam.runners.dataflow.dataflow_runner:dataflow_runner.py:236 2021-06-18T14:02:06.775Z: JOB_MESSAGE_DEBUG: Adding workflow start and stop steps.
[32mINFO [0m apache_beam.runners.dataflow.dataflow_runner:dataflow_runner.py:236 2021-06-18T14:02:06.805Z: JOB_MESSAGE_DEBUG: Assigning stage ids.
[32mINFO [0m apache_beam.runners.dataflow.dataflow_runner:dataflow_runner.py:236 2021-06-18T14:02:06.965Z: JOB_MESSAGE_DEBUG: Executing wait step start17
[32mINFO [0m apache_beam.runners.dataflow.dataflow_runner:dataflow_runner.py:236 2021-06-18T14:02:07.034Z: JOB_MESSAGE_BASIC: Executing operation ReadFromPubSub/Read+generate_metrics+dump_to_pub/ToProtobuf+dump_to_pub/Write/NativeWrite
[32mINFO [0m apache_beam.runners.dataflow.dataflow_runner:dataflow_runner.py:236 2021-06-18T14:02:07.066Z: JOB_MESSAGE_DEBUG: Starting worker pool setup.
[32mINFO [0m apache_beam.runners.dataflow.dataflow_runner:dataflow_runner.py:236 2021-06-18T14:02:07.101Z: JOB_MESSAGE_BASIC: Starting 1 workers in us-central1-f...
[32mINFO [0m apache_beam.runners.dataflow.dataflow_runner:dataflow_runner.py:236 2021-06-18T14:02:35.546Z: JOB_MESSAGE_BASIC: Your project already contains 100 Dataflow-created metric descriptors, so new user metrics of the form custom.googleapis.com/* will not be created. However, all user metrics are also available in the metric dataflow.googleapis.com/job/user_counter. If you rely on the custom metrics, you can delete old / unused metric descriptors. See https://developers.google.com/apis-explorer/#p/monitoring/v3/monitoring.projects.metricDescriptors.list and https://developers.google.com/apis-explorer/#p/monitoring/v3/monitoring.projects.metricDescriptors.delete
[32mINFO [0m apache_beam.runners.dataflow.dataflow_runner:dataflow_runner.py:236 2021-06-18T14:02:58.214Z: JOB_MESSAGE_DETAILED: Autoscaling: Raised the number of workers to 1 so that the pipeline can catch up with its backlog and keep up with its input rate.
[33mWARNING [0m apache_beam.runners.dataflow.dataflow_runner:dataflow_runner.py:250 Timing out on waiting for job 2021-06-18_07_01_59-5712331605803490283 after 60 seconds
[32mPASSED[0m
- generated xml file: <https://ci-beam.apache.org/job/beam_PostCommit_Py_VR_Dataflow/ws/src/sdks/python/pytest_validatesRunnerStreamingTests-df-py37-noxdist.xml> -
[32m[1m================= 1 passed, 4755 deselected in 455.37 seconds ==================[0m
> Task :sdks:python:test-suites:dataflow:validatesRunnerStreamingTests
FAILURE: Build failed with an exception.
* Where:
Script '<https://ci-beam.apache.org/job/beam_PostCommit_Py_VR_Dataflow/ws/src/sdks/python/test-suites/dataflow/common.gradle'> line: 156
* What went wrong:
Execution failed for task ':sdks:python:test-suites:dataflow:py37:validatesRunnerBatchTests'.
> Process 'command 'sh'' finished with non-zero exit value 1
* Try:
Run with --stacktrace option to get the stack trace. Run with --info or --debug option to get more log output. Run with --scan to get full insights.
* Get more help at https://help.gradle.org
Deprecated Gradle features were used in this build, making it incompatible with Gradle 7.0.
Use '--warning-mode all' to show the individual deprecation warnings.
See https://docs.gradle.org/6.8.3/userguide/command_line_interface.html#sec:command_line_warnings
BUILD FAILED in 2h 8m 53s
89 actionable tasks: 60 executed, 29 from cache
Publishing build scan...
https://gradle.com/s/27ifckgflbao6
Build step 'Invoke Gradle script' changed build result to FAILURE
Build step 'Invoke Gradle script' marked build as failure
---------------------------------------------------------------------
To unsubscribe, e-mail: builds-unsubscribe@beam.apache.org
For additional commands, e-mail: builds-help@beam.apache.org
Jenkins build is back to normal : beam_PostCommit_Py_VR_Dataflow
#8043
Posted by Apache Jenkins Server <je...@builds.apache.org>.
See <https://ci-beam.apache.org/job/beam_PostCommit_Py_VR_Dataflow/8043/display/redirect?page=changes>
---------------------------------------------------------------------
To unsubscribe, e-mail: builds-unsubscribe@beam.apache.org
For additional commands, e-mail: builds-help@beam.apache.org