You are viewing a plain text version of this content. The canonical link for it is here.
Posted to dev@zookeeper.apache.org by Apache Jenkins Server <je...@builds.apache.org> on 2016/06/06 11:52:37 UTC
ZooKeeper-trunk-jdk8 - Build # 625 - Failure
See https://builds.apache.org/job/ZooKeeper-trunk-jdk8/625/
###################################################################################
########################## LAST 60 LINES OF THE CONSOLE ###########################
[...truncated 402390 lines...]
[junit] 2016-06-06 11:52:29,109 [myid:] - INFO [main:ZooKeeperServer@498] - shutting down
[junit] 2016-06-06 11:52:29,110 [myid:] - INFO [main:SessionTrackerImpl@232] - Shutting down
[junit] 2016-06-06 11:52:29,110 [myid:] - INFO [main:PrepRequestProcessor@965] - Shutting down
[junit] 2016-06-06 11:52:29,110 [myid:] - INFO [main:SyncRequestProcessor@191] - Shutting down
[junit] 2016-06-06 11:52:29,110 [myid:] - INFO [ProcessThread(sid:0 cport:11228)::PrepRequestProcessor@154] - PrepRequestProcessor exited loop!
[junit] 2016-06-06 11:52:29,110 [myid:] - INFO [SyncThread:0:SyncRequestProcessor@169] - SyncRequestProcessor exited!
[junit] 2016-06-06 11:52:29,110 [myid:] - INFO [main:FinalRequestProcessor@479] - shutdown of request processor complete
[junit] 2016-06-06 11:52:29,111 [myid:] - INFO [main:MBeanRegistry@128] - Unregister MBean [org.apache.ZooKeeperService:name0=StandaloneServer_port11228,name1=InMemoryDataTree]
[junit] 2016-06-06 11:52:29,111 [myid:] - INFO [main:MBeanRegistry@128] - Unregister MBean [org.apache.ZooKeeperService:name0=StandaloneServer_port11228]
[junit] 2016-06-06 11:52:29,112 [myid:] - INFO [main:FourLetterWordMain@85] - connecting to 127.0.0.1 11228
[junit] 2016-06-06 11:52:29,112 [myid:] - INFO [main:JMXEnv@146] - ensureOnly:[]
[junit] 2016-06-06 11:52:29,116 [myid:] - INFO [main:ClientBase@562] - fdcount after test is: 51 at start it was 51
[junit] 2016-06-06 11:52:29,116 [myid:] - INFO [main:ZKTestCase$1@65] - SUCCEEDED testWatcherAutoResetWithLocal
[junit] 2016-06-06 11:52:29,116 [myid:] - INFO [main:ZKTestCase$1@60] - FINISHED testWatcherAutoResetWithLocal
[junit] Tests run: 7, Failures: 0, Errors: 0, Skipped: 0, Time elapsed: 31.009 sec, Thread: 1, Class: org.apache.zookeeper.test.WatcherTest
[junit] 2016-06-06 11:52:34,936 [myid:] - INFO [main:JUnit4ZKTestRunner$LoggedInvokeMethod@82] - Memory used 68725
[junit] 2016-06-06 11:52:34,937 [myid:] - INFO [main:JUnit4ZKTestRunner$LoggedInvokeMethod@87] - Number of threads 55
[junit] 2016-06-06 11:52:34,937 [myid:] - INFO [main:JUnit4ZKTestRunner$LoggedInvokeMethod@102] - FINISHED TEST METHOD testManyChildWatchersAutoReset
[junit] 2016-06-06 11:52:34,937 [myid:] - INFO [main:ClientBase@537] - tearDown starting
[junit] 2016-06-06 11:52:34,938 [myid:] - INFO [ProcessThread(sid:0 cport:13918)::PrepRequestProcessor@647] - Processed session termination for sessionid: 0x1007ebf6d9f0000
[junit] 2016-06-06 11:52:34,944 [myid:] - INFO [main:ZooKeeper@1313] - Session: 0x1007ebf6d9f0000 closed
[junit] 2016-06-06 11:52:34,945 [myid:] - INFO [main-EventThread:ClientCnxn$EventThread@513] - EventThread shut down for session: 0x1007ebf6d9f0000
[junit] 2016-06-06 11:52:34,945 [myid:] - INFO [NIOWorkerThread-30:MBeanRegistry@128] - Unregister MBean [org.apache.ZooKeeperService:name0=StandaloneServer_port13918,name1=Connections,name2=127.0.0.1,name3=0x1007ebf6d9f0000]
[junit] 2016-06-06 11:52:34,946 [myid:] - INFO [ProcessThread(sid:0 cport:13918)::PrepRequestProcessor@647] - Processed session termination for sessionid: 0x1007ebf6d9f0001
[junit] 2016-06-06 11:52:34,947 [myid:] - INFO [NIOWorkerThread-30:NIOServerCnxn@607] - Closed socket connection for client /127.0.0.1:51853 which had sessionid 0x1007ebf6d9f0000
[junit] 2016-06-06 11:52:34,953 [myid:] - INFO [main:ZooKeeper@1313] - Session: 0x1007ebf6d9f0001 closed
[junit] 2016-06-06 11:52:34,953 [myid:] - INFO [main-EventThread:ClientCnxn$EventThread@513] - EventThread shut down for session: 0x1007ebf6d9f0001
[junit] 2016-06-06 11:52:34,953 [myid:] - INFO [main:ClientBase@507] - STOPPING server
[junit] 2016-06-06 11:52:34,953 [myid:] - INFO [NIOWorkerThread-16:MBeanRegistry@128] - Unregister MBean [org.apache.ZooKeeperService:name0=StandaloneServer_port13918,name1=Connections,name2=127.0.0.1,name3=0x1007ebf6d9f0001]
[junit] 2016-06-06 11:52:34,955 [myid:] - INFO [NIOWorkerThread-16:NIOServerCnxn@607] - Closed socket connection for client /127.0.0.1:51860 which had sessionid 0x1007ebf6d9f0001
[junit] 2016-06-06 11:52:34,955 [myid:] - INFO [ConnnectionExpirer:NIOServerCnxnFactory$ConnectionExpirerThread@583] - ConnnectionExpirerThread interrupted
[junit] 2016-06-06 11:52:34,957 [myid:] - INFO [NIOServerCxnFactory.AcceptThread:0.0.0.0/0.0.0.0:13918:NIOServerCnxnFactory$AcceptThread@219] - accept thread exitted run method
[junit] 2016-06-06 11:52:34,958 [myid:] - INFO [NIOServerCxnFactory.SelectorThread-0:NIOServerCnxnFactory$SelectorThread@420] - selector thread exitted run method
[junit] 2016-06-06 11:52:34,958 [myid:] - INFO [NIOServerCxnFactory.SelectorThread-1:NIOServerCnxnFactory$SelectorThread@420] - selector thread exitted run method
[junit] 2016-06-06 11:52:34,961 [myid:] - INFO [main:ZooKeeperServer@498] - shutting down
[junit] 2016-06-06 11:52:34,962 [myid:] - INFO [main:SessionTrackerImpl@232] - Shutting down
[junit] 2016-06-06 11:52:34,962 [myid:] - INFO [main:PrepRequestProcessor@965] - Shutting down
[junit] 2016-06-06 11:52:34,962 [myid:] - INFO [main:SyncRequestProcessor@191] - Shutting down
[junit] 2016-06-06 11:52:34,962 [myid:] - INFO [ProcessThread(sid:0 cport:13918)::PrepRequestProcessor@154] - PrepRequestProcessor exited loop!
[junit] 2016-06-06 11:52:34,962 [myid:] - INFO [SyncThread:0:SyncRequestProcessor@169] - SyncRequestProcessor exited!
[junit] 2016-06-06 11:52:34,962 [myid:] - INFO [main:FinalRequestProcessor@479] - shutdown of request processor complete
[junit] 2016-06-06 11:52:34,963 [myid:] - INFO [main:MBeanRegistry@128] - Unregister MBean [org.apache.ZooKeeperService:name0=StandaloneServer_port13918,name1=InMemoryDataTree]
[junit] 2016-06-06 11:52:34,963 [myid:] - INFO [main:MBeanRegistry@128] - Unregister MBean [org.apache.ZooKeeperService:name0=StandaloneServer_port13918]
[junit] 2016-06-06 11:52:34,964 [myid:] - INFO [main:FourLetterWordMain@85] - connecting to 127.0.0.1 13918
[junit] 2016-06-06 11:52:34,964 [myid:] - INFO [main:JMXEnv@146] - ensureOnly:[]
[junit] 2016-06-06 11:52:34,969 [myid:] - INFO [main:ClientBase@562] - fdcount after test is: 55 at start it was 55
[junit] 2016-06-06 11:52:34,970 [myid:] - INFO [main:ZKTestCase$1@65] - SUCCEEDED testManyChildWatchersAutoReset
[junit] 2016-06-06 11:52:34,970 [myid:] - INFO [main:ZKTestCase$1@60] - FINISHED testManyChildWatchersAutoReset
[junit] Tests run: 4, Failures: 0, Errors: 0, Skipped: 0, Time elapsed: 313.663 sec, Thread: 2, Class: org.apache.zookeeper.test.DisconnectedWatcherTest
BUILD FAILED
/home/jenkins/jenkins-slave/workspace/ZooKeeper-trunk-jdk8/trunk/build.xml:1207: Tests failed!
Total time: 8 minutes 4 seconds
Build step 'Invoke Ant' marked build as failure
[WARNINGS] Skipping publisher since build result is FAILURE
Recording test results
Email was triggered for: Failure - Any
Sending email for trigger: Failure - Any
###################################################################################
############################## FAILED TESTS (if any) ##############################
8 tests failed.
FAILED: org.apache.zookeeper.server.quorum.ReconfigRecoveryTest.testCurrentServersAreObserversInNextConfig
Error Message:
waiting for server 1 being up
Stack Trace:
junit.framework.AssertionFailedError: waiting for server 1 being up
at org.apache.zookeeper.server.quorum.ReconfigRecoveryTest.testCurrentServersAreObserversInNextConfig(ReconfigRecoveryTest.java:217)
at org.apache.zookeeper.JUnit4ZKTestRunner$LoggedInvokeMethod.evaluate(JUnit4ZKTestRunner.java:79)
FAILED: org.apache.zookeeper.test.LoadFromLogTest.testLoadFailure
Error Message:
KeeperErrorCode = ConnectionLoss for /data-
Stack Trace:
org.apache.zookeeper.KeeperException$ConnectionLossException: KeeperErrorCode = ConnectionLoss for /data-
at org.apache.zookeeper.KeeperException.create(KeeperException.java:99)
at org.apache.zookeeper.KeeperException.create(KeeperException.java:51)
at org.apache.zookeeper.ZooKeeper.create(ZooKeeper.java:1412)
at org.apache.zookeeper.test.LoadFromLogTest.testLoadFailure(LoadFromLogTest.java:157)
at org.apache.zookeeper.JUnit4ZKTestRunner$LoggedInvokeMethod.evaluate(JUnit4ZKTestRunner.java:79)
FAILED: org.apache.zookeeper.test.AsyncHammerTest.testHammer
Error Message:
waiting for server up
Stack Trace:
junit.framework.AssertionFailedError: waiting for server up
at org.apache.zookeeper.test.QuorumBase.startServers(QuorumBase.java:223)
at org.apache.zookeeper.test.QuorumBase.setUp(QuorumBase.java:120)
at org.apache.zookeeper.test.AsyncHammerTest.setUp(AsyncHammerTest.java:52)
at org.apache.zookeeper.test.AsyncHammerTest.testHammer(AsyncHammerTest.java:171)
at org.apache.zookeeper.JUnit4ZKTestRunner$LoggedInvokeMethod.evaluate(JUnit4ZKTestRunner.java:79)
FAILED: org.apache.zookeeper.test.AsyncHammerTest.testObserversHammer
Error Message:
unable to create new native thread
Stack Trace:
java.lang.OutOfMemoryError: unable to create new native thread
at java.lang.Thread.start0(Native Method)
at java.lang.Thread.start(Thread.java:713)
at java.util.concurrent.ThreadPoolExecutor.addWorker(ThreadPoolExecutor.java:950)
at java.util.concurrent.ThreadPoolExecutor.execute(ThreadPoolExecutor.java:1368)
at org.jboss.netty.util.internal.DeadLockProofWorker.start(DeadLockProofWorker.java:38)
at org.jboss.netty.channel.socket.nio.AbstractNioSelector.openSelector(AbstractNioSelector.java:368)
at org.jboss.netty.channel.socket.nio.AbstractNioSelector.<init>(AbstractNioSelector.java:100)
at org.jboss.netty.channel.socket.nio.AbstractNioWorker.<init>(AbstractNioWorker.java:52)
at org.jboss.netty.channel.socket.nio.NioWorker.<init>(NioWorker.java:45)
at org.jboss.netty.channel.socket.nio.NioWorkerPool.newWorker(NioWorkerPool.java:44)
at org.jboss.netty.channel.socket.nio.NioWorkerPool.newWorker(NioWorkerPool.java:28)
at org.jboss.netty.channel.socket.nio.AbstractNioWorkerPool.init(AbstractNioWorkerPool.java:80)
at org.jboss.netty.channel.socket.nio.NioWorkerPool.<init>(NioWorkerPool.java:39)
at org.jboss.netty.channel.socket.nio.NioWorkerPool.<init>(NioWorkerPool.java:33)
at org.jboss.netty.channel.socket.nio.NioServerSocketChannelFactory.<init>(NioServerSocketChannelFactory.java:149)
at org.jboss.netty.channel.socket.nio.NioServerSocketChannelFactory.<init>(NioServerSocketChannelFactory.java:131)
at org.jboss.netty.channel.socket.nio.NioServerSocketChannelFactory.<init>(NioServerSocketChannelFactory.java:115)
at org.apache.zookeeper.server.NettyServerCnxnFactory.<init>(NettyServerCnxnFactory.java:332)
at java.lang.reflect.Constructor.newInstance(Constructor.java:408)
at java.lang.Class.newInstance(Class.java:433)
at org.apache.zookeeper.server.ServerCnxnFactory.createFactory(ServerCnxnFactory.java:134)
at org.apache.zookeeper.server.ServerCnxnFactory.createFactory(ServerCnxnFactory.java:152)
at org.apache.zookeeper.server.quorum.QuorumPeer.<init>(QuorumPeer.java:863)
at org.apache.zookeeper.test.QuorumBase.startServers(QuorumBase.java:175)
at org.apache.zookeeper.test.QuorumBase.setUp(QuorumBase.java:120)
at org.apache.zookeeper.test.AsyncHammerTest.setUp(AsyncHammerTest.java:52)
at org.apache.zookeeper.test.AsyncHammerTest.testObserversHammer(AsyncHammerTest.java:203)
at org.apache.zookeeper.JUnit4ZKTestRunner$LoggedInvokeMethod.evaluate(JUnit4ZKTestRunner.java:79)
FAILED: org.apache.zookeeper.test.ObserverQuorumHammerTest.testHammerBasic
Error Message:
unable to create new native thread
Stack Trace:
java.lang.OutOfMemoryError: unable to create new native thread
at java.lang.Thread.start0(Native Method)
at java.lang.Thread.start(Thread.java:713)
at org.apache.zookeeper.server.NIOServerCnxnFactory.start(NIOServerCnxnFactory.java:735)
at org.apache.zookeeper.server.quorum.QuorumPeer.startServerCnxnFactory(QuorumPeer.java:1588)
at org.apache.zookeeper.server.quorum.QuorumPeer.start(QuorumPeer.java:751)
at org.apache.zookeeper.test.QuorumBase.startServers(QuorumBase.java:214)
at org.apache.zookeeper.test.QuorumBase.setUp(QuorumBase.java:120)
at org.apache.zookeeper.test.ObserverQuorumHammerTest.setUp(ObserverQuorumHammerTest.java:30)
FAILED: org.apache.zookeeper.test.ObserverTest.unknown
Error Message:
Forked Java VM exited abnormally. Please note the time in the report does not reflect the time until the VM exit.
Stack Trace:
junit.framework.AssertionFailedError: Forked Java VM exited abnormally. Please note the time in the report does not reflect the time until the VM exit.
at java.lang.Thread.run(Thread.java:744)
FAILED: org.apache.zookeeper.test.QuorumHammerTest.unknown
Error Message:
Forked Java VM exited abnormally. Please note the time in the report does not reflect the time until the VM exit.
Stack Trace:
junit.framework.AssertionFailedError: Forked Java VM exited abnormally. Please note the time in the report does not reflect the time until the VM exit.
at java.lang.Thread.run(Thread.java:744)
FAILED: org.apache.zookeeper.test.ReconfigTest.testPortChange
Error Message:
expected:<test[1]> but was:<test[0]>
Stack Trace:
junit.framework.AssertionFailedError: expected:<test[1]> but was:<test[0]>
at org.apache.zookeeper.test.ReconfigTest.testNormalOperation(ReconfigTest.java:150)
at org.apache.zookeeper.test.ReconfigTest.testPortChange(ReconfigTest.java:598)
at org.apache.zookeeper.JUnit4ZKTestRunner$LoggedInvokeMethod.evaluate(JUnit4ZKTestRunner.java:79)