You are viewing a plain text version of this content. The canonical link for it is here.
Posted to builds@hbase.apache.org by Apache Jenkins Server <je...@builds.apache.org> on 2014/08/20 10:29:17 UTC

Build failed in Jenkins: HBase-0.98 #460

See <https://builds.apache.org/job/HBase-0.98/460/changes>

Changes:

[apurtell] HBASE-11742 (Backport HBASE-7987 and HBASE-11185 to 0.98) (Esteban Gutierrez and Matteo Bertozzi)

------------------------------------------
[...truncated 1483 lines...]
Tests run: 6, Failures: 0, Errors: 0, Skipped: 0, Time elapsed: 35.025 sec
Running org.apache.hadoop.hbase.client.TestFromClientSideNoCodec
Tests run: 2, Failures: 0, Errors: 0, Skipped: 0, Time elapsed: 10.217 sec
Running org.apache.hadoop.hbase.client.TestScannersFromClientSide
Tests run: 5, Failures: 0, Errors: 0, Skipped: 0, Time elapsed: 12.473 sec
Running org.apache.hadoop.hbase.client.TestFromClientSide
Tests run: 76, Failures: 0, Errors: 0, Skipped: 4, Time elapsed: 87.323 sec
Running org.apache.hadoop.hbase.client.TestClientOperationInterrupt
Tests run: 1, Failures: 0, Errors: 0, Skipped: 0, Time elapsed: 61.043 sec
Running org.apache.hadoop.hbase.client.TestMultipleTimestamps
Tests run: 8, Failures: 0, Errors: 0, Skipped: 0, Time elapsed: 11.749 sec
Running org.apache.hadoop.hbase.client.TestMetaScanner
Tests run: 2, Failures: 0, Errors: 0, Skipped: 0, Time elapsed: 44.422 sec
Running org.apache.hadoop.hbase.client.TestClientTimeouts
Tests run: 1, Failures: 0, Errors: 0, Skipped: 0, Time elapsed: 11.484 sec
Running org.apache.hadoop.hbase.client.TestCloneSnapshotFromClient
Tests run: 5, Failures: 0, Errors: 0, Skipped: 0, Time elapsed: 53.38 sec
Running org.apache.hadoop.hbase.client.TestAdmin
Tests run: 44, Failures: 0, Errors: 0, Skipped: 0, Time elapsed: 381.806 sec
Running org.apache.hadoop.hbase.TestLocalHBaseCluster
Tests run: 1, Failures: 0, Errors: 0, Skipped: 0, Time elapsed: 9.093 sec
Running org.apache.hadoop.hbase.TestDrainingServer
Tests run: 2, Failures: 0, Errors: 0, Skipped: 0, Time elapsed: 2.752 sec
Running org.apache.hadoop.hbase.snapshot.TestSnapshotDescriptionUtils
Tests run: 2, Failures: 0, Errors: 0, Skipped: 0, Time elapsed: 1.333 sec
Running org.apache.hadoop.hbase.client.TestHCM
Tests run: 15, Failures: 0, Errors: 0, Skipped: 3, Time elapsed: 46.538 sec
Running org.apache.hadoop.hbase.snapshot.TestFlushSnapshotFromClient
Tests run: 9, Failures: 0, Errors: 0, Skipped: 0, Time elapsed: 35.81 sec
Running org.apache.hadoop.hbase.snapshot.TestRestoreFlushSnapshotFromClient
Tests run: 5, Failures: 0, Errors: 0, Skipped: 0, Time elapsed: 52.959 sec
Running org.apache.hadoop.hbase.snapshot.TestExportSnapshot
Tests run: 9, Failures: 0, Errors: 0, Skipped: 0, Time elapsed: 257.271 sec
Running org.apache.hadoop.hbase.migration.TestUpgradeTo96
Tests run: 5, Failures: 0, Errors: 0, Skipped: 0, Time elapsed: 9.53 sec
Running org.apache.hadoop.hbase.snapshot.TestSecureExportSnapshot
Tests run: 9, Failures: 0, Errors: 0, Skipped: 0, Time elapsed: 262.268 sec
Running org.apache.hadoop.hbase.migration.TestNamespaceUpgrade
Tests run: 5, Failures: 0, Errors: 0, Skipped: 0, Time elapsed: 43.935 sec
Running org.apache.hadoop.hbase.TestGlobalMemStoreSize
Tests run: 1, Failures: 0, Errors: 0, Skipped: 0, Time elapsed: 11.614 sec
Running org.apache.hadoop.hbase.TestMultiVersions
Tests run: 3, Failures: 0, Errors: 0, Skipped: 0, Time elapsed: 13.968 sec
Running org.apache.hadoop.hbase.security.access.TestScanEarlyTermination
Tests run: 1, Failures: 0, Errors: 0, Skipped: 0, Time elapsed: 11.895 sec
Running org.apache.hadoop.hbase.security.access.TestZKPermissionsWatcher
Tests run: 1, Failures: 0, Errors: 0, Skipped: 0, Time elapsed: 11.709 sec
Running org.apache.hadoop.hbase.TestRegionRebalancing
Tests run: 2, Failures: 0, Errors: 0, Skipped: 0, Time elapsed: 29.696 sec
Running org.apache.hadoop.hbase.security.access.TestAccessControlFilter
Tests run: 1, Failures: 0, Errors: 0, Skipped: 0, Time elapsed: 11.844 sec
Running org.apache.hadoop.hbase.security.access.TestCellACLs
Tests run: 2, Failures: 0, Errors: 0, Skipped: 0, Time elapsed: 14.015 sec
Running org.apache.hadoop.hbase.security.access.TestTablePermissions
Tests run: 7, Failures: 0, Errors: 0, Skipped: 0, Time elapsed: 22.176 sec
Running org.apache.hadoop.hbase.security.access.TestCellACLWithMultipleVersions
Tests run: 8, Failures: 0, Errors: 0, Skipped: 0, Time elapsed: 18.948 sec
Running org.apache.hadoop.hbase.security.access.TestNamespaceCommands
Tests run: 3, Failures: 0, Errors: 0, Skipped: 0, Time elapsed: 10.999 sec
Running org.apache.hadoop.hbase.security.token.TestZKSecretWatcher
Tests run: 1, Failures: 0, Errors: 0, Skipped: 0, Time elapsed: 15.086 sec
Running org.apache.hadoop.hbase.security.token.TestTokenAuthentication
Tests run: 2, Failures: 0, Errors: 0, Skipped: 0, Time elapsed: 2.707 sec
Running org.apache.hadoop.hbase.security.visibility.TestEnforcingScanLabelGenerator
Tests run: 1, Failures: 0, Errors: 0, Skipped: 0, Time elapsed: 10.83 sec
Running org.apache.hadoop.hbase.security.visibility.TestVisibilityWithCheckAuths
Tests run: 2, Failures: 0, Errors: 0, Skipped: 0, Time elapsed: 10.906 sec
Running org.apache.hadoop.hbase.security.visibility.TestVisibilityLabelsWithSLGStack
Tests run: 1, Failures: 0, Errors: 0, Skipped: 0, Time elapsed: 9.881 sec
Running org.apache.hadoop.hbase.security.visibility.TestVisibilityLabelsWithACL
Tests run: 5, Failures: 0, Errors: 0, Skipped: 0, Time elapsed: 12.353 sec
Running org.apache.hadoop.hbase.security.access.TestAccessController
Tests run: 43, Failures: 0, Errors: 0, Skipped: 0, Time elapsed: 79.858 sec
Running org.apache.hadoop.hbase.security.visibility.TestVisibilityLabelsOpWithDifferentUsersNoACL
Tests run: 1, Failures: 0, Errors: 0, Skipped: 0, Time elapsed: 10.867 sec
Running org.apache.hadoop.hbase.security.visibility.TestVisibilityLabelsWithDistributedLogReplay
Tests run: 21, Failures: 0, Errors: 0, Skipped: 0, Time elapsed: 25.261 sec
Running org.apache.hadoop.hbase.security.visibility.TestVisibilityLabelsWithDeletes
Tests run: 37, Failures: 0, Errors: 0, Skipped: 0, Time elapsed: 36.449 sec
Running org.apache.hadoop.hbase.security.visibility.TestVisibilityLabels
Tests run: 21, Failures: 0, Errors: 0, Skipped: 0, Time elapsed: 25.592 sec
Running org.apache.hadoop.hbase.fs.TestBlockReorder
Tests run: 3, Failures: 0, Errors: 0, Skipped: 0, Time elapsed: 18.157 sec
Running org.apache.hadoop.hbase.TestInfoServers
Tests run: 3, Failures: 0, Errors: 0, Skipped: 0, Time elapsed: 10.021 sec
Running org.apache.hadoop.hbase.backup.example.TestZooKeeperTableArchiveClient
Tests run: 3, Failures: 0, Errors: 0, Skipped: 0, Time elapsed: 5.408 sec
Running org.apache.hadoop.hbase.zookeeper.TestZKTable
Tests run: 1, Failures: 0, Errors: 0, Skipped: 0, Time elapsed: 1.635 sec
Running org.apache.hadoop.hbase.zookeeper.TestHQuorumPeer
Tests run: 3, Failures: 0, Errors: 0, Skipped: 0, Time elapsed: 2.148 sec
Running org.apache.hadoop.hbase.zookeeper.lock.TestZKInterProcessReadWriteLock
Tests run: 6, Failures: 0, Errors: 0, Skipped: 0, Time elapsed: 25.626 sec
Running org.apache.hadoop.hbase.backup.TestHFileArchiving
Running org.apache.hadoop.hbase.zookeeper.TestRecoverableZooKeeper
Tests run: 1, Failures: 0, Errors: 0, Skipped: 0, Time elapsed: 2.163 sec
Tests run: 5, Failures: 0, Errors: 0, Skipped: 0, Time elapsed: 43.301 sec
Running org.apache.hadoop.hbase.zookeeper.TestZKLeaderManager
Tests run: 1, Failures: 0, Errors: 0, Skipped: 0, Time elapsed: 1.22 sec
Running org.apache.hadoop.hbase.zookeeper.TestZooKeeperNodeTracker
Tests run: 3, Failures: 0, Errors: 0, Skipped: 0, Time elapsed: 1.747 sec
Running org.apache.hadoop.hbase.zookeeper.TestZKMulti
Tests run: 6, Failures: 0, Errors: 0, Skipped: 0, Time elapsed: 1.526 sec
Running org.apache.hadoop.hbase.zookeeper.TestZooKeeperACL
Tests run: 6, Failures: 0, Errors: 0, Skipped: 0, Time elapsed: 8.775 sec
Running org.apache.hadoop.hbase.mapreduce.TestTableMapReduce
Tests run: 2, Failures: 0, Errors: 0, Skipped: 0, Time elapsed: 177.241 sec
Running org.apache.hadoop.hbase.mapreduce.TestHLogRecordReader
Tests run: 2, Failures: 0, Errors: 0, Skipped: 0, Time elapsed: 5.298 sec
Running org.apache.hadoop.hbase.mapreduce.TestTableInputFormatScan2
Tests run: 7, Failures: 0, Errors: 0, Skipped: 0, Time elapsed: 264.435 sec
Running org.apache.hadoop.hbase.mapreduce.TestWALPlayer
Tests run: 3, Failures: 0, Errors: 0, Skipped: 0, Time elapsed: 63.968 sec
Running org.apache.hadoop.hbase.mapreduce.TestCopyTable
Tests run: 4, Failures: 0, Errors: 0, Skipped: 0, Time elapsed: 114.29 sec
Running org.apache.hadoop.hbase.mapreduce.TestImportExport
Tests run: 11, Failures: 0, Errors: 0, Skipped: 0, Time elapsed: 332.105 sec
Running org.apache.hadoop.hbase.mapreduce.TestImportTSVWithOperationAttributes
Tests run: 2, Failures: 0, Errors: 0, Skipped: 0, Time elapsed: 90.374 sec
Running org.apache.hadoop.hbase.mapreduce.TestRowCounter
Tests run: 5, Failures: 0, Errors: 0, Skipped: 0, Time elapsed: 121.111 sec
Running org.apache.hadoop.hbase.mapreduce.TestSecureLoadIncrementalHFiles
Tests run: 12, Failures: 0, Errors: 0, Skipped: 0, Time elapsed: 36.169 sec
Running org.apache.hadoop.hbase.mapreduce.TestTimeRangeMapRed
Tests run: 1, Failures: 0, Errors: 0, Skipped: 0, Time elapsed: 49.32 sec
Running org.apache.hadoop.hbase.mapreduce.TestImportTsv
Tests run: 7, Failures: 0, Errors: 0, Skipped: 0, Time elapsed: 202.844 sec
Running org.apache.hadoop.hbase.mapreduce.TestLoadIncrementalHFiles
Tests run: 12, Failures: 0, Errors: 0, Skipped: 0, Time elapsed: 32.032 sec
Running org.apache.hadoop.hbase.mapreduce.TestHRegionPartitioner
Tests run: 1, Failures: 0, Errors: 0, Skipped: 0, Time elapsed: 19.793 sec
Running org.apache.hadoop.hbase.mapreduce.TestLoadIncrementalHFilesSplitRecovery
Tests run: 5, Failures: 0, Errors: 0, Skipped: 0, Time elapsed: 20.038 sec
Running org.apache.hadoop.hbase.mapreduce.TestTableSnapshotInputFormat
Tests run: 7, Failures: 0, Errors: 0, Skipped: 0, Time elapsed: 244.053 sec
Running org.apache.hadoop.hbase.mapreduce.TestImportTSVWithVisibilityLabels
Tests run: 5, Failures: 0, Errors: 0, Skipped: 0, Time elapsed: 172.824 sec
Running org.apache.hadoop.hbase.mapreduce.TestMultithreadedTableMapper
Tests run: 1, Failures: 0, Errors: 0, Skipped: 0, Time elapsed: 110.093 sec
Running org.apache.hadoop.hbase.mapreduce.TestHFileOutputFormat
Tests run: 13, Failures: 0, Errors: 0, Skipped: 1, Time elapsed: 227.172 sec
Running org.apache.hadoop.hbase.mapreduce.TestHFileOutputFormat2
Tests run: 13, Failures: 0, Errors: 0, Skipped: 1, Time elapsed: 225.9 sec
Running org.apache.hadoop.hbase.mapreduce.TestCellCounter
Tests run: 2, Failures: 0, Errors: 0, Skipped: 0, Time elapsed: 84.155 sec
Running org.apache.hadoop.hbase.mapreduce.TestTableInputFormatScan1
Tests run: 5, Failures: 0, Errors: 0, Skipped: 0, Time elapsed: 220.954 sec
Running org.apache.hadoop.hbase.mapreduce.TestSecureLoadIncrementalHFilesSplitRecovery
Tests run: 5, Failures: 0, Errors: 0, Skipped: 0, Time elapsed: 20.327 sec
Running org.apache.hadoop.hbase.filter.TestFilterWithScanLimits
Tests run: 1, Failures: 0, Errors: 0, Skipped: 0, Time elapsed: 10.88 sec
Running org.apache.hadoop.hbase.filter.TestFuzzyRowAndColumnRangeFilter
Tests run: 1, Failures: 0, Errors: 0, Skipped: 0, Time elapsed: 9.863 sec
Running org.apache.hadoop.hbase.filter.TestColumnRangeFilter
Tests run: 1, Failures: 0, Errors: 0, Skipped: 0, Time elapsed: 15.261 sec
Running org.apache.hadoop.hbase.filter.TestFilterWrapper
Tests run: 1, Failures: 0, Errors: 0, Skipped: 0, Time elapsed: 10.46 sec

Results :

Failed tests:   testActiveThreadsCount(org.apache.hadoop.hbase.client.TestMultiParallel): expected:<5> but was:<4>

Tests run: 1981, Failures: 1, Errors: 0, Skipped: 24

[INFO] ------------------------------------------------------------------------
[INFO] Reactor Summary:
[INFO] 
[INFO] HBase ............................................. SUCCESS [3.206s]
[INFO] HBase - Common .................................... SUCCESS [30.041s]
[INFO] HBase - Protocol .................................. SUCCESS [22.152s]
[INFO] HBase - Client .................................... SUCCESS [39.605s]
[INFO] HBase - Hadoop Compatibility ...................... SUCCESS [5.452s]
[INFO] HBase - Hadoop Two Compatibility .................. SUCCESS [1.888s]
[INFO] HBase - Prefix Tree ............................... SUCCESS [4.273s]
[INFO] HBase - Server .................................... FAILURE [1:37:12.524s]
[INFO] HBase - Testing Util .............................. SKIPPED
[INFO] HBase - Thrift .................................... SKIPPED
[INFO] HBase - Shell ..................................... SKIPPED
[INFO] HBase - Integration Tests ......................... SKIPPED
[INFO] HBase - Examples .................................. SKIPPED
[INFO] HBase - Assembly .................................. SKIPPED
[INFO] ------------------------------------------------------------------------
[INFO] BUILD FAILURE
[INFO] ------------------------------------------------------------------------
[INFO] Total time: 1:39:00.074s
[INFO] Finished at: Wed Aug 20 08:26:14 UTC 2014
[INFO] Final Memory: 44M/1020M
[INFO] ------------------------------------------------------------------------
[ERROR] Failed to execute goal org.apache.maven.plugins:maven-surefire-plugin:2.12-TRUNK-HBASE-2:test (secondPartTestsExecution) on project hbase-server: There are test failures.
[ERROR] 
[ERROR] Please refer to <https://builds.apache.org/job/HBase-0.98/ws/hbase-server/target/surefire-reports> for the individual test results.
[ERROR] -> [Help 1]
[ERROR] 
[ERROR] To see the full stack trace of the errors, re-run Maven with the -e switch.
[ERROR] Re-run Maven using the -X switch to enable full debug logging.
[ERROR] 
[ERROR] For more information about the errors and possible solutions, please read the following articles:
[ERROR] [Help 1] http://cwiki.apache.org/confluence/display/MAVEN/MojoFailureException
[ERROR] 
[ERROR] After correcting the problems, you can resume the build with the command
[ERROR]   mvn <goals> -rf :hbase-server
Build step 'Invoke top-level Maven targets' marked build as failure
Performing Post build task...
Match found for :.* : True
Logical operation result is TRUE
Running script  :   ZOMBIE_TESTS_COUNT=`jps | grep surefirebooter | wc -l`
  if [[ $ZOMBIE_TESTS_COUNT != 0 ]] ; then
    #It seems sometimes the tests are not dying immediately. Let's give them 10s
    echo "Suspicious java process found - waiting 10s to see if there are just slow to stop"
    sleep 10   
    ZOMBIE_TESTS_COUNT=`jps | grep surefirebooter | wc -l`
    if [[ $ZOMBIE_TESTS_COUNT != 0 ]] ; then
      echo "There are $ZOMBIE_TESTS_COUNT zombie tests, they should have been killed by surefire but survived"
      echo "************ BEGIN zombies jstack extract"
      ZB_STACK=`jps | grep surefirebooter | cut -d ' ' -f 1 | xargs -n 1 jstack | grep ".test" | grep "\.java"`
      jps | grep surefirebooter | cut -d ' ' -f 1 | xargs -n 1 jstack
      echo "************ END  zombies jstack extract"
      JIRA_COMMENT="$JIRA_COMMENT

     {color:red}-1 core zombie tests{color}.  There are ${ZOMBIE_TESTS_COUNT} zombie test(s): ${ZB_STACK}"
      BAD=1
      jps | grep surefirebooter | cut -d ' ' -f 1 | xargs kill -9
    else
      echo "We're ok: there is no zombie test, but some tests took some time to stop"
    fi
  else
    echo "We're ok: there is no zombie test"
  fi
[HBase-0.98] $ /bin/bash -xe /tmp/hudson735459696262365773.sh
++ jps
++ grep surefirebooter
++ wc -l
+ ZOMBIE_TESTS_COUNT=0
+ [[ 0 != 0 ]]
+ echo 'We'\''re ok: there is no zombie test'
We're ok: there is no zombie test
POST BUILD TASK : SUCCESS
END OF POST BUILD TASK : 0
Archiving artifacts
Sending artifact delta relative to HBase-0.98 #459
Archived 1631 artifacts
Archive block size is 32768
Received 61 blocks and 418784636 bytes
Compression is 0.5%
Took 1 min 55 sec
Recording test results
Updating HBASE-7987
Updating HBASE-11742
Updating HBASE-11185

Jenkins build is back to normal : HBase-0.98 #462

Posted by Apache Jenkins Server <je...@builds.apache.org>.
See <https://builds.apache.org/job/HBase-0.98/462/changes>


Build failed in Jenkins: HBase-0.98 #461

Posted by Apache Jenkins Server <je...@builds.apache.org>.
See <https://builds.apache.org/job/HBase-0.98/461/changes>

Changes:

[anoopsamjohn] HBASE-11553 Abstract visibility label related services into an interface.

------------------------------------------
[...truncated 4893 lines...]
	at org.apache.maven.surefire.booter.ProviderFactory.invokeProvider(ProviderFactory.java:86)
	at org.apache.maven.surefire.booter.ForkedBooter.runSuitesInProcess(ForkedBooter.java:101)
	at org.apache.maven.surefire.booter.ForkedBooter.main(ForkedBooter.java:74)

"VM Thread" prio=10 tid=0x739a1400 nid=0x762c runnable 

"GC task thread#0 (ParallelGC)" prio=10 tid=0xf670cc00 nid=0x761a runnable 

"GC task thread#1 (ParallelGC)" prio=10 tid=0xf670e000 nid=0x761b runnable 

"GC task thread#2 (ParallelGC)" prio=10 tid=0xf670f800 nid=0x761c runnable 

"GC task thread#3 (ParallelGC)" prio=10 tid=0xf6710c00 nid=0x761d runnable 

"GC task thread#4 (ParallelGC)" prio=10 tid=0xf6712400 nid=0x761e runnable 

"GC task thread#5 (ParallelGC)" prio=10 tid=0xf6713800 nid=0x761f runnable 

"GC task thread#6 (ParallelGC)" prio=10 tid=0xf6715000 nid=0x7620 runnable 

"GC task thread#7 (ParallelGC)" prio=10 tid=0xf6716400 nid=0x7621 runnable 

"GC task thread#8 (ParallelGC)" prio=10 tid=0xf6717c00 nid=0x7622 runnable 

"GC task thread#9 (ParallelGC)" prio=10 tid=0xf6719000 nid=0x7623 runnable 

"GC task thread#10 (ParallelGC)" prio=10 tid=0xf671a800 nid=0x7624 runnable 

"GC task thread#11 (ParallelGC)" prio=10 tid=0xf671bc00 nid=0x7625 runnable 

"GC task thread#12 (ParallelGC)" prio=10 tid=0xf671d400 nid=0x7626 runnable 

"GC task thread#13 (ParallelGC)" prio=10 tid=0xf671e800 nid=0x7627 runnable 

"GC task thread#14 (ParallelGC)" prio=10 tid=0xf6720000 nid=0x7628 runnable 

"GC task thread#15 (ParallelGC)" prio=10 tid=0xf6721800 nid=0x7629 runnable 

"GC task thread#16 (ParallelGC)" prio=10 tid=0xf6722c00 nid=0x762a runnable 

"GC task thread#17 (ParallelGC)" prio=10 tid=0xf6724400 nid=0x762b runnable 

"VM Periodic Task Thread" prio=10 tid=0x739bb400 nid=0x763a waiting on condition 

JNI global references: 1319

2014-08-20 12:53:14
Full thread dump Java HotSpot(TM) Server VM (23.25-b01 mixed mode):

"Attach Listener" daemon prio=10 tid=0xa9700800 nid=0x65d9 waiting on condition [0x00000000]
   java.lang.Thread.State: RUNNABLE

"30595337@qtp-7830812-1" prio=10 tid=0xa80ad000 nid=0x1db0 in Object.wait() [0xae67d000]
   java.lang.Thread.State: TIMED_WAITING (on object monitor)
	at java.lang.Object.wait(Native Method)
	- waiting on <0xe01c3718> (a org.mortbay.thread.QueuedThreadPool$PoolThread)
	at org.mortbay.thread.QueuedThreadPool$PoolThread.run(QueuedThreadPool.java:626)
	- locked <0xe01c3718> (a org.mortbay.thread.QueuedThreadPool$PoolThread)

"11977667@qtp-7830812-0" prio=10 tid=0xa8055400 nid=0x1daf in Object.wait() [0xada7d000]
   java.lang.Thread.State: TIMED_WAITING (on object monitor)
	at java.lang.Object.wait(Native Method)
	- waiting on <0xe01c33c8> (a org.mortbay.thread.QueuedThreadPool$PoolThread)
	at org.mortbay.thread.QueuedThreadPool$PoolThread.run(QueuedThreadPool.java:626)
	- locked <0xe01c33c8> (a org.mortbay.thread.QueuedThreadPool$PoolThread)

"22716491@qtp-2039522-1 - Acceptor0 SelectChannelConnector@0.0.0.0:9101" prio=10 tid=0xa8041800 nid=0x1dae runnable [0xad67d000]
   java.lang.Thread.State: RUNNABLE
	at sun.nio.ch.EPollArrayWrapper.epollWait(Native Method)
	at sun.nio.ch.EPollArrayWrapper.poll(EPollArrayWrapper.java:228)
	at sun.nio.ch.EPollSelectorImpl.doSelect(EPollSelectorImpl.java:81)
	at sun.nio.ch.SelectorImpl.lockAndDoSelect(SelectorImpl.java:87)
	- locked <0xe01b6db0> (a sun.nio.ch.Util$2)
	- locked <0xe01b6da0> (a java.util.Collections$UnmodifiableSet)
	- locked <0xe01b6ba0> (a sun.nio.ch.EPollSelectorImpl)
	at sun.nio.ch.SelectorImpl.select(SelectorImpl.java:98)
	at org.mortbay.io.nio.SelectorManager$SelectSet.doSelect(SelectorManager.java:498)
	at org.mortbay.io.nio.SelectorManager.doSelect(SelectorManager.java:192)
	at org.mortbay.jetty.nio.SelectChannelConnector.accept(SelectChannelConnector.java:124)
	at org.mortbay.jetty.AbstractConnector$Acceptor.run(AbstractConnector.java:708)
	at org.mortbay.thread.QueuedThreadPool$PoolThread.run(QueuedThreadPool.java:582)

"19173036@qtp-2039522-0" prio=10 tid=0xa8040800 nid=0x1dad in Object.wait() [0xae47d000]
   java.lang.Thread.State: TIMED_WAITING (on object monitor)
	at java.lang.Object.wait(Native Method)
	- waiting on <0xe01b5a88> (a org.mortbay.thread.QueuedThreadPool$PoolThread)
	at org.mortbay.thread.QueuedThreadPool$PoolThread.run(QueuedThreadPool.java:626)
	- locked <0xe01b5a88> (a org.mortbay.thread.QueuedThreadPool$PoolThread)

"Service Thread" daemon prio=10 tid=0xa9626c00 nid=0x1c63 runnable [0x00000000]
   java.lang.Thread.State: RUNNABLE

"C2 CompilerThread1" daemon prio=10 tid=0xa9625000 nid=0x1c62 waiting on condition [0x00000000]
   java.lang.Thread.State: RUNNABLE

"C2 CompilerThread0" daemon prio=10 tid=0xa9623000 nid=0x1c61 waiting on condition [0x00000000]
   java.lang.Thread.State: RUNNABLE

"Signal Dispatcher" daemon prio=10 tid=0xa9621400 nid=0x1c60 runnable [0x00000000]
   java.lang.Thread.State: RUNNABLE

"Finalizer" daemon prio=10 tid=0xa9be6c00 nid=0x1c5f in Object.wait() [0xaee7d000]
   java.lang.Thread.State: WAITING (on object monitor)
	at java.lang.Object.wait(Native Method)
	- waiting on <0xb39700a0> (a java.lang.ref.ReferenceQueue$Lock)
	at java.lang.ref.ReferenceQueue.remove(ReferenceQueue.java:135)
	- locked <0xb39700a0> (a java.lang.ref.ReferenceQueue$Lock)
	at java.lang.ref.ReferenceQueue.remove(ReferenceQueue.java:151)
	at java.lang.ref.Finalizer$FinalizerThread.run(Finalizer.java:189)

"Reference Handler" daemon prio=10 tid=0xa9be5000 nid=0x1c5e in Object.wait() [0xaf07d000]
   java.lang.Thread.State: WAITING (on object monitor)
	at java.lang.Object.wait(Native Method)
	- waiting on <0xb397f340> (a java.lang.ref.Reference$Lock)
	at java.lang.Object.wait(Object.java:503)
	at java.lang.ref.Reference$ReferenceHandler.run(Reference.java:133)
	- locked <0xb397f340> (a java.lang.ref.Reference$Lock)

"main" prio=10 tid=0xf6706800 nid=0x1c4a runnable [0xf694b000]
   java.lang.Thread.State: RUNNABLE
	at java.net.SocketInputStream.socketRead0(Native Method)
	at java.net.SocketInputStream.read(SocketInputStream.java:150)
	at java.net.SocketInputStream.read(SocketInputStream.java:121)
	at java.io.BufferedInputStream.fill(BufferedInputStream.java:235)
	at java.io.BufferedInputStream.read1(BufferedInputStream.java:275)
	at java.io.BufferedInputStream.read(BufferedInputStream.java:334)
	- locked <0xe25d8268> (a java.io.BufferedInputStream)
	at sun.net.www.http.HttpClient.parseHTTPHeader(HttpClient.java:633)
	at sun.net.www.http.HttpClient.parseHTTP(HttpClient.java:579)
	at sun.net.www.protocol.http.HttpURLConnection.getInputStream(HttpURLConnection.java:1322)
	- locked <0xe25ccba8> (a sun.net.www.protocol.http.HttpURLConnection)
	at org.apache.avro.ipc.HttpTransceiver.readBuffers(HttpTransceiver.java:54)
	- locked <0xe25c0b30> (a org.apache.avro.ipc.HttpTransceiver)
	at org.apache.avro.ipc.Transceiver.transceive(Transceiver.java:59)
	at org.apache.avro.ipc.Transceiver.transceive(Transceiver.java:72)
	at org.apache.avro.ipc.Requestor.request(Requestor.java:147)
	at org.apache.avro.ipc.Requestor.request(Requestor.java:129)
	at org.apache.camel.component.avro.AvroProducer.process(AvroProducer.java:68)
	at org.apache.camel.processor.SendProcessor$2.doInAsyncProducer(SendProcessor.java:152)
	at org.apache.camel.impl.ProducerCache.doInAsyncProducer(ProducerCache.java:307)
	at org.apache.camel.processor.SendProcessor.process(SendProcessor.java:147)
	at org.apache.camel.processor.RedeliveryErrorHandler.process(RedeliveryErrorHandler.java:398)
	at org.apache.camel.processor.CamelInternalProcessor.process(CamelInternalProcessor.java:191)
	at org.apache.camel.processor.CamelInternalProcessor.process(CamelInternalProcessor.java:191)
	at org.apache.camel.component.direct.DirectProducer.process(DirectProducer.java:51)
	at org.apache.camel.processor.CamelInternalProcessor.process(CamelInternalProcessor.java:191)
	at org.apache.camel.processor.UnitOfWorkProducer.process(UnitOfWorkProducer.java:74)
	at org.apache.camel.impl.ProducerCache$2.doInProducer(ProducerCache.java:378)
	at org.apache.camel.impl.ProducerCache$2.doInProducer(ProducerCache.java:346)
	at org.apache.camel.impl.ProducerCache.doInProducer(ProducerCache.java:242)
	at org.apache.camel.impl.ProducerCache.sendExchange(ProducerCache.java:346)
	at org.apache.camel.impl.ProducerCache.send(ProducerCache.java:184)
	at org.apache.camel.impl.DefaultProducerTemplate.send(DefaultProducerTemplate.java:124)
	at org.apache.camel.impl.DefaultProducerTemplate.sendBody(DefaultProducerTemplate.java:137)
	at org.apache.camel.impl.DefaultProducerTemplate.sendBody(DefaultProducerTemplate.java:144)
	at org.apache.camel.component.avro.AvroProducerTestSupport.testInOnlyReflection(AvroProducerTestSupport.java:86)
	at sun.reflect.NativeMethodAccessorImpl.invoke0(Native Method)
	at sun.reflect.NativeMethodAccessorImpl.invoke(NativeMethodAccessorImpl.java:57)
	at sun.reflect.DelegatingMethodAccessorImpl.invoke(DelegatingMethodAccessorImpl.java:43)
	at java.lang.reflect.Method.invoke(Method.java:606)
	at org.junit.runners.model.FrameworkMethod$1.runReflectiveCall(FrameworkMethod.java:47)
	at org.junit.internal.runners.model.ReflectiveCallable.run(ReflectiveCallable.java:12)
	at org.junit.runners.model.FrameworkMethod.invokeExplosively(FrameworkMethod.java:44)
	at org.junit.internal.runners.statements.InvokeMethod.evaluate(InvokeMethod.java:17)
	at org.junit.internal.runners.statements.RunBefores.evaluate(RunBefores.java:26)
	at org.junit.internal.runners.statements.RunAfters.evaluate(RunAfters.java:27)
	at org.junit.rules.TestWatcher$1.evaluate(TestWatcher.java:55)
	at org.junit.rules.RunRules.evaluate(RunRules.java:20)
	at org.junit.runners.ParentRunner.runLeaf(ParentRunner.java:271)
	at org.junit.runners.BlockJUnit4ClassRunner.runChild(BlockJUnit4ClassRunner.java:70)
	at org.junit.runners.BlockJUnit4ClassRunner.runChild(BlockJUnit4ClassRunner.java:50)
	at org.junit.runners.ParentRunner$3.run(ParentRunner.java:238)
	at org.junit.runners.ParentRunner$1.schedule(ParentRunner.java:63)
	at org.junit.runners.ParentRunner.runChildren(ParentRunner.java:236)
	at org.junit.runners.ParentRunner.access$000(ParentRunner.java:53)
	at org.junit.runners.ParentRunner$2.evaluate(ParentRunner.java:229)
	at org.junit.internal.runners.statements.RunAfters.evaluate(RunAfters.java:27)
	at org.junit.runners.ParentRunner.run(ParentRunner.java:309)
	at org.apache.maven.surefire.junit4.JUnit4Provider.execute(JUnit4Provider.java:264)
	at org.apache.maven.surefire.junit4.JUnit4Provider.executeTestSet(JUnit4Provider.java:153)
	at org.apache.maven.surefire.junit4.JUnit4Provider.invoke(JUnit4Provider.java:124)
	at org.apache.maven.surefire.booter.ForkedBooter.invokeProviderInSameClassLoader(ForkedBooter.java:200)
	at org.apache.maven.surefire.booter.ForkedBooter.runSuitesInProcess(ForkedBooter.java:153)
	at org.apache.maven.surefire.booter.ForkedBooter.main(ForkedBooter.java:103)

"VM Thread" prio=10 tid=0xa9ef8400 nid=0x1c5d runnable 

"GC task thread#0 (ParallelGC)" prio=10 tid=0xf6710800 nid=0x1c4b runnable 

"GC task thread#1 (ParallelGC)" prio=10 tid=0xf6712000 nid=0x1c4c runnable 

"GC task thread#2 (ParallelGC)" prio=10 tid=0xf6713800 nid=0x1c4d runnable 

"GC task thread#3 (ParallelGC)" prio=10 tid=0xf6714c00 nid=0x1c4e runnable 

"GC task thread#4 (ParallelGC)" prio=10 tid=0xf6716400 nid=0x1c4f runnable 

"GC task thread#5 (ParallelGC)" prio=10 tid=0xf6717c00 nid=0x1c50 runnable 

"GC task thread#6 (ParallelGC)" prio=10 tid=0xf6719000 nid=0x1c51 runnable 

"GC task thread#7 (ParallelGC)" prio=10 tid=0xf671a800 nid=0x1c52 runnable 

"GC task thread#8 (ParallelGC)" prio=10 tid=0xf671c000 nid=0x1c53 runnable 

"GC task thread#9 (ParallelGC)" prio=10 tid=0xf671d400 nid=0x1c54 runnable 

"GC task thread#10 (ParallelGC)" prio=10 tid=0xf671ec00 nid=0x1c55 runnable 

"GC task thread#11 (ParallelGC)" prio=10 tid=0xf6720400 nid=0x1c56 runnable 

"GC task thread#12 (ParallelGC)" prio=10 tid=0xf6721800 nid=0x1c57 runnable 

"GC task thread#13 (ParallelGC)" prio=10 tid=0xf6723000 nid=0x1c58 runnable 

"GC task thread#14 (ParallelGC)" prio=10 tid=0xf6724800 nid=0x1c59 runnable 

"GC task thread#15 (ParallelGC)" prio=10 tid=0xf6725c00 nid=0x1c5a runnable 

"GC task thread#16 (ParallelGC)" prio=10 tid=0xf6727400 nid=0x1c5b runnable 

"GC task thread#17 (ParallelGC)" prio=10 tid=0xf6728c00 nid=0x1c5c runnable 

"VM Periodic Task Thread" prio=10 tid=0xa9628c00 nid=0x1c64 waiting on condition 

JNI global references: 294

+ echo '************ END  zombies jstack extract'
************ END  zombies jstack extract
+ JIRA_COMMENT='

     {color:red}-1 core zombie tests{color}.  There are 2 zombie test(s): 	at org.apache.hadoop.hbase.regionserver.TestTags.testFlushAndCompactionWithoutTags(TestTags.java:235)
	at org.apache.camel.component.avro.AvroProducerTestSupport.testInOnlyReflection(AvroProducerTestSupport.java:86)'
+ BAD=1
+ jps
+ grep surefirebooter
+ cut -d ' ' -f 1
+ xargs kill -9
POST BUILD TASK : SUCCESS
END OF POST BUILD TASK : 0
Archiving artifacts
Sending artifact delta relative to HBase-0.98 #459
Archived 1631 artifacts
Archive block size is 32768
Received 61 blocks and 437336394 bytes
Compression is 0.5%
Took 1 min 43 sec
Recording test results
Updating HBASE-11553