You are viewing a plain text version of this content. The canonical link for it is here.
Posted to builds@beam.apache.org by Apache Jenkins Server <je...@builds.apache.org> on 2023/02/13 21:12:30 UTC
Build failed in Jenkins: beam_PostCommit_XVR_Spark3 #2743
See <https://ci-beam.apache.org/job/beam_PostCommit_XVR_Spark3/2743/display/redirect?page=changes>
Changes:
[noreply] (#25316) Enable LZMA compression in Python SDK I/O (#25317)
[noreply] Add WatchFilePattern (#25393)
[noreply] Support gauge metrics in portable mode (#25396)
------------------------------------------
[...truncated 92.92 KB...]
response = meth(req, response)
File "/usr/lib/python3.7/urllib/request.py", line 641, in http_response
'http', request, response, code, msg, hdrs)
File "/usr/lib/python3.7/urllib/request.py", line 569, in error
return self._call_chain(*args)
File "/usr/lib/python3.7/urllib/request.py", line 503, in _call_chain
result = func(*args)
File "/usr/lib/python3.7/urllib/request.py", line 649, in http_error_default
raise HTTPError(req.full_url, code, msg, hdrs, fp)
urllib.error.HTTPError: HTTP Error 404: Not Found
ERROR:root:Invalid url for zstd-jni-1.5.2-5: https://opensource.org/licenses/BSD-2-Clause. Retrying...
> Task :sdks:java:extensions:sql:compileJava FROM-CACHE
> Task :sdks:java:extensions:sql:processResources
> Task :sdks:java:extensions:sql:classes
> Task :sdks:java:extensions:sql:jar
> Task :sdks:java:extensions:sql:zetasql:compileJava FROM-CACHE
> Task :sdks:java:extensions:sql:zetasql:classes UP-TO-DATE
> Task :sdks:java:extensions:sql:zetasql:jar
> Task :sdks:java:extensions:sql:expansion-service:compileJava FROM-CACHE
> Task :sdks:java:extensions:sql:expansion-service:classes UP-TO-DATE
> Task :sdks:java:container:pullLicenses
Traceback (most recent call last):
File "<https://ci-beam.apache.org/job/beam_PostCommit_XVR_Spark3/ws/src/sdks/java/container/license_scripts/pull_licenses_java.py",> line 62, in pull_from_url
'accept-language': 'en-US,en;q=0.9',
File "/usr/lib/python3.7/urllib/request.py", line 222, in urlopen
return opener.open(url, data, timeout)
File "/usr/lib/python3.7/urllib/request.py", line 531, in open
response = meth(req, response)
File "/usr/lib/python3.7/urllib/request.py", line 641, in http_response
'http', request, response, code, msg, hdrs)
File "/usr/lib/python3.7/urllib/request.py", line 569, in error
return self._call_chain(*args)
File "/usr/lib/python3.7/urllib/request.py", line 503, in _call_chain
result = func(*args)
File "/usr/lib/python3.7/urllib/request.py", line 649, in http_error_default
raise HTTPError(req.full_url, code, msg, hdrs, fp)
urllib.error.HTTPError: HTTP Error 404: Not Found
ERROR:root:Invalid url for zstd-jni-1.5.2-5: https://opensource.org/licenses/BSD-2-Clause. Retrying...
Traceback (most recent call last):
File "<https://ci-beam.apache.org/job/beam_PostCommit_XVR_Spark3/ws/src/sdks/java/container/license_scripts/pull_licenses_java.py",> line 62, in pull_from_url
'accept-language': 'en-US,en;q=0.9',
File "/usr/lib/python3.7/urllib/request.py", line 222, in urlopen
return opener.open(url, data, timeout)
File "/usr/lib/python3.7/urllib/request.py", line 531, in open
response = meth(req, response)
File "/usr/lib/python3.7/urllib/request.py", line 641, in http_response
'http', request, response, code, msg, hdrs)
File "/usr/lib/python3.7/urllib/request.py", line 569, in error
return self._call_chain(*args)
File "/usr/lib/python3.7/urllib/request.py", line 503, in _call_chain
result = func(*args)
File "/usr/lib/python3.7/urllib/request.py", line 649, in http_error_default
raise HTTPError(req.full_url, code, msg, hdrs, fp)
urllib.error.HTTPError: HTTP Error 404: Not Found
ERROR:root:Invalid url for zstd-jni-1.5.2-5: https://opensource.org/licenses/BSD-2-Clause. Retrying...
> Task :release:go-licenses:py:createLicenses
> Task :sdks:python:container:py37:copyGolangLicenses
> Task :sdks:java:container:pullLicenses
Traceback (most recent call last):
File "<https://ci-beam.apache.org/job/beam_PostCommit_XVR_Spark3/ws/src/sdks/java/container/license_scripts/pull_licenses_java.py",> line 62, in pull_from_url
'accept-language': 'en-US,en;q=0.9',
File "/usr/lib/python3.7/urllib/request.py", line 222, in urlopen
return opener.open(url, data, timeout)
File "/usr/lib/python3.7/urllib/request.py", line 531, in open
response = meth(req, response)
File "/usr/lib/python3.7/urllib/request.py", line 641, in http_response
'http', request, response, code, msg, hdrs)
File "/usr/lib/python3.7/urllib/request.py", line 569, in error
return self._call_chain(*args)
File "/usr/lib/python3.7/urllib/request.py", line 503, in _call_chain
result = func(*args)
File "/usr/lib/python3.7/urllib/request.py", line 649, in http_error_default
raise HTTPError(req.full_url, code, msg, hdrs, fp)
urllib.error.HTTPError: HTTP Error 404: Not Found
ERROR:root:Invalid url for zstd-jni-1.5.2-5: https://opensource.org/licenses/BSD-2-Clause after 9 retries.
ERROR:root:['zstd-jni-1.5.2-5']
ERROR:root:**************************************** Licenses were not able to be pulled automatically for some dependencies. Please search source code of the dependencies on the internet and add "license" and "notice" (if available) field to <https://ci-beam.apache.org/job/beam_PostCommit_XVR_Spark3/ws/src/sdks/java/container/license_scripts/dep_urls_java.yaml> for each missing license. Dependency List: [zstd-jni-1.5.2-5]
INFO:root:pull_licenses_java.py failed. It took 44.494914 seconds with 16 threads.
Traceback (most recent call last):
File "<https://ci-beam.apache.org/job/beam_PostCommit_XVR_Spark3/ws/src/sdks/java/container/license_scripts/pull_licenses_java.py",> line 327, in <module>
error_msg)
RuntimeError: ('1 error(s) occurred.', ['**************************************** Licenses were not able to be pulled automatically for some dependencies. Please search source code of the dependencies on the internet and add "license" and "notice" (if available) field to <https://ci-beam.apache.org/job/beam_PostCommit_XVR_Spark3/ws/src/sdks/java/container/license_scripts/dep_urls_java.yaml> for each missing license. Dependency List: [zstd-jni-1.5.2-5]'])
> Task :sdks:python:container:py37:dockerPrepare
> Task :sdks:java:container:pullLicenses FAILED
> Task :sdks:java:container:goPrepare UP-TO-DATE
> Task :release:go-licenses:java:createLicenses
> Task :sdks:java:container:java8:copyGolangLicenses
> Task :sdks:java:container:goBuild
> Task :sdks:java:extensions:sql:expansion-service:shadowJar FROM-CACHE
> Task :sdks:java:extensions:schemaio-expansion-service:checkstyleMain
> Task :sdks:java:extensions:schemaio-expansion-service:checkstyleTest
> Task :sdks:java:io:debezium:createCheckerFrameworkManifest
> Task :sdks:java:testing:kafka-service:createCheckerFrameworkManifest
> Task :sdks:java:testing:kafka-service:compileJava NO-SOURCE
> Task :sdks:java:testing:kafka-service:processResources NO-SOURCE
> Task :sdks:java:testing:kafka-service:classes UP-TO-DATE
> Task :release:go-licenses:go:createLicenses
> Task :sdks:java:extensions:schemaio-expansion-service:javadoc FROM-CACHE
> Task :sdks:go:container:copyGolangLicenses
> Task :sdks:java:container:java8:copySdkHarnessLauncher
Execution optimizations have been disabled for task ':sdks:java:container:java8:copySdkHarnessLauncher' to ensure correctness due to the following reasons:
- Gradle detected a problem with the following location: '<https://ci-beam.apache.org/job/beam_PostCommit_XVR_Spark3/ws/src/sdks/java/container/build/target'.> Reason: Task ':sdks:java:container:java8:copySdkHarnessLauncher' uses this output of task ':sdks:java:container:downloadCloudProfilerAgent' without declaring an explicit or implicit dependency. This can lead to incorrect results being produced, depending on what order the tasks are executed. Please refer to https://docs.gradle.org/7.5.1/userguide/validation_problems.html#implicit_dependency for more details about this problem.
- Gradle detected a problem with the following location: '<https://ci-beam.apache.org/job/beam_PostCommit_XVR_Spark3/ws/src/sdks/java/container/build/target'.> Reason: Task ':sdks:java:container:java8:copySdkHarnessLauncher' uses this output of task ':sdks:java:container:pullLicenses' without declaring an explicit or implicit dependency. This can lead to incorrect results being produced, depending on what order the tasks are executed. Please refer to https://docs.gradle.org/7.5.1/userguide/validation_problems.html#implicit_dependency for more details about this problem.
> Task :sdks:java:extensions:schemaio-expansion-service:spotbugsMain FROM-CACHE
> Task :sdks:java:io:debezium:compileJava FROM-CACHE
> Task :sdks:java:extensions:schemaio-expansion-service:spotbugsTest SKIPPED
> Task :sdks:java:io:debezium:processResources NO-SOURCE
> Task :sdks:java:io:debezium:classes UP-TO-DATE
> Task :sdks:java:io:debezium:jar
> Task :sdks:java:io:google-cloud-platform:expansion-service:createCheckerFrameworkManifest
> Task :sdks:java:io:google-cloud-platform:expansion-service:compileJava NO-SOURCE
> Task :sdks:java:io:google-cloud-platform:expansion-service:processResources NO-SOURCE
> Task :sdks:java:io:google-cloud-platform:expansion-service:classes UP-TO-DATE
> Task :sdks:java:io:debezium:expansion-service:createCheckerFrameworkManifest
> Task :sdks:java:io:debezium:expansion-service:compileJava NO-SOURCE
> Task :sdks:java:io:debezium:expansion-service:processResources NO-SOURCE
> Task :sdks:java:io:debezium:expansion-service:classes UP-TO-DATE
> Task :sdks:java:io:google-cloud-platform:expansion-service:jar
> Task :sdks:java:io:debezium:expansion-service:jar
> Task :sdks:java:testing:kafka-service:compileTestJava FROM-CACHE
> Task :sdks:java:io:google-cloud-platform:expansion-service:compileTestJava NO-SOURCE
> Task :sdks:java:io:google-cloud-platform:expansion-service:processTestResources NO-SOURCE
> Task :sdks:java:io:google-cloud-platform:expansion-service:testClasses UP-TO-DATE
> Task :sdks:java:testing:kafka-service:processTestResources
> Task :sdks:java:testing:kafka-service:testClasses
> Task :sdks:java:extensions:schemaio-expansion-service:spotlessJava FROM-CACHE
> Task :sdks:java:extensions:schemaio-expansion-service:spotlessJavaCheck UP-TO-DATE
> Task :sdks:java:extensions:schemaio-expansion-service:spotlessCheck UP-TO-DATE
> Task :sdks:java:io:google-cloud-platform:expansion-service:packageTests
> Task :sdks:java:io:google-cloud-platform:expansion-service:analyzeTestClassesDependencies SKIPPED
> Task :sdks:java:io:google-cloud-platform:expansion-service:checkstyleMain NO-SOURCE
> Task :sdks:java:io:google-cloud-platform:expansion-service:checkstyleTest NO-SOURCE
> Task :sdks:java:io:google-cloud-platform:expansion-service:javadoc NO-SOURCE
> Task :sdks:java:io:google-cloud-platform:expansion-service:spotbugsMain NO-SOURCE
> Task :sdks:java:io:google-cloud-platform:expansion-service:spotbugsTest SKIPPED
> Task :sdks:java:io:google-cloud-platform:expansion-service:spotlessJava FROM-CACHE
> Task :sdks:java:io:google-cloud-platform:expansion-service:spotlessJavaCheck UP-TO-DATE
> Task :sdks:java:io:google-cloud-platform:expansion-service:spotlessCheck UP-TO-DATE
> Task :sdks:java:io:expansion-service:distTar
> Task :sdks:go:container:dockerPrepare
> Task :sdks:java:io:debezium:expansion-service:startScripts
> Task :sdks:java:io:debezium:expansion-service:distTar
> Task :sdks:python:installGcpTest
> Task :sdks:java:io:expansion-service:distZip
> Task :sdks:java:io:expansion-service:compileTestJava NO-SOURCE
> Task :sdks:java:io:expansion-service:processTestResources NO-SOURCE
> Task :sdks:java:io:expansion-service:testClasses UP-TO-DATE
> Task :sdks:java:io:expansion-service:packageTests
> Task :sdks:java:io:debezium:expansion-service:distZip
> Task :sdks:java:io:debezium:expansion-service:compileTestJava NO-SOURCE
> Task :sdks:java:io:debezium:expansion-service:processTestResources NO-SOURCE
> Task :sdks:java:io:debezium:expansion-service:testClasses UP-TO-DATE
> Task :sdks:java:io:debezium:expansion-service:packageTests
> Task :sdks:java:testing:kafka-service:buildTestKafkaServiceJar FROM-CACHE
> Task :sdks:java:extensions:schemaio-expansion-service:shadowJar
> Task :sdks:java:io:google-cloud-platform:expansion-service:startScripts
> Task :sdks:java:extensions:schemaio-expansion-service:test
> Task :sdks:java:extensions:schemaio-expansion-service:check
> Task :sdks:java:extensions:schemaio-expansion-service:build
> Task :sdks:java:io:google-cloud-platform:expansion-service:distTar
> Task :sdks:java:io:expansion-service:shadowJar
> Task :sdks:java:io:expansion-service:startShadowScripts
> Task :sdks:java:io:expansion-service:shadowDistTar
> Task :sdks:go:container:docker
> Task :sdks:java:io:debezium:expansion-service:shadowJar
> Task :sdks:python:container:py37:docker
> Task :sdks:java:io:debezium:expansion-service:startShadowScripts
> Task :sdks:java:io:google-cloud-platform:expansion-service:distZip
> Task :sdks:java:io:debezium:expansion-service:shadowDistTar
> Task :sdks:java:io:expansion-service:shadowDistZip
> Task :sdks:java:io:expansion-service:assemble
> Task :sdks:java:io:expansion-service:analyzeClassesDependencies
> Task :sdks:java:io:expansion-service:analyzeTestClassesDependencies SKIPPED
> Task :sdks:java:io:expansion-service:analyzeDependencies
> Task :sdks:java:io:expansion-service:checkstyleMain NO-SOURCE
> Task :sdks:java:io:expansion-service:checkstyleTest NO-SOURCE
> Task :sdks:java:io:expansion-service:javadoc NO-SOURCE
> Task :sdks:java:io:expansion-service:spotbugsMain NO-SOURCE
> Task :sdks:java:io:expansion-service:spotbugsTest SKIPPED
> Task :sdks:java:io:expansion-service:spotlessJava FROM-CACHE
> Task :sdks:java:io:expansion-service:spotlessJavaCheck UP-TO-DATE
> Task :sdks:java:io:expansion-service:spotlessCheck UP-TO-DATE
> Task :sdks:java:io:expansion-service:test NO-SOURCE
> Task :sdks:java:io:expansion-service:check
> Task :sdks:java:io:expansion-service:build
> Task :sdks:java:io:debezium:expansion-service:shadowDistZip
> Task :sdks:java:io:debezium:expansion-service:assemble
> Task :sdks:java:io:debezium:expansion-service:analyzeClassesDependencies
> Task :sdks:java:io:debezium:expansion-service:analyzeTestClassesDependencies SKIPPED
> Task :sdks:java:io:debezium:expansion-service:analyzeDependencies
> Task :sdks:java:io:debezium:expansion-service:checkstyleMain NO-SOURCE
> Task :sdks:java:io:debezium:expansion-service:checkstyleTest NO-SOURCE
> Task :sdks:java:io:debezium:expansion-service:javadoc NO-SOURCE
> Task :sdks:java:io:debezium:expansion-service:spotbugsMain NO-SOURCE
> Task :sdks:java:io:debezium:expansion-service:spotbugsTest SKIPPED
> Task :sdks:java:io:debezium:expansion-service:spotlessJava FROM-CACHE
> Task :sdks:java:io:debezium:expansion-service:spotlessJavaCheck UP-TO-DATE
> Task :sdks:java:io:debezium:expansion-service:spotlessCheck UP-TO-DATE
> Task :sdks:java:io:debezium:expansion-service:test NO-SOURCE
> Task :sdks:java:io:debezium:expansion-service:check
> Task :sdks:java:io:debezium:expansion-service:build
> Task :runners:spark:3:job-server:sparkJobServerCleanup
> Task :sdks:java:io:google-cloud-platform:expansion-service:shadowJar
> Task :sdks:java:io:google-cloud-platform:expansion-service:startShadowScripts
> Task :sdks:java:io:google-cloud-platform:expansion-service:shadowDistTar
> Task :sdks:java:io:google-cloud-platform:expansion-service:shadowDistZip
> Task :sdks:java:io:google-cloud-platform:expansion-service:assemble
> Task :sdks:java:io:google-cloud-platform:expansion-service:analyzeClassesDependencies
> Task :sdks:java:io:google-cloud-platform:expansion-service:analyzeDependencies
> Task :sdks:java:io:google-cloud-platform:expansion-service:test NO-SOURCE
> Task :sdks:java:io:google-cloud-platform:expansion-service:check
> Task :sdks:java:io:google-cloud-platform:expansion-service:build
FAILURE: Build failed with an exception.
* What went wrong:
Execution failed for task ':sdks:java:container:pullLicenses'.
> Process 'command './license_scripts/license_script.sh'' finished with non-zero exit value 1
* Try:
> Run with --stacktrace option to get the stack trace.
> Run with --info or --debug option to get more log output.
* Get more help at https://help.gradle.org
Deprecated Gradle features were used in this build, making it incompatible with Gradle 8.0.
You can use '--warning-mode all' to show the individual deprecation warnings and determine if they come from your own scripts or plugins.
See https://docs.gradle.org/7.5.1/userguide/command_line_interface.html#sec:command_line_warnings
Execution optimizations have been disabled for 1 invalid unit(s) of work during this build to ensure correctness.
Please consult deprecation warnings for more details.
BUILD FAILED in 11m 26s
255 actionable tasks: 179 executed, 64 from cache, 12 up-to-date
Publishing build scan...
https://gradle.com/s/jghl62e4kfkdo
Build step 'Invoke Gradle script' changed build result to FAILURE
Build step 'Invoke Gradle script' marked build as failure
---------------------------------------------------------------------
To unsubscribe, e-mail: builds-unsubscribe@beam.apache.org
For additional commands, e-mail: builds-help@beam.apache.org
Jenkins build is back to normal : beam_PostCommit_XVR_Spark3 #2747
Posted by Apache Jenkins Server <je...@builds.apache.org>.
See <https://ci-beam.apache.org/job/beam_PostCommit_XVR_Spark3/2747/display/redirect?page=changes>
---------------------------------------------------------------------
To unsubscribe, e-mail: builds-unsubscribe@beam.apache.org
For additional commands, e-mail: builds-help@beam.apache.org
Build failed in Jenkins: beam_PostCommit_XVR_Spark3 #2746
Posted by Apache Jenkins Server <je...@builds.apache.org>.
See <https://ci-beam.apache.org/job/beam_PostCommit_XVR_Spark3/2746/display/redirect>
Changes:
------------------------------------------
[...truncated 634.11 KB...]
Successfully installed apache-beam-2.46.0.dev0
[91mWARNING: Running pip as the 'root' user can result in broken permissions and conflicting behaviour with the system package manager. It is recommended to use a virtual environment instead: https://pip.pypa.io/warnings/venv
[0mRemoving intermediate container 587e56f61c99
---> 4bab1466372c
Step 15/32 : RUN pip check || (echo "Container does not include required Beam dependencies or has conflicting dependencies. If Beam dependencies have changed, you need to regenerate base_image_requirements.txt files. See: https://s.apache.org/beam-python-requirements-generate" && exit 1)
---> Running in d36fbd411205
No broken requirements found.
Removing intermediate container d36fbd411205
---> 20e77dd13d53
Step 16/32 : RUN pip freeze --all
---> Running in 06fb6a2a7d76
absl-py==1.4.0
apache-beam @ file:///opt/apache/beam/tars/apache-beam.tar.gz
astunparse==1.6.3
attrs==22.2.0
beautifulsoup4==4.11.1
bs4==0.0.1
cachetools==4.2.4
certifi==2022.12.7
cffi==1.15.1
charset-normalizer==3.0.1
click==8.1.3
cloudpickle==2.2.1
crcmod==1.7
cryptography==39.0.0
Cython==0.29.33
deprecation==2.1.0
dill==0.3.1.1
docker==6.0.1
docopt==0.6.2
exceptiongroup==1.1.0
execnet==1.9.0
fastavro==1.7.0
fasteners==0.18
flatbuffers==23.1.21
freezegun==1.2.2
future==0.18.3
gast==0.4.0
google-api-core==2.11.0
google-api-python-client==2.74.0
google-apitools==0.5.31
google-auth==2.16.0
google-auth-httplib2==0.1.0
google-auth-oauthlib==0.4.6
google-cloud-bigquery==3.4.2
google-cloud-bigquery-storage==2.16.2
google-cloud-bigtable==1.7.3
google-cloud-core==2.3.2
google-cloud-datastore==1.15.5
google-cloud-dlp==3.11.1
google-cloud-language==1.3.2
google-cloud-profiler==3.1.0
google-cloud-pubsub==2.14.0
google-cloud-pubsublite==1.6.0
google-cloud-recommendations-ai==0.7.1
google-cloud-spanner==3.27.0
google-cloud-videointelligence==1.16.3
google-cloud-vision==3.3.1
google-crc32c==1.5.0
google-pasta==0.2.0
google-resumable-media==2.4.1
googleapis-common-protos==1.58.0
greenlet==2.0.1
grpc-google-iam-v1==0.12.6
grpcio==1.51.1
grpcio-status==1.48.2
guppy3==3.1.2
h5py==3.8.0
hdfs==2.7.0
httplib2==0.21.0
hypothesis==6.65.0
idna==3.4
importlib-metadata==6.0.0
iniconfig==2.0.0
joblib==1.2.0
keras==2.11.0
libclang==15.0.6.1
Markdown==3.4.1
MarkupSafe==2.1.2
mmh3==3.0.0
mock==2.0.0
nltk==3.8.1
nose==1.3.7
numpy==1.21.6
oauth2client==4.1.3
oauthlib==3.2.2
objsize==0.6.1
opt-einsum==3.3.0
orjson==3.8.5
overrides==6.5.0
packaging==23.0
pandas==1.3.5
parameterized==0.8.1
pbr==5.11.1
pip==23.0
pluggy==1.0.0
proto-plus==1.22.2
protobuf==3.19.6
psycopg2-binary==2.9.5
py==1.11.0
pyarrow==9.0.0
pyasn1==0.4.8
pyasn1-modules==0.2.8
pycparser==2.21
pydot==1.4.2
PyHamcrest==1.10.1
pymongo==3.13.0
PyMySQL==1.0.2
pyparsing==3.0.9
pytest==7.2.1
pytest-forked==1.4.0
pytest-timeout==2.1.0
pytest-xdist==2.5.0
python-dateutil==2.8.2
python-snappy==0.6.1
pytz==2022.7.1
PyYAML==6.0
regex==2022.10.31
requests==2.28.2
requests-mock==1.10.0
requests-oauthlib==1.3.1
rsa==4.9
scikit-learn==1.0.2
scipy==1.7.3
setuptools==67.3.1
six==1.16.0
sortedcontainers==2.4.0
soupsieve==2.3.2.post1
SQLAlchemy==1.4.46
sqlparse==0.4.3
tenacity==5.1.5
tensorboard==2.11.2
tensorboard-data-server==0.6.1
tensorboard-plugin-wit==1.8.1
tensorflow==2.11.0
tensorflow-estimator==2.11.0
tensorflow-io-gcs-filesystem==0.30.0
termcolor==2.2.0
testcontainers==3.7.1
threadpoolctl==3.1.0
tomli==2.0.1
tqdm==4.64.1
typing_extensions==4.4.0
uritemplate==4.1.1
urllib3==1.26.14
websocket-client==1.4.2
Werkzeug==2.2.2
wheel==0.38.4
wrapt==1.14.1
zipp==3.11.0
zstandard==0.19.0
Removing intermediate container 06fb6a2a7d76
---> 859e98d6940f
Step 17/32 : COPY target/LICENSE /opt/apache/beam/
---> 55696b310245
Step 18/32 : COPY target/LICENSE.python /opt/apache/beam/
---> 4efe554f972b
Step 19/32 : COPY target/NOTICE /opt/apache/beam/
---> 0064f067027f
Step 20/32 : COPY target/launcher/linux_amd64/boot /opt/apache/beam/
---> 3f9ec70de66b
Step 21/32 : ENTRYPOINT ["/opt/apache/beam/boot"]
---> Running in 2eb3c9f0b492
Removing intermediate container 2eb3c9f0b492
---> e8a39fb7246b
Step 22/32 : FROM beam as third_party_licenses
---> e8a39fb7246b
Step 23/32 : ARG pull_licenses
---> Running in 300526fe1e1c
Removing intermediate container 300526fe1e1c
---> 4c7742592be6
Step 24/32 : COPY target/license_scripts /tmp/license_scripts/
---> 491c3d6105ba
Step 25/32 : COPY target/LICENSE target/go-licenses/* /opt/apache/beam/third_party_licenses/golang/
---> d220d7ee50e3
Step 26/32 : RUN rm /opt/apache/beam/third_party_licenses/golang/LICENSE
---> Running in 05de83185996
Removing intermediate container 05de83185996
---> 85fc734509ac
Step 27/32 : COPY target/license_scripts /tmp/license_scripts/
---> 276e07a87ca1
Step 28/32 : RUN if [ "$pull_licenses" = "true" ] ; then pip install 'pip-licenses<4.0.0' pyyaml tenacity && python /tmp/license_scripts/pull_licenses_py.py ; fi
---> Running in 57ee8da17e70
Collecting pip-licenses<4.0.0
Downloading pip_licenses-3.5.5-py3-none-any.whl (17 kB)
Requirement already satisfied: pyyaml in /usr/local/lib/python3.7/site-packages (6.0)
Requirement already satisfied: tenacity in /usr/local/lib/python3.7/site-packages (5.1.5)
Collecting PTable
Downloading PTable-0.9.2.tar.gz (31 kB)
Preparing metadata (setup.py): started
Preparing metadata (setup.py): finished with status 'done'
Requirement already satisfied: six>=1.9.0 in /usr/local/lib/python3.7/site-packages (from tenacity) (1.16.0)
Building wheels for collected packages: PTable
Building wheel for PTable (setup.py): started
Building wheel for PTable (setup.py): finished with status 'done'
Created wheel for PTable: filename=PTable-0.9.2-py3-none-any.whl size=22908 sha256=81a8958a020e10ede9eb74a6bee0d605c08b0b3871a4ca12ef450e101bb0936a
Stored in directory: /root/.cache/pip/wheels/33/df/2f/674985b3f8a2de3f96357d1eadef5110f74fa91b3785e52a54
Successfully built PTable
Installing collected packages: PTable, pip-licenses
Successfully installed PTable-0.9.2 pip-licenses-3.5.5
[91mWARNING: Running pip as the 'root' user can result in broken permissions and conflicting behaviour with the system package manager. It is recommended to use a virtual environment instead: https://pip.pypa.io/warnings/venv
[0mSkip pulling license for bs4
[91mINFO:root:Successfully pulled licenses for 136 dependencies
[0mRemoving intermediate container 57ee8da17e70
---> b85f50f4274a
Step 29/32 : FROM beam
---> e8a39fb7246b
Step 30/32 : ARG pull_licenses
---> Running in e6943c1dc0a9
Removing intermediate container e6943c1dc0a9
---> e72d4cde842c
Step 31/32 : COPY --from=third_party_licenses /opt/apache/beam/third_party_licenses /opt/apache/beam/third_party_licenses
---> 71714810a9b7
Step 32/32 : RUN if [ "$pull_licenses" != "true" ] ; then rm -rf /opt/apache/beam/third_party_licenses ; fi
---> Running in cdc71a598b20
Removing intermediate container cdc71a598b20
---> b105b011dc04
Successfully built b105b011dc04
Successfully tagged apache/beam_python3.7_sdk:2.46.0.dev
FAILURE: Build failed with an exception.
* What went wrong:
Execution failed for task ':sdks:java:container:pullLicenses'.
> Process 'command './license_scripts/license_script.sh'' finished with non-zero exit value 1
* Try:
> Run with --stacktrace option to get the stack trace.
> Run with --info or --debug option to get more log output.
* Get more help at https://help.gradle.org
Deprecated Gradle features were used in this build, making it incompatible with Gradle 8.0.
You can use '--warning-mode all' to show the individual deprecation warnings and determine if they come from your own scripts or plugins.
See https://docs.gradle.org/7.5.1/userguide/command_line_interface.html#sec:command_line_warnings
Execution optimizations have been disabled for 1 invalid unit(s) of work during this build to ensure correctness.
Please consult deprecation warnings for more details.
BUILD FAILED in 10m 37s
255 actionable tasks: 165 executed, 78 from cache, 12 up-to-date
Publishing build scan...
https://gradle.com/s/kptccfkjyixku
Build step 'Invoke Gradle script' changed build result to FAILURE
Build step 'Invoke Gradle script' marked build as failure
---------------------------------------------------------------------
To unsubscribe, e-mail: builds-unsubscribe@beam.apache.org
For additional commands, e-mail: builds-help@beam.apache.org
Build failed in Jenkins: beam_PostCommit_XVR_Spark3 #2745
Posted by Apache Jenkins Server <je...@builds.apache.org>.
See <https://ci-beam.apache.org/job/beam_PostCommit_XVR_Spark3/2745/display/redirect?page=changes>
Changes:
[noreply] Remove python 3.6 references (#25445)
------------------------------------------
[...truncated 615.92 KB...]
Successfully installed apache-beam-2.46.0.dev0
[91mWARNING: Running pip as the 'root' user can result in broken permissions and conflicting behaviour with the system package manager. It is recommended to use a virtual environment instead: https://pip.pypa.io/warnings/venv
[0mRemoving intermediate container fed31ca137cd
---> c4fc60223e82
Step 15/32 : RUN pip check || (echo "Container does not include required Beam dependencies or has conflicting dependencies. If Beam dependencies have changed, you need to regenerate base_image_requirements.txt files. See: https://s.apache.org/beam-python-requirements-generate" && exit 1)
---> Running in 34150dd6f020
No broken requirements found.
Removing intermediate container 34150dd6f020
---> 7c7673b56142
Step 16/32 : RUN pip freeze --all
---> Running in 60f01393c874
absl-py==1.4.0
apache-beam @ file:///opt/apache/beam/tars/apache-beam.tar.gz
astunparse==1.6.3
attrs==22.2.0
beautifulsoup4==4.11.1
bs4==0.0.1
cachetools==4.2.4
certifi==2022.12.7
cffi==1.15.1
charset-normalizer==3.0.1
click==8.1.3
cloudpickle==2.2.1
crcmod==1.7
cryptography==39.0.0
Cython==0.29.33
deprecation==2.1.0
dill==0.3.1.1
docker==6.0.1
docopt==0.6.2
exceptiongroup==1.1.0
execnet==1.9.0
fastavro==1.7.0
fasteners==0.18
flatbuffers==23.1.21
freezegun==1.2.2
future==0.18.3
gast==0.4.0
google-api-core==2.11.0
google-api-python-client==2.74.0
google-apitools==0.5.31
google-auth==2.16.0
google-auth-httplib2==0.1.0
google-auth-oauthlib==0.4.6
google-cloud-bigquery==3.4.2
google-cloud-bigquery-storage==2.16.2
google-cloud-bigtable==1.7.3
google-cloud-core==2.3.2
google-cloud-datastore==1.15.5
google-cloud-dlp==3.11.1
google-cloud-language==1.3.2
google-cloud-profiler==3.1.0
google-cloud-pubsub==2.14.0
google-cloud-pubsublite==1.6.0
google-cloud-recommendations-ai==0.7.1
google-cloud-spanner==3.27.0
google-cloud-videointelligence==1.16.3
google-cloud-vision==3.3.1
google-crc32c==1.5.0
google-pasta==0.2.0
google-resumable-media==2.4.1
googleapis-common-protos==1.58.0
greenlet==2.0.1
grpc-google-iam-v1==0.12.6
grpcio==1.51.1
grpcio-status==1.48.2
guppy3==3.1.2
h5py==3.8.0
hdfs==2.7.0
httplib2==0.21.0
hypothesis==6.65.0
idna==3.4
importlib-metadata==6.0.0
iniconfig==2.0.0
joblib==1.2.0
keras==2.11.0
libclang==15.0.6.1
Markdown==3.4.1
MarkupSafe==2.1.2
mmh3==3.0.0
mock==2.0.0
nltk==3.8.1
nose==1.3.7
numpy==1.21.6
oauth2client==4.1.3
oauthlib==3.2.2
objsize==0.6.1
opt-einsum==3.3.0
orjson==3.8.5
overrides==6.5.0
packaging==23.0
pandas==1.3.5
parameterized==0.8.1
pbr==5.11.1
pip==23.0
pluggy==1.0.0
proto-plus==1.22.2
protobuf==3.19.6
psycopg2-binary==2.9.5
py==1.11.0
pyarrow==9.0.0
pyasn1==0.4.8
pyasn1-modules==0.2.8
pycparser==2.21
pydot==1.4.2
PyHamcrest==1.10.1
pymongo==3.13.0
PyMySQL==1.0.2
pyparsing==3.0.9
pytest==7.2.1
pytest-forked==1.4.0
pytest-timeout==2.1.0
pytest-xdist==2.5.0
python-dateutil==2.8.2
python-snappy==0.6.1
pytz==2022.7.1
PyYAML==6.0
regex==2022.10.31
requests==2.28.2
requests-mock==1.10.0
requests-oauthlib==1.3.1
rsa==4.9
scikit-learn==1.0.2
scipy==1.7.3
setuptools==67.2.0
six==1.16.0
sortedcontainers==2.4.0
soupsieve==2.3.2.post1
SQLAlchemy==1.4.46
sqlparse==0.4.3
tenacity==5.1.5
tensorboard==2.11.2
tensorboard-data-server==0.6.1
tensorboard-plugin-wit==1.8.1
tensorflow==2.11.0
tensorflow-estimator==2.11.0
tensorflow-io-gcs-filesystem==0.30.0
termcolor==2.2.0
testcontainers==3.7.1
threadpoolctl==3.1.0
tomli==2.0.1
tqdm==4.64.1
typing_extensions==4.4.0
uritemplate==4.1.1
urllib3==1.26.14
websocket-client==1.4.2
Werkzeug==2.2.2
wheel==0.38.4
wrapt==1.14.1
zipp==3.11.0
zstandard==0.19.0
Removing intermediate container 60f01393c874
---> c0cd8cd63f98
Step 17/32 : COPY target/LICENSE /opt/apache/beam/
---> 4895d4eb3df8
Step 18/32 : COPY target/LICENSE.python /opt/apache/beam/
---> fd1f18e31f89
Step 19/32 : COPY target/NOTICE /opt/apache/beam/
---> 7aecacc6330d
Step 20/32 : COPY target/launcher/linux_amd64/boot /opt/apache/beam/
---> 8324cce1276d
Step 21/32 : ENTRYPOINT ["/opt/apache/beam/boot"]
---> Running in 71b477aadcb4
Removing intermediate container 71b477aadcb4
---> b1a891c89f32
Step 22/32 : FROM beam as third_party_licenses
---> b1a891c89f32
Step 23/32 : ARG pull_licenses
---> Running in b45fed0abd1a
Removing intermediate container b45fed0abd1a
---> 1a813ea0c66f
Step 24/32 : COPY target/license_scripts /tmp/license_scripts/
---> e581fcb79cae
Step 25/32 : COPY target/LICENSE target/go-licenses/* /opt/apache/beam/third_party_licenses/golang/
---> 0d39810423a2
Step 26/32 : RUN rm /opt/apache/beam/third_party_licenses/golang/LICENSE
---> Running in 80420c6b83b6
Removing intermediate container 80420c6b83b6
---> dbbf590addeb
Step 27/32 : COPY target/license_scripts /tmp/license_scripts/
---> 5a2289f00ec4
Step 28/32 : RUN if [ "$pull_licenses" = "true" ] ; then pip install 'pip-licenses<4.0.0' pyyaml tenacity && python /tmp/license_scripts/pull_licenses_py.py ; fi
---> Running in 42f27379352c
Collecting pip-licenses<4.0.0
Downloading pip_licenses-3.5.5-py3-none-any.whl (17 kB)
Requirement already satisfied: pyyaml in /usr/local/lib/python3.7/site-packages (6.0)
Requirement already satisfied: tenacity in /usr/local/lib/python3.7/site-packages (5.1.5)
Collecting PTable
Downloading PTable-0.9.2.tar.gz (31 kB)
Preparing metadata (setup.py): started
Preparing metadata (setup.py): finished with status 'done'
Requirement already satisfied: six>=1.9.0 in /usr/local/lib/python3.7/site-packages (from tenacity) (1.16.0)
Building wheels for collected packages: PTable
Building wheel for PTable (setup.py): started
Building wheel for PTable (setup.py): finished with status 'done'
Created wheel for PTable: filename=PTable-0.9.2-py3-none-any.whl size=22908 sha256=f83286f80c2db412a74d9e41965c5c51ff2c83ccf08c99575c65f930186ec013
Stored in directory: /root/.cache/pip/wheels/33/df/2f/674985b3f8a2de3f96357d1eadef5110f74fa91b3785e52a54
Successfully built PTable
Installing collected packages: PTable, pip-licenses
Successfully installed PTable-0.9.2 pip-licenses-3.5.5
[91mWARNING: Running pip as the 'root' user can result in broken permissions and conflicting behaviour with the system package manager. It is recommended to use a virtual environment instead: https://pip.pypa.io/warnings/venv
[0mSkip pulling license for bs4
[91mINFO:root:Successfully pulled licenses for 136 dependencies
[0mRemoving intermediate container 42f27379352c
---> 83b1886c67bc
Step 29/32 : FROM beam
---> b1a891c89f32
Step 30/32 : ARG pull_licenses
---> Running in 0106164129bc
Removing intermediate container 0106164129bc
---> ac308087193a
Step 31/32 : COPY --from=third_party_licenses /opt/apache/beam/third_party_licenses /opt/apache/beam/third_party_licenses
---> adc6c7200b2f
Step 32/32 : RUN if [ "$pull_licenses" != "true" ] ; then rm -rf /opt/apache/beam/third_party_licenses ; fi
---> Running in 841d7f512260
Removing intermediate container 841d7f512260
---> 97aa3447899c
Successfully built 97aa3447899c
Successfully tagged apache/beam_python3.7_sdk:2.46.0.dev
FAILURE: Build failed with an exception.
* What went wrong:
Execution failed for task ':sdks:java:container:pullLicenses'.
> Process 'command './license_scripts/license_script.sh'' finished with non-zero exit value 1
* Try:
> Run with --stacktrace option to get the stack trace.
> Run with --info or --debug option to get more log output.
* Get more help at https://help.gradle.org
Deprecated Gradle features were used in this build, making it incompatible with Gradle 8.0.
You can use '--warning-mode all' to show the individual deprecation warnings and determine if they come from your own scripts or plugins.
See https://docs.gradle.org/7.5.1/userguide/command_line_interface.html#sec:command_line_warnings
Execution optimizations have been disabled for 1 invalid unit(s) of work during this build to ensure correctness.
Please consult deprecation warnings for more details.
BUILD FAILED in 9m 59s
255 actionable tasks: 175 executed, 68 from cache, 12 up-to-date
Publishing build scan...
https://gradle.com/s/iwpf24gqpx4n6
Build step 'Invoke Gradle script' changed build result to FAILURE
Build step 'Invoke Gradle script' marked build as failure
---------------------------------------------------------------------
To unsubscribe, e-mail: builds-unsubscribe@beam.apache.org
For additional commands, e-mail: builds-help@beam.apache.org
Build failed in Jenkins: beam_PostCommit_XVR_Spark3 #2744
Posted by Apache Jenkins Server <je...@builds.apache.org>.
See <https://ci-beam.apache.org/job/beam_PostCommit_XVR_Spark3/2744/display/redirect?page=changes>
Changes:
[xqhu] Ignore flags for beam_sql magic
[xqhu] Raise the error when some functions are misused
[xqhu] change how to import
[noreply] Validate that GBK coders are always set correctly. (#25394)
[noreply] Fix tox error running hdfsIntegrationTest (#25446)
[noreply] Adding support for DLQ for ZetaSQL (#25426)
------------------------------------------
[...truncated 119.09 KB...]
> Task :sdks:java:io:debezium:createCheckerFrameworkManifest
> Task :sdks:java:testing:kafka-service:compileTestJava FROM-CACHE
> Task :sdks:java:testing:kafka-service:processTestResources
> Task :sdks:java:testing:kafka-service:testClasses
> Task :sdks:java:io:debezium:compileJava FROM-CACHE
> Task :sdks:java:io:debezium:processResources NO-SOURCE
> Task :sdks:java:io:debezium:classes UP-TO-DATE
> Task :sdks:java:io:debezium:jar
> Task :sdks:java:io:debezium:expansion-service:createCheckerFrameworkManifest
> Task :sdks:java:io:debezium:expansion-service:compileJava NO-SOURCE
> Task :sdks:java:io:debezium:expansion-service:processResources NO-SOURCE
> Task :sdks:java:io:debezium:expansion-service:classes UP-TO-DATE
> Task :sdks:java:io:debezium:expansion-service:jar
> Task :sdks:java:io:debezium:expansion-service:startScripts
> Task :sdks:java:io:debezium:expansion-service:distTar
> Task :sdks:java:testing:kafka-service:buildTestKafkaServiceJar FROM-CACHE
> Task :sdks:java:io:google-cloud-platform:expansion-service:createCheckerFrameworkManifest
> Task :sdks:java:io:google-cloud-platform:expansion-service:compileJava NO-SOURCE
> Task :sdks:java:io:google-cloud-platform:expansion-service:processResources NO-SOURCE
> Task :sdks:java:io:google-cloud-platform:expansion-service:classes UP-TO-DATE
> Task :sdks:java:io:google-cloud-platform:expansion-service:jar
> Task :sdks:java:io:debezium:expansion-service:distZip
> Task :sdks:java:io:debezium:expansion-service:compileTestJava NO-SOURCE
> Task :sdks:java:io:debezium:expansion-service:processTestResources NO-SOURCE
> Task :sdks:java:io:debezium:expansion-service:testClasses UP-TO-DATE
> Task :sdks:java:io:debezium:expansion-service:packageTests
> Task :release:go-licenses:py:createLicenses
> Task :sdks:python:container:py37:copyGolangLicenses
> Task :sdks:python:container:py37:dockerPrepare
> Task :release:go-licenses:java:createLicenses
> Task :sdks:java:container:java8:copyGolangLicenses
> Task :sdks:java:io:expansion-service:shadowJar
> Task :sdks:java:io:google-cloud-platform:expansion-service:startScripts
> Task :sdks:java:io:google-cloud-platform:expansion-service:distTar
> Task :release:go-licenses:go:createLicenses
> Task :sdks:go:container:copyGolangLicenses
> Task :sdks:go:container:dockerPrepare
> Task :sdks:java:io:expansion-service:startShadowScripts
> Task :sdks:java:io:expansion-service:shadowDistTar
> Task :sdks:java:io:expansion-service:shadowDistZip
> Task :sdks:java:io:expansion-service:assemble
> Task :sdks:java:io:expansion-service:analyzeClassesDependencies
> Task :sdks:java:io:expansion-service:analyzeTestClassesDependencies SKIPPED
> Task :sdks:java:io:expansion-service:analyzeDependencies
> Task :sdks:java:io:expansion-service:checkstyleMain NO-SOURCE
> Task :sdks:java:io:expansion-service:checkstyleTest NO-SOURCE
> Task :sdks:java:io:expansion-service:javadoc NO-SOURCE
> Task :sdks:java:io:expansion-service:spotbugsMain NO-SOURCE
> Task :sdks:java:io:expansion-service:spotbugsTest SKIPPED
> Task :sdks:java:io:expansion-service:spotlessJava FROM-CACHE
> Task :sdks:java:io:expansion-service:spotlessJavaCheck UP-TO-DATE
> Task :sdks:java:io:expansion-service:spotlessCheck UP-TO-DATE
> Task :sdks:java:io:expansion-service:test NO-SOURCE
> Task :sdks:java:io:expansion-service:check
> Task :sdks:java:io:expansion-service:build
> Task :sdks:go:container:docker
Get:4 http://deb.debian.org/debian bullseye/main amd64 Packages [8183 kB]
Get:5 http://deb.debian.org/debian-security bullseye-security/main amd64 Packages [226 kB]
Get:6 http://deb.debian.org/debian bullseye-updates/main amd64 Packages [14.6 kB]
Fetched 8632 kB in 2s (3599 kB/s)
Reading package lists...
Reading package lists...
> Task :sdks:java:io:google-cloud-platform:expansion-service:distZip
> Task :sdks:java:io:google-cloud-platform:expansion-service:compileTestJava NO-SOURCE
> Task :sdks:java:io:google-cloud-platform:expansion-service:processTestResources NO-SOURCE
> Task :sdks:java:io:google-cloud-platform:expansion-service:testClasses UP-TO-DATE
> Task :sdks:java:io:google-cloud-platform:expansion-service:packageTests
> Task :sdks:python:container:py37:docker
Get:4 http://deb.debian.org/debian bullseye/main amd64 Packages [8183 kB]
Get:5 http://deb.debian.org/debian-security bullseye-security/main amd64 Packages [226 kB]
Get:6 http://deb.debian.org/debian bullseye-updates/main amd64 Packages [14.6 kB]
Fetched 8632 kB in 3s (3376 kB/s)
Reading package lists...(Reading database ... 70%(Reading database ... 75%(Reading database ... 80%(Reading database ... 85%(Reading database ... 90%(Reading database ... 95%(Reading database ... 100%(Reading database ... 23423 files and directories currently installed.)
Preparing to unpack .../ccache_4.2-1_amd64.deb ...
Unpacking ccache (4.2-1) ...
Selecting previously unselected package libsnappy1v5:amd64.
Preparing to unpack .../libsnappy1v5_1.1.8-1_amd64.deb ...
Unpacking libsnappy1v5:amd64 (1.1.8-1) ...
Selecting previously unselected package libsnappy-dev:amd64.
Preparing to unpack .../libsnappy-dev_1.1.8-1_amd64.deb ...
Unpacking libsnappy-dev:amd64 (1.1.8-1) ...
Setting up ccache (4.2-1) ...
Updating symlinks in /usr/lib/ccache ...
Setting up libsnappy1v5:amd64 (1.1.8-1) ...
Setting up libsnappy-dev:amd64 (1.1.8-1) ...
Processing triggers for libc-bin (2.31-13+deb11u5) ...
> Task :sdks:java:io:debezium:expansion-service:shadowJar
> Task :sdks:go:container:docker
(Reading database ... 95%(Reading database ... 100%(Reading database ... 6661 files and directories currently installed.)
Preparing to unpack .../openssl_1.1.1n-0+deb11u4_amd64.deb ...
Unpacking openssl (1.1.1n-0+deb11u4) ...
Selecting previously unselected package ca-certificates.
Preparing to unpack .../ca-certificates_20210119_all.deb ...
Unpacking ca-certificates (20210119) ...
Setting up openssl (1.1.1n-0+deb11u4) ...
Setting up ca-certificates (20210119) ...
Updating certificates in /etc/ssl/certs...
129 added, 0 removed; done.
Processing triggers for ca-certificates (20210119) ...
Updating certificates in /etc/ssl/certs...
0 added, 0 removed; done.
Running hooks in /etc/ca-certificates/update.d...
done.
> Task :sdks:java:io:debezium:expansion-service:startShadowScripts
> Task :sdks:java:io:debezium:expansion-service:shadowDistTar
> Task :sdks:go:container:docker
Removing intermediate container 58f586c3b5d1
---> 79aa6550af24
Step 5/11 : ADD target/linux_amd64/boot /opt/apache/beam/
> Task :sdks:java:io:debezium:expansion-service:shadowDistZip
> Task :sdks:java:io:debezium:expansion-service:assemble
> Task :sdks:java:io:debezium:expansion-service:analyzeClassesDependencies
> Task :sdks:java:io:debezium:expansion-service:analyzeTestClassesDependencies SKIPPED
> Task :sdks:java:io:debezium:expansion-service:analyzeDependencies
> Task :sdks:java:io:debezium:expansion-service:checkstyleMain NO-SOURCE
> Task :sdks:java:io:debezium:expansion-service:checkstyleTest NO-SOURCE
> Task :sdks:java:io:debezium:expansion-service:javadoc NO-SOURCE
> Task :sdks:java:io:debezium:expansion-service:spotbugsMain NO-SOURCE
> Task :sdks:java:io:debezium:expansion-service:spotbugsTest SKIPPED
> Task :sdks:java:io:debezium:expansion-service:spotlessJava FROM-CACHE
> Task :sdks:java:io:debezium:expansion-service:spotlessJavaCheck UP-TO-DATE
> Task :sdks:java:io:debezium:expansion-service:spotlessCheck UP-TO-DATE
> Task :sdks:java:io:debezium:expansion-service:test NO-SOURCE
> Task :sdks:java:io:debezium:expansion-service:check
> Task :sdks:java:io:debezium:expansion-service:build
> Task :sdks:python:container:py37:docker
Removing intermediate container 32346241dec4
---> 544b5230c418
Step 5/32 : COPY target/base_image_requirements.txt /tmp/base_image_requirements.txt
---> 618c372f9fb0
Step 6/32 : RUN pip install --no-deps -r /tmp/base_image_requirements.txt && python -c "import nltk; nltk.download('stopwords')" && rm /root/nltk_data/corpora/stopwords.zip && python -c "from google.protobuf.internal import api_implementation; assert api_implementation._default_implementation_type == 'cpp'; print ('Verified fast protobuf used.')" && rm -rf /root/.cache/pip && rm -rf /tmp/base_image_requirements.txt
---> Running in dd3563dff6e4
> Task :sdks:go:container:docker
---> 792c4f22bf4a
Step 6/11 : COPY target/LICENSE /opt/apache/beam/
---> 19a5bb9cae63
Step 7/11 : COPY target/NOTICE /opt/apache/beam/
---> 536306b4526b
Step 8/11 : COPY target/LICENSE target/go-licenses/* /opt/apache/beam/third_party_licenses/golang/
---> 3048d9bbf432
Step 9/11 : RUN rm /opt/apache/beam/third_party_licenses/golang/LICENSE
---> Running in 8a3cfb7da9b8
Removing intermediate container 8a3cfb7da9b8
---> 0d1be4dd2770
Step 10/11 : RUN if [ "$pull_licenses" = "false" ] ; then rm -rf /opt/apache/beam/third_party_licenses ; fi
---> Running in fdd8a8b8200e
Removing intermediate container fdd8a8b8200e
---> 1f7ec7261b7f
Step 11/11 : ENTRYPOINT ["/opt/apache/beam/boot"]
---> Running in 77eb436dd2fa
Removing intermediate container 77eb436dd2fa
---> d56b6858883f
Successfully built d56b6858883f
Successfully tagged apache/beam_go_sdk:latest
> Task :runners:spark:3:job-server:sparkJobServerCleanup
Stopping job server pid: 809072.
> Task :sdks:python:container:py37:docker
Collecting absl-py==1.4.0
Downloading absl_py-1.4.0-py3-none-any.whl (126 kB)
━━━━━━━━━━━━━━━━━━━━━━━━━━━━━━━━━━━━━━━ 126.5/126.5 KB 4.6 MB/s eta 0:00:00
Collecting astunparse==1.6.3
Downloading astunparse-1.6.3-py2.py3-none-any.whl (12 kB)
Collecting attrs==22.2.0
Downloading attrs-22.2.0-py3-none-any.whl (60 kB)
━━━━━━━━━━━━━━━━━━━━━━━━━━━━━━━━━━━━━━━━ 60.0/60.0 KB 10.3 MB/s eta 0:00:00
Collecting beautifulsoup4==4.11.1
Downloading beautifulsoup4-4.11.1-py3-none-any.whl (128 kB)
━━━━━━━━━━━━━━━━━━━━━━━━━━━━━━━━━━━━━━ 128.2/128.2 KB 17.6 MB/s eta 0:00:00
Collecting bs4==0.0.1
Downloading bs4-0.0.1.tar.gz (1.1 kB)
Preparing metadata (setup.py): started
> Task :sdks:java:io:google-cloud-platform:expansion-service:shadowJar
> Task :sdks:java:io:google-cloud-platform:expansion-service:startShadowScripts
> Task :sdks:java:io:google-cloud-platform:expansion-service:shadowDistTar
> Task :sdks:java:io:google-cloud-platform:expansion-service:shadowDistZip
> Task :sdks:java:io:google-cloud-platform:expansion-service:assemble
> Task :sdks:java:io:google-cloud-platform:expansion-service:analyzeClassesDependencies
> Task :sdks:java:io:google-cloud-platform:expansion-service:analyzeTestClassesDependencies SKIPPED
> Task :sdks:java:io:google-cloud-platform:expansion-service:analyzeDependencies
> Task :sdks:java:io:google-cloud-platform:expansion-service:checkstyleMain NO-SOURCE
> Task :sdks:java:io:google-cloud-platform:expansion-service:checkstyleTest NO-SOURCE
> Task :sdks:java:io:google-cloud-platform:expansion-service:javadoc NO-SOURCE
> Task :sdks:java:io:google-cloud-platform:expansion-service:spotbugsMain NO-SOURCE
> Task :sdks:java:io:google-cloud-platform:expansion-service:spotbugsTest SKIPPED
> Task :sdks:java:io:google-cloud-platform:expansion-service:spotlessJava FROM-CACHE
> Task :sdks:java:io:google-cloud-platform:expansion-service:spotlessJavaCheck UP-TO-DATE
> Task :sdks:java:io:google-cloud-platform:expansion-service:spotlessCheck UP-TO-DATE
> Task :sdks:java:io:google-cloud-platform:expansion-service:test NO-SOURCE
> Task :sdks:java:io:google-cloud-platform:expansion-service:check
> Task :sdks:java:io:google-cloud-platform:expansion-service:build
> Task :sdks:python:container:py37:docker FAILED
COPY failed: stat /var/lib/docker/tmp/docker-builder707309128/target/launcher/linux_amd64/boot: no such file or directory
FAILURE: Build completed with 2 failures.
1: Task failed with an exception.
-----------
* What went wrong:
Execution failed for task ':sdks:java:container:pullLicenses'.
> Process 'command './license_scripts/license_script.sh'' finished with non-zero exit value 1
* Try:
> Run with --stacktrace option to get the stack trace.
> Run with --info or --debug option to get more log output.
==============================================================================
2: Task failed with an exception.
-----------
* What went wrong:
Execution failed for task ':sdks:python:container:py37:docker'.
> Process 'command 'docker'' finished with non-zero exit value 1
* Try:
> Run with --stacktrace option to get the stack trace.
> Run with --info or --debug option to get more log output.
==============================================================================
* Get more help at https://help.gradle.org
Deprecated Gradle features were used in this build, making it incompatible with Gradle 8.0.
You can use '--warning-mode all' to show the individual deprecation warnings and determine if they come from your own scripts or plugins.
See https://docs.gradle.org/7.5.1/userguide/command_line_interface.html#sec:command_line_warnings
Execution optimizations have been disabled for 1 invalid unit(s) of work during this build to ensure correctness.
Please consult deprecation warnings for more details.
BUILD FAILED in 12m 51s
254 actionable tasks: 180 executed, 62 from cache, 12 up-to-date
Publishing build scan...
https://gradle.com/s/5652cbspvaw4i
Build step 'Invoke Gradle script' changed build result to FAILURE
Build step 'Invoke Gradle script' marked build as failure
---------------------------------------------------------------------
To unsubscribe, e-mail: builds-unsubscribe@beam.apache.org
For additional commands, e-mail: builds-help@beam.apache.org