You are viewing a plain text version of this content. The canonical link for it is here.
Posted to commits@jena.apache.org by Apache Jenkins Server <je...@builds.apache.org> on 2015/12/22 19:08:32 UTC

Build failed in Jenkins: Jena_Development_Deploy #1078

See <https://builds.apache.org/job/Jena_Development_Deploy/1078/changes>

Changes:

[andy] Move hex string processing.

[andy] Note for jena 864.

[andy] Mod ModSymbol to better name ModContext

[andy] Cleanup : remove TextHitConverter and refer comment about it.

[andy] Move CharSpace to jena-base.  Clean up string escape processing.

[andy] QuotedStringOutput replaces EscapeProc

[andy] JENA-1098: Code multiline literals (not enabled in this commit)

[andy] JENA-1098: Pass Context to writer operations (Turtle and Trig).

------------------------------------------
[...truncated 4258 lines...]
[INFO] 
[INFO] --- maven-surefire-plugin:2.17:test (default-test) @ jena-elephas-common ---
[INFO] Surefire report directory: <https://builds.apache.org/job/Jena_Development_Deploy/ws/jena-elephas/jena-elephas-common/target/surefire-reports>

-------------------------------------------------------
 T E S T S
-------------------------------------------------------
Running org.apache.jena.hadoop.rdf.io.types.RdfTypesTest
Tests run: 19, Failures: 0, Errors: 0, Skipped: 2, Time elapsed: 0.965 sec - in org.apache.jena.hadoop.rdf.io.types.RdfTypesTest

Results :

Tests run: 19, Failures: 0, Errors: 0, Skipped: 2

[JENKINS] Recording test results
[INFO] 
[INFO] --- maven-jar-plugin:2.5:jar (default-jar) @ jena-elephas-common ---
[INFO] Building jar: <https://builds.apache.org/job/Jena_Development_Deploy/ws/jena-elephas/jena-elephas-common/target/jena-elephas-common-3.1.0-SNAPSHOT.jar>
[INFO] 
[INFO] --- maven-site-plugin:3.4:attach-descriptor (attach-descriptor) @ jena-elephas-common ---
[INFO] 
[INFO] --- maven-javadoc-plugin:2.9.1:jar (attach-javadocs) @ jena-elephas-common ---
[INFO] Building jar: <https://builds.apache.org/job/Jena_Development_Deploy/ws/jena-elephas/jena-elephas-common/target/jena-elephas-common-3.1.0-SNAPSHOT-javadoc.jar>
[INFO] 
[INFO] --- maven-install-plugin:2.5.2:install (default-install) @ jena-elephas-common ---
[INFO] Installing <https://builds.apache.org/job/Jena_Development_Deploy/ws/jena-elephas/jena-elephas-common/target/jena-elephas-common-3.1.0-SNAPSHOT.jar> to /home/jenkins/jenkins-slave/maven-repositories/1/org/apache/jena/jena-elephas-common/3.1.0-SNAPSHOT/jena-elephas-common-3.1.0-SNAPSHOT.jar
[INFO] Installing <https://builds.apache.org/job/Jena_Development_Deploy/ws/jena-elephas/jena-elephas-common/pom.xml> to /home/jenkins/jenkins-slave/maven-repositories/1/org/apache/jena/jena-elephas-common/3.1.0-SNAPSHOT/jena-elephas-common-3.1.0-SNAPSHOT.pom
[INFO] Installing <https://builds.apache.org/job/Jena_Development_Deploy/ws/jena-elephas/jena-elephas-common/target/jena-elephas-common-3.1.0-SNAPSHOT-javadoc.jar> to /home/jenkins/jenkins-slave/maven-repositories/1/org/apache/jena/jena-elephas-common/3.1.0-SNAPSHOT/jena-elephas-common-3.1.0-SNAPSHOT-javadoc.jar
[INFO] 
[INFO] --- maven-deploy-plugin:2.8.2:deploy (default-deploy) @ jena-elephas-common ---
[INFO] Downloading: https://repository.apache.org/content/repositories/snapshots/org/apache/jena/jena-elephas-common/3.1.0-SNAPSHOT/maven-metadata.xml
[INFO] Downloaded: https://repository.apache.org/content/repositories/snapshots/org/apache/jena/jena-elephas-common/3.1.0-SNAPSHOT/maven-metadata.xml (1002 B at 4.9 KB/sec)
[INFO] Uploading: https://repository.apache.org/content/repositories/snapshots/org/apache/jena/jena-elephas-common/3.1.0-SNAPSHOT/jena-elephas-common-3.1.0-20151222.180141-16.jar
[INFO] Uploaded: https://repository.apache.org/content/repositories/snapshots/org/apache/jena/jena-elephas-common/3.1.0-SNAPSHOT/jena-elephas-common-3.1.0-20151222.180141-16.jar (25 KB at 120.1 KB/sec)
[INFO] Uploading: https://repository.apache.org/content/repositories/snapshots/org/apache/jena/jena-elephas-common/3.1.0-SNAPSHOT/jena-elephas-common-3.1.0-20151222.180141-16.pom
[INFO] Uploaded: https://repository.apache.org/content/repositories/snapshots/org/apache/jena/jena-elephas-common/3.1.0-SNAPSHOT/jena-elephas-common-3.1.0-20151222.180141-16.pom (3 KB at 18.9 KB/sec)
[INFO] Downloading: https://repository.apache.org/content/repositories/snapshots/org/apache/jena/jena-elephas-common/maven-metadata.xml
[INFO] Downloaded: https://repository.apache.org/content/repositories/snapshots/org/apache/jena/jena-elephas-common/maven-metadata.xml (394 B at 2.7 KB/sec)
[INFO] Uploading: https://repository.apache.org/content/repositories/snapshots/org/apache/jena/jena-elephas-common/3.1.0-SNAPSHOT/maven-metadata.xml
[INFO] Uploaded: https://repository.apache.org/content/repositories/snapshots/org/apache/jena/jena-elephas-common/3.1.0-SNAPSHOT/maven-metadata.xml (1002 B at 2.2 KB/sec)
[INFO] Uploading: https://repository.apache.org/content/repositories/snapshots/org/apache/jena/jena-elephas-common/maven-metadata.xml
[INFO] Uploaded: https://repository.apache.org/content/repositories/snapshots/org/apache/jena/jena-elephas-common/maven-metadata.xml (394 B at 2.7 KB/sec)
[INFO] Uploading: https://repository.apache.org/content/repositories/snapshots/org/apache/jena/jena-elephas-common/3.1.0-SNAPSHOT/jena-elephas-common-3.1.0-20151222.180141-16-javadoc.jar
[INFO] Uploaded: https://repository.apache.org/content/repositories/snapshots/org/apache/jena/jena-elephas-common/3.1.0-SNAPSHOT/jena-elephas-common-3.1.0-20151222.180141-16-javadoc.jar (91 KB at 594.1 KB/sec)
[INFO] Uploading: https://repository.apache.org/content/repositories/snapshots/org/apache/jena/jena-elephas-common/3.1.0-SNAPSHOT/maven-metadata.xml
[INFO] Uploaded: https://repository.apache.org/content/repositories/snapshots/org/apache/jena/jena-elephas-common/3.1.0-SNAPSHOT/maven-metadata.xml (1002 B at 7.1 KB/sec)
[JENKINS] Archiving disabled
[INFO]                                                                         
[INFO] ------------------------------------------------------------------------
[INFO] Building Apache Jena - Elephas - I/O 3.1.0-SNAPSHOT
[INFO] ------------------------------------------------------------------------
[INFO] 
[INFO] --- maven-clean-plugin:2.5:clean (default-clean) @ jena-elephas-io ---
[INFO] Deleting <https://builds.apache.org/job/Jena_Development_Deploy/ws/jena-elephas/jena-elephas-io/target>
[INFO] 
[INFO] --- maven-enforcer-plugin:1.3.1:enforce (enforce) @ jena-elephas-io ---
[INFO] 
[INFO] --- apache-rat-plugin:0.11:check (rat-checks) @ jena-elephas-io ---
[INFO] 51 implicit excludes (use -debug for more details).
[INFO] Exclude: **/META-INF/services/*
[INFO] Exclude: **/src-examples/data/*
[INFO] Exclude: **/dist/ABOUT
[INFO] Exclude: **/SEE_FUSEKI2
[INFO] Exclude: **/src/main/webapp/css/*
[INFO] Exclude: **/src/main/webapp/fonts/*
[INFO] Exclude: **/src/main/webapp/js/**/*
[INFO] Exclude: **/vocabularies/*
[INFO] Exclude: **/Vocabularies/*
[INFO] Exclude: **/src/main/**/*.html
[INFO] Exclude: **/src/**/package-info.java
[INFO] Exclude: **/DEPENDENCIES
[INFO] Exclude: **/*.txt
[INFO] Exclude: **/*.md
[INFO] Exclude: **/META-INF/services/*
[INFO] Exclude: **/src/test/resources/**/*
[INFO] Exclude: **/testing/**/*
[INFO] Exclude: **/log4j.properties
[INFO] Exclude: **/log4j-testing.properties
[INFO] Exclude: **/derby.log
[INFO] Exclude: **/DB/**/*
[INFO] Exclude: **/tdb*.cfg
[INFO] Exclude: **/run/**/*
[INFO] Exclude: **/*.classpath
[INFO] Exclude: **/target/**/*
[INFO] Exclude: **/dependency-reduced-pom.xml
[INFO] 253 resources included (use -debug for more details)
Warning:  org.apache.xerces.jaxp.SAXParserImpl$JAXPSAXParser: Property 'http://www.oracle.com/xml/jaxp/properties/entityExpansionLimit' is not recognized.
Compiler warnings:
  WARNING:  'org.apache.xerces.jaxp.SAXParserImpl: Property 'http://javax.xml.XMLConstants/property/accessExternalDTD' is not recognized.'
Warning:  org.apache.xerces.parsers.SAXParser: Feature 'http://javax.xml.XMLConstants/feature/secure-processing' is not recognized.
Warning:  org.apache.xerces.parsers.SAXParser: Property 'http://javax.xml.XMLConstants/property/accessExternalDTD' is not recognized.
Warning:  org.apache.xerces.parsers.SAXParser: Property 'http://www.oracle.com/xml/jaxp/properties/entityExpansionLimit' is not recognized.
[INFO] Rat check: Summary of files. Unapproved: 0 unknown: 0 generated: 0 approved: 253 licence.
[INFO] 
[INFO] --- maven-remote-resources-plugin:1.5:process (default) @ jena-elephas-io ---
[INFO] 
[INFO] --- maven-resources-plugin:2.6:resources (default-resources) @ jena-elephas-io ---
[INFO] Using 'UTF-8' encoding to copy filtered resources.
[INFO] Copying 2 resources
[INFO] Copying 3 resources
[INFO] 
[INFO] --- maven-compiler-plugin:3.1:compile (default-compile) @ jena-elephas-io ---
[INFO] Changes detected - recompiling the module!
[INFO] Compiling 131 source files to <https://builds.apache.org/job/Jena_Development_Deploy/ws/jena-elephas/jena-elephas-io/target/classes>
[INFO] -------------------------------------------------------------
[WARNING] COMPILATION WARNING : 
[INFO] -------------------------------------------------------------
[WARNING] <https://builds.apache.org/job/Jena_Development_Deploy/ws/jena-elephas/jena-elephas-io/src/main/java/org/apache/jena/hadoop/rdf/io/output/writers/AbstractWholeFileQuadWriter.java>: Some input files use or override a deprecated API.
[WARNING] <https://builds.apache.org/job/Jena_Development_Deploy/ws/jena-elephas/jena-elephas-io/src/main/java/org/apache/jena/hadoop/rdf/io/output/writers/AbstractWholeFileQuadWriter.java>: Recompile with -Xlint:deprecation for details.
[INFO] 2 warnings 
[INFO] -------------------------------------------------------------
[INFO] -------------------------------------------------------------
[ERROR] COMPILATION ERROR : 
[INFO] -------------------------------------------------------------
[ERROR] <https://builds.apache.org/job/Jena_Development_Deploy/ws/jena-elephas/jena-elephas-io/src/main/java/org/apache/jena/hadoop/rdf/io/output/writers/nquads/NQuadsWriter.java>:[24,32] cannot find symbol
  symbol:   class CharSpace
  location: package org.apache.jena.riot.out
[ERROR] <https://builds.apache.org/job/Jena_Development_Deploy/ws/jena-elephas/jena-elephas-io/src/main/java/org/apache/jena/hadoop/rdf/io/output/writers/nquads/NQuadsWriter.java>:[54,40] cannot find symbol
  symbol:   class CharSpace
  location: class org.apache.jena.hadoop.rdf.io.output.writers.nquads.NQuadsWriter<TKey>
[ERROR] <https://builds.apache.org/job/Jena_Development_Deploy/ws/jena-elephas/jena-elephas-io/src/main/java/org/apache/jena/hadoop/rdf/io/output/writers/ntriples/NTriplesWriter.java>:[24,32] cannot find symbol
  symbol:   class CharSpace
  location: package org.apache.jena.riot.out
[ERROR] <https://builds.apache.org/job/Jena_Development_Deploy/ws/jena-elephas/jena-elephas-io/src/main/java/org/apache/jena/hadoop/rdf/io/output/writers/ntriples/NTriplesWriter.java>:[55,42] cannot find symbol
  symbol:   class CharSpace
  location: class org.apache.jena.hadoop.rdf.io.output.writers.ntriples.NTriplesWriter<TKey>
[ERROR] <https://builds.apache.org/job/Jena_Development_Deploy/ws/jena-elephas/jena-elephas-io/src/main/java/org/apache/jena/hadoop/rdf/io/output/writers/ntriples/NTriplesNodeWriter.java>:[24,32] cannot find symbol
  symbol:   class CharSpace
  location: package org.apache.jena.riot.out
[ERROR] <https://builds.apache.org/job/Jena_Development_Deploy/ws/jena-elephas/jena-elephas-io/src/main/java/org/apache/jena/hadoop/rdf/io/output/writers/ntriples/NTriplesNodeWriter.java>:[55,46] cannot find symbol
  symbol:   class CharSpace
  location: class org.apache.jena.hadoop.rdf.io.output.writers.ntriples.NTriplesNodeWriter<TValue>
[INFO] 6 errors 
[INFO] -------------------------------------------------------------
[JENKINS] Archiving disabled
[JENKINS] Archiving disabled
[JENKINS] Archiving disabled
[JENKINS] Archiving disabled
[JENKINS] Archiving disabled
[JENKINS] Archiving disabled
[JENKINS] Archiving disabled
[JENKINS] Archiving disabled
[JENKINS] Archiving disabled
[JENKINS] Archiving disabled
[JENKINS] Archiving disabled
[JENKINS] Archiving disabled
[JENKINS] Archiving disabled
[JENKINS] Archiving disabled
[JENKINS] Archiving disabled
[JENKINS] Archiving disabled
[JENKINS] Archiving disabled
[JENKINS] Archiving disabled
[JENKINS] Archiving disabled
[JENKINS] Archiving disabled
[JENKINS] Archiving disabled
[JENKINS] Archiving disabled
[JENKINS] Archiving disabled
[JENKINS] Archiving disabled
[JENKINS] Archiving disabled
[JENKINS] Archiving disabled
[JENKINS] Archiving disabled
[JENKINS] Archiving disabled
[JENKINS] Archiving disabled
[JENKINS] Archiving disabled
[JENKINS] Archiving disabled
[JENKINS] Archiving disabled
[JENKINS] Archiving disabled
[JENKINS] Archiving disabled
[JENKINS] Archiving disabled
[JENKINS] Archiving disabled
[JENKINS] Archiving disabled
[JENKINS] Archiving disabled[INFO] ------------------------------------------------------------------------
[INFO] Reactor Summary:
[INFO] 
[INFO] Apache Jena - Parent ............................... SUCCESS [  8.717 s]
[INFO] Apache Jena - Shadowed external libraries .......... SUCCESS [  6.915 s]
[INFO] Apache Jena - IRI .................................. SUCCESS [ 10.755 s]
[INFO] Apache Jena - Base Common Environment .............. SUCCESS [ 25.355 s]
[INFO] Apache Jena - Core ................................. SUCCESS [01:05 min]
[INFO] Apache Jena - ARQ (SPARQL 1.1 Query Engine) ........ SUCCESS [01:23 min]
[INFO] Apache Jena - TDB (Native Triple Store) ............ SUCCESS [ 18.152 s]
[INFO] Apache Jena - Libraries POM ........................ SUCCESS [  2.834 s]
[INFO] Apache Jena - SPARQL Text Search ................... SUCCESS [ 21.342 s]
[INFO] Apache Jena - SPARQL Spatial Search ................ SUCCESS [ 12.375 s]
[INFO] Apache Jena - Data Tables for RDF and SPARQL ....... SUCCESS [  9.704 s]
[INFO] Apache Jena - SDB (SQL based triple store) ......... SUCCESS [ 32.100 s]
[INFO] Apache Jena - Fuseki1 .............................. SUCCESS [ 36.905 s]
[INFO] Apache Jena - Fuseki - A SPARQL 1.1 Server ......... SUCCESS [  3.639 s]
[INFO] Apache Jena - Fuseki Server Engine ................. SUCCESS [ 25.418 s]
[INFO] Apache Jena - Fuseki WAR File ...................... SUCCESS [ 11.256 s]
[INFO] Apache Jena - Fuseki Server Standalone Jar ......... SUCCESS [ 14.463 s]
[INFO] Apache Jena - Fuseki Binary Distribution ........... SUCCESS [ 26.800 s]
[INFO] Apache Jena - Security Permissions ................. SUCCESS [ 26.088 s]
[INFO] Apache Jena - JDBC Parent .......................... SUCCESS [  4.089 s]
[INFO] Apache Jena - JDBC Core API ........................ SUCCESS [ 51.588 s]
[INFO] Apache Jena - JDBC Remote Endpoint Driver .......... SUCCESS [ 43.794 s]
[INFO] Apache Jena - JDBC In-Memory Driver ................ SUCCESS [ 23.606 s]
[INFO] Apache Jena - JDBC TDB Driver ...................... SUCCESS [ 49.204 s]
[INFO] Apache Jena - JDBC Driver Bundle ................... SUCCESS [ 26.226 s]
[INFO] Apache Jena - Maven Plugins, including schemagen ... SUCCESS [ 47.261 s]
[INFO] Apache Jena - Elephas .............................. SUCCESS [  1.772 s]
[INFO] Apache Jena - Elephas - Common API ................. SUCCESS [  8.483 s]
[INFO] Apache Jena - Elephas - I/O ........................ FAILURE [  2.361 s]
[INFO] Apache Jena - Elephas - Map/Reduce ................. SKIPPED
[INFO] Apache Jena - Elephas - Statistics Demo App ........ SKIPPED
[INFO] Apache Jena - Distribution ......................... SKIPPED
[INFO] Apache Jena - OSGi ................................. SKIPPED
[INFO] Apache Jena - OSGi bundle .......................... SKIPPED
[INFO] Apache Jena - Extras ............................... SKIPPED
[INFO] Apache Jena - Extras - Query Builder ............... SKIPPED
[INFO] Apache Jena ........................................ SKIPPED
[INFO] ------------------------------------------------------------------------
[INFO] BUILD FAILURE
[INFO] ------------------------------------------------------------------------
[INFO] Total time: 12:14 min
[INFO] Finished at: 2015-12-22T18:01:54+00:00

[INFO] Final Memory: 158M/2167M
[INFO] ------------------------------------------------------------------------
[ERROR] Failed to execute goal org.apache.maven.plugins:maven-compiler-plugin:3.1:compile (default-compile) on project jena-elephas-io: Compilation failure: Compilation failure:
[ERROR] <https://builds.apache.org/job/Jena_Development_Deploy/ws/jena-elephas/jena-elephas-io/src/main/java/org/apache/jena/hadoop/rdf/io/output/writers/nquads/NQuadsWriter.java>:[24,32] cannot find symbol
[ERROR] symbol:   class CharSpace
[ERROR] location: package org.apache.jena.riot.out
[ERROR] <https://builds.apache.org/job/Jena_Development_Deploy/ws/jena-elephas/jena-elephas-io/src/main/java/org/apache/jena/hadoop/rdf/io/output/writers/nquads/NQuadsWriter.java>:[54,40] cannot find symbol
[ERROR] symbol:   class CharSpace
[ERROR] location: class org.apache.jena.hadoop.rdf.io.output.writers.nquads.NQuadsWriter<TKey>
[ERROR] <https://builds.apache.org/job/Jena_Development_Deploy/ws/jena-elephas/jena-elephas-io/src/main/java/org/apache/jena/hadoop/rdf/io/output/writers/ntriples/NTriplesWriter.java>:[24,32] cannot find symbol
[ERROR] symbol:   class CharSpace
[ERROR] location: package org.apache.jena.riot.out
[ERROR] <https://builds.apache.org/job/Jena_Development_Deploy/ws/jena-elephas/jena-elephas-io/src/main/java/org/apache/jena/hadoop/rdf/io/output/writers/ntriples/NTriplesWriter.java>:[55,42] cannot find symbol
[ERROR] symbol:   class CharSpace
[ERROR] location: class org.apache.jena.hadoop.rdf.io.output.writers.ntriples.NTriplesWriter<TKey>
[ERROR] <https://builds.apache.org/job/Jena_Development_Deploy/ws/jena-elephas/jena-elephas-io/src/main/java/org/apache/jena/hadoop/rdf/io/output/writers/ntriples/NTriplesNodeWriter.java>:[24,32] cannot find symbol
[ERROR] symbol:   class CharSpace
[ERROR] location: package org.apache.jena.riot.out
[ERROR] <https://builds.apache.org/job/Jena_Development_Deploy/ws/jena-elephas/jena-elephas-io/src/main/java/org/apache/jena/hadoop/rdf/io/output/writers/ntriples/NTriplesNodeWriter.java>:[55,46] cannot find symbol
[ERROR] symbol:   class CharSpace
[ERROR] location: class org.apache.jena.hadoop.rdf.io.output.writers.ntriples.NTriplesNodeWriter<TValue>
[ERROR] -> [Help 1]
[ERROR] 
[ERROR] To see the full stack trace of the errors, re-run Maven with the -e switch.
[ERROR] Re-run Maven using the -X switch to enable full debug logging.
[ERROR] 
[ERROR] For more information about the errors and possible solutions, please read the following articles:
[ERROR] [Help 1] http://cwiki.apache.org/confluence/display/MAVEN/MojoFailureException
[ERROR] 
[ERROR] After correcting the problems, you can resume the build with the command
[ERROR]   mvn <goals> -rf :jena-elephas-io
channel stopped

Jenkins build is back to normal : Jena_Development_Deploy #1079

Posted by Apache Jenkins Server <je...@builds.apache.org>.
See <https://builds.apache.org/job/Jena_Development_Deploy/1079/changes>