You are viewing a plain text version of this content. The canonical link for it is here.
Posted to dev@pig.apache.org by Apache Jenkins Server <je...@builds.apache.org> on 2011/08/16 00:07:06 UTC

Build failed in Jenkins: Pig-trunk #1063

See <https://builds.apache.org/job/Pig-trunk/1063/changes>

Changes:

[gkesavan] Fix the jenkins tools path

------------------------------------------
[...truncated 2217 lines...]
A         contrib/piggybank/java/src/main/java/org/apache/pig/piggybank/evaluation/util
A         contrib/piggybank/java/src/main/java/org/apache/pig/piggybank/evaluation/util/apachelogparser
A         contrib/piggybank/java/src/main/java/org/apache/pig/piggybank/evaluation/util/apachelogparser/SearchEngineExtractor.java
A         contrib/piggybank/java/src/main/java/org/apache/pig/piggybank/evaluation/util/apachelogparser/DateExtractor.java
A         contrib/piggybank/java/src/main/java/org/apache/pig/piggybank/evaluation/util/apachelogparser/HostExtractor.java
A         contrib/piggybank/java/src/main/java/org/apache/pig/piggybank/evaluation/util/apachelogparser/SearchTermExtractor.java
A         contrib/piggybank/java/src/main/java/org/apache/pig/piggybank/evaluation/util/Top.java
A         contrib/piggybank/java/src/main/java/org/apache/pig/piggybank/evaluation/util/SearchQuery.java
A         contrib/piggybank/java/src/main/java/org/apache/pig/piggybank/evaluation/util/ToBag.java
A         contrib/piggybank/java/src/main/java/org/apache/pig/piggybank/evaluation/util/ToTuple.java
A         contrib/piggybank/java/src/main/java/org/apache/pig/piggybank/evaluation/stats
A         contrib/piggybank/java/src/main/java/org/apache/pig/piggybank/evaluation/stats/COR.java
A         contrib/piggybank/java/src/main/java/org/apache/pig/piggybank/evaluation/stats/COV.java
A         contrib/piggybank/java/src/main/java/org/apache/pig/piggybank/comparison
A         contrib/piggybank/java/src/main/java/org/apache/pig/piggybank/grouping
AU        contrib/piggybank/java/build.xml
A         autocomplete
A         tutorial
A         tutorial/scripts
AU        tutorial/scripts/script1-hadoop.pig
AU        tutorial/scripts/script1-local.pig
AU        tutorial/scripts/script2-hadoop.pig
AU        tutorial/scripts/script2-local.pig
A         tutorial/src
A         tutorial/src/org
A         tutorial/src/org/apache
A         tutorial/src/org/apache/pig
A         tutorial/src/org/apache/pig/tutorial
A         tutorial/src/org/apache/pig/tutorial/TutorialUtil.java
A         tutorial/src/org/apache/pig/tutorial/ScoreGenerator.java
A         tutorial/src/org/apache/pig/tutorial/TutorialTest.java
A         tutorial/src/org/apache/pig/tutorial/NonURLDetector.java
A         tutorial/src/org/apache/pig/tutorial/ExtractHour.java
A         tutorial/src/org/apache/pig/tutorial/NGramGenerator.java
A         tutorial/src/org/apache/pig/tutorial/ToLower.java
A         tutorial/data
AU        tutorial/data/excite-small.log
AU        tutorial/data/excite.log.bz2
AU        tutorial/build.xml
A         .gitignore
A         ivy.xml
A         RELEASE_NOTES.txt
A         lib
A         lib/automaton.jar
A         lib/jdiff
A         lib/jdiff/pig_0.9.0.xml
A         ivy
A         ivy/pigsmoke-template.xml
A         ivy/ivysettings.xml
A         ivy/libraries.properties
A         ivy/pig-template.xml
A         ivy/pigunit-template.xml
A         ivy/pig.pom
A         bin
AU        bin/pig
A         README.txt
A         KEYS
 U        .
At revision 1158029
Checking out http://svn.apache.org/repos/asf/hadoop/nightly
AU        tar-munge
A         commitBuild.sh
A         hudsonEnv.sh
A         jenkinsSetup
A         jenkinsSetup/installTools.sh
AU        hudsonBuildHadoopNightly.sh
A         buildMR-279Branch.sh
AU        hudsonBuildHadoopPatch.sh
AU        hudsonBuildHadoopRelease.sh
AU        processHadoopPatchEmailRemote.sh
AU        hudsonPatchQueueAdmin.sh
AU        processHadoopPatchEmail.sh
A         README.txt
A         test-patch
A         test-patch/test-patch.sh
At revision 1158029
no change for http://svn.apache.org/repos/asf/pig/trunk since the previous build
[Pig-trunk] $ /bin/bash /tmp/hudson7882071311165352374.sh
1024


======================================================================
======================================================================
CLEAN: cleaning workspace
======================================================================
======================================================================


Buildfile: build.xml
  [taskdef] Could not load definitions from resource net/sf/antcontrib/antcontrib.properties. It could not be found.

clean:

BUILD SUCCESSFUL
Total time: 0 seconds


======================================================================
======================================================================
BUILD: ant docs tar findbugs -Dtest.junit.output.format=xml -Dtest.output=yes -Dversion=${BUILD_ID} -Dfindbugs.home=$FINDBUGS_HOME -Djava5.home=$JAVA5_HOME -Dforrest.home=$FORREST_HOME -Dclover.home=$CLOVER_HOME -Declipse.home=$ECLIPSE_HOME
======================================================================
======================================================================


Buildfile: build.xml
  [taskdef] Could not load definitions from resource net/sf/antcontrib/antcontrib.properties. It could not be found.

forrest.check:

ivy-download:
      [get] Getting: http://repo2.maven.org/maven2/org/apache/ivy/ivy/2.2.0/ivy-2.2.0.jar
      [get] To: <https://builds.apache.org/job/Pig-trunk/ws/trunk/ivy/ivy-2.2.0.jar>

ivy-init-dirs:
    [mkdir] Created dir: <https://builds.apache.org/job/Pig-trunk/ws/trunk/build/ivy>
    [mkdir] Created dir: <https://builds.apache.org/job/Pig-trunk/ws/trunk/build/ivy/lib>
    [mkdir] Created dir: <https://builds.apache.org/job/Pig-trunk/ws/trunk/build/ivy/report>
    [mkdir] Created dir: <https://builds.apache.org/job/Pig-trunk/ws/trunk/build/ivy/maven>

ivy-probe-antlib:

ivy-init-antlib:

ivy-init:
[ivy:configure] :: Ivy 2.2.0 - 20100923230623 :: http://ant.apache.org/ivy/ ::
[ivy:configure] :: loading settings :: file = <https://builds.apache.org/job/Pig-trunk/ws/trunk/ivy/ivysettings.xml>

ivy-compile:
[ivy:resolve] :: resolving dependencies :: org.apache.pig#Pig;2011-08-15_22-06-36
[ivy:resolve] 	confs: [compile]
[ivy:resolve] 	found commons-el#commons-el;1.0 in maven2
[ivy:resolve] 	found log4j#log4j;1.2.14 in maven2
[ivy:resolve] 	found org.apache.hadoop#hadoop-core;0.20.2 in maven2
[ivy:resolve] 	found commons-cli#commons-cli;1.2 in maven2
[ivy:resolve] 	found xmlenc#xmlenc;0.52 in maven2
[ivy:resolve] 	found commons-httpclient#commons-httpclient;3.0.1 in maven2
[ivy:resolve] 	found commons-codec#commons-codec;1.3 in maven2
[ivy:resolve] 	found commons-net#commons-net;1.4.1 in maven2
[ivy:resolve] 	found oro#oro;2.0.8 in maven2
[ivy:resolve] 	found org.mortbay.jetty#jetty;6.1.14 in maven2
[ivy:resolve] 	found org.mortbay.jetty#jetty-util;6.1.14 in maven2
[ivy:resolve] 	found org.mortbay.jetty#servlet-api-2.5;6.1.14 in maven2
[ivy:resolve] 	found tomcat#jasper-runtime;5.5.12 in maven2
[ivy:resolve] 	found tomcat#jasper-compiler;5.5.12 in maven2
[ivy:resolve] 	found org.mortbay.jetty#jsp-api-2.1;6.1.14 in maven2
[ivy:resolve] 	found org.mortbay.jetty#jsp-2.1;6.1.14 in maven2
[ivy:resolve] 	found org.eclipse.jdt#core;3.1.1 in maven2
[ivy:resolve] 	found ant#ant;1.6.5 in maven2
[ivy:resolve] 	found net.java.dev.jets3t#jets3t;0.7.1 in maven2
[ivy:resolve] 	found commons-logging#commons-logging;1.1.1 in maven2
[ivy:resolve] 	found net.sf.kosmosfs#kfs;0.3 in maven2
[ivy:resolve] 	found junit#junit;4.5 in maven2
[ivy:resolve] 	found hsqldb#hsqldb;1.8.0.10 in maven2
[ivy:resolve] 	found org.apache.hadoop#hadoop-test;0.20.2 in maven2
[ivy:resolve] 	found org.apache.ftpserver#ftplet-api;1.0.0 in maven2
[ivy:resolve] 	found org.apache.mina#mina-core;2.0.0-M5 in maven2
[ivy:resolve] 	found org.slf4j#slf4j-api;1.5.2 in maven2
[ivy:resolve] 	found org.apache.ftpserver#ftpserver-core;1.0.0 in maven2
[ivy:resolve] 	found org.apache.ftpserver#ftpserver-deprecated;1.0.0-M2 in maven2
[ivy:resolve] 	found org.slf4j#slf4j-log4j12;1.4.3 in maven2
[ivy:resolve] 	found org.apache.avro#avro;1.4.1 in maven2
[ivy:resolve] 	found com.googlecode.json-simple#json-simple;1.1 in maven2
[ivy:resolve] 	found com.jcraft#jsch;0.1.38 in maven2
[ivy:resolve] 	found jline#jline;0.9.94 in maven2
[ivy:resolve] 	found net.java.dev.javacc#javacc;4.2 in maven2
[ivy:resolve] 	found org.codehaus.jackson#jackson-mapper-asl;1.6.0 in maven2
[ivy:resolve] 	found org.codehaus.jackson#jackson-core-asl;1.6.0 in maven2
[ivy:resolve] 	found joda-time#joda-time;1.6 in maven2
[ivy:resolve] 	found commons-lang#commons-lang;2.4 in maven2
[ivy:resolve] 	found com.google.guava#guava;r06 in maven2
[ivy:resolve] 	found org.python#jython;2.5.0 in maven2
[ivy:resolve] 	found rhino#js;1.7R2 in maven2
[ivy:resolve] 	found org.antlr#antlr;3.2 in maven2
[ivy:resolve] 	found org.antlr#antlr-runtime;3.2 in maven2
[ivy:resolve] 	found org.antlr#stringtemplate;3.2 in maven2
[ivy:resolve] 	found antlr#antlr;2.7.7 in maven2
[ivy:resolve] 	found org.apache.zookeeper#zookeeper;3.3.3 in maven2
[ivy:resolve] 	found org.jboss.netty#netty;3.2.2.Final in maven2
[ivy:resolve] 	found org.apache.hbase#hbase;0.90.0 in maven2
[ivy:resolve] 	found org.vafer#jdeb;0.8 in maven2
[ivy:resolve] downloading http://repo2.maven.org/maven2/org/apache/hadoop/hadoop-core/0.20.2/hadoop-core-0.20.2.jar ...
[ivy:resolve] .......................................................................................................................................................................................................................................................................................................................................................................................................................................................................................................................................................................................................................................................................................................................................................................................................................................................................................................................................................................................................................................................................................................................................................................................................................................................................................................................................................................................................................................................................................................................................................................................................................................................................................................................................................................................................................................................................................................................................................................................................................................................................................................................................................................................................................................................................................................................................................................................................................................................................................................................................................................................................................................................................................................................................................................................................................................................................................................................................................................................................................................................................................................................................................................................................................................................................................................................................................................................................................................................................................................................................................................................................................................................................................................................................................................................................................................................................................................................................................................................................................................................................................................................................................................................................................................................................................................................................................................................................................................................................................................................................................................................................................................................................................................................................................................................................................................................................................................................................................................................................................................................................................................................................................................................... (2624kB)
[ivy:resolve] .. (0kB)
[ivy:resolve] 	[SUCCESSFUL ] org.apache.hadoop#hadoop-core;0.20.2!hadoop-core.jar (1623ms)
[ivy:resolve] downloading http://repo2.maven.org/maven2/org/apache/hadoop/hadoop-test/0.20.2/hadoop-test-0.20.2.jar ...
[ivy:resolve] ................................................................................................................................................................................................................................................................................................................................................................................................................................................................................................................................................................................................................................................................................................................................................................................................................................................................................................................................................................................................................................................................................................................................................................................................................................................................................................................................................................................................................................................................................................................................................................................................................................................................................................................................................................................................................................................................................................................................................................................................................................................................................................................................................................................................................................................................................................................................................................................................................................................................................................................................................................................................................................................................................................................................................................................................................................................................................................................................................................................................................................. (1527kB)
[ivy:resolve] ... (0kB)
[ivy:resolve] :: resolution report :: resolve 8983ms :: artifacts dl 4583ms
[ivy:resolve] 	:: evicted modules:
[ivy:resolve] 	junit#junit;3.8.1 by [junit#junit;4.5] in [compile]
[ivy:resolve] 	commons-logging#commons-logging;1.0.3 by [commons-logging#commons-logging;1.1.1] in [compile]
[ivy:resolve] 	commons-codec#commons-codec;1.2 by [commons-codec#commons-codec;1.3] in [compile]
[ivy:resolve] 	commons-httpclient#commons-httpclient;3.1 by [commons-httpclient#commons-httpclient;3.0.1] in [compile]
[ivy:resolve] 	org.apache.mina#mina-core;2.0.0-M4 by [org.apache.mina#mina-core;2.0.0-M5] in [compile]
[ivy:resolve] 	org.apache.ftpserver#ftplet-api;1.0.0-M2 by [org.apache.ftpserver#ftplet-api;1.0.0] in [compile]
[ivy:resolve] 	org.apache.ftpserver#ftpserver-core;1.0.0-M2 by [org.apache.ftpserver#ftpserver-core;1.0.0] in [compile]
[ivy:resolve] 	org.apache.mina#mina-core;2.0.0-M2 by [org.apache.mina#mina-core;2.0.0-M5] in [compile]
	---------------------------------------------------------------------
	|                  |            modules            ||   artifacts   |
	|       conf       | number| search|dwnlded|evicted|| number|dwnlded|
	---------------------------------------------------------------------
	|      compile     |   58  |   2   |   2   |   8   ||   51  |   1   |
	---------------------------------------------------------------------
[ivy:resolve] 
[ivy:resolve] :: problems summary ::
[ivy:resolve] :::: WARNINGS
[ivy:resolve] 		[FAILED     ] org.apache.hadoop#hadoop-test;0.20.2!hadoop-test.jar: invalid sha1: expected=0547f30bb192ac86ec30b024cc1c44f5ca7c5029 computed=1ee3aad5f74941f3abaeadb3ec90f6d58ea9a9b6 (2223ms)
[ivy:resolve] 		[FAILED     ] org.apache.hadoop#hadoop-test;0.20.2!hadoop-test.jar:  (0ms)
[ivy:resolve] 	==== local: tried
[ivy:resolve] 	  /home/jenkins/.ivy2/local/org.apache.hadoop/hadoop-test/0.20.2/jars/hadoop-test.jar
[ivy:resolve] 	==== maven2: tried
[ivy:resolve] 	  http://repo2.maven.org/maven2/org/apache/hadoop/hadoop-test/0.20.2/hadoop-test-0.20.2.jar
[ivy:resolve] 	==== jboss-maven2: tried
[ivy:resolve] 	  http://repository.jboss.com/nexus/content/groups/public/org/apache/hadoop/hadoop-test/0.20.2/hadoop-test-0.20.2.jar
[ivy:resolve] 		::::::::::::::::::::::::::::::::::::::::::::::
[ivy:resolve] 		::              FAILED DOWNLOADS            ::
[ivy:resolve] 		:: ^ see resolution messages for details  ^ ::
[ivy:resolve] 		::::::::::::::::::::::::::::::::::::::::::::::
[ivy:resolve] 		:: org.apache.hadoop#hadoop-test;0.20.2!hadoop-test.jar
[ivy:resolve] 		::::::::::::::::::::::::::::::::::::::::::::::
[ivy:resolve] 
[ivy:resolve] :: USE VERBOSE OR DEBUG MESSAGE LEVEL FOR MORE DETAILS

BUILD FAILED
<https://builds.apache.org/job/Pig-trunk/ws/trunk/build.xml>:1398: impossible to resolve dependencies:
	resolve failed - see output for details

Total time: 15 seconds


======================================================================
======================================================================
STORE: saving artifacts
======================================================================
======================================================================


mv: cannot stat `build/*.tar.gz': No such file or directory
mv: cannot stat `build/*.jar': No such file or directory
mv: cannot stat `build/test/findbugs': No such file or directory
mv: cannot stat `build/docs/api': No such file or directory
Build Failed
[FINDBUGS] Skipping publisher since build result is FAILURE
Recording test results
Publishing Javadoc
Archiving artifacts
Recording fingerprints
Publishing Clover coverage report...
No Clover report will be published due to a Build Failure


Jenkins build is back to normal : Pig-trunk #1065

Posted by Apache Jenkins Server <je...@builds.apache.org>.
See <https://builds.apache.org/job/Pig-trunk/1065/changes>



Build failed in Jenkins: Pig-trunk #1064

Posted by Apache Jenkins Server <je...@builds.apache.org>.
See <https://builds.apache.org/job/Pig-trunk/1064/changes>

Changes:

[gates] PIG 2202 AvroStorage doesn't work with Avro 1.5.1

[gates] PIG-2195 AvroStorage fails to STORE when LOADing via PigStorage

------------------------------------------
[...truncated 34410 lines...]
    [junit] 	at org.apache.hadoop.ipc.Server$Handler.run(Server.java:953)
    [junit] 11/08/16 10:27:58 ERROR hdfs.DFSClient: Exception closing file /tmp/TestStore-output-1409999045866600108.txt_cleanupOnFailure_succeeded2 : org.apache.hadoop.ipc.RemoteException: java.io.IOException: Could not complete write to file /tmp/TestStore-output-1409999045866600108.txt_cleanupOnFailure_succeeded2 by DFSClient_-1459031065
    [junit] 	at org.apache.hadoop.hdfs.server.namenode.NameNode.complete(NameNode.java:449)
    [junit] 	at sun.reflect.GeneratedMethodAccessor18.invoke(Unknown Source)
    [junit] 	at sun.reflect.DelegatingMethodAccessorImpl.invoke(DelegatingMethodAccessorImpl.java:25)
    [junit] 	at java.lang.reflect.Method.invoke(Method.java:597)
    [junit] 	at org.apache.hadoop.ipc.RPC$Server.call(RPC.java:508)
    [junit] 	at org.apache.hadoop.ipc.Server$Handler$1.run(Server.java:959)
    [junit] 	at org.apache.hadoop.ipc.Server$Handler$1.run(Server.java:955)
    [junit] 	at java.security.AccessController.doPrivileged(Native Method)
    [junit] 	at javax.security.auth.Subject.doAs(Subject.java:396)
    [junit] 	at org.apache.hadoop.ipc.Server$Handler.run(Server.java:953)
    [junit] 
    [junit] org.apache.hadoop.ipc.RemoteException: java.io.IOException: Could not complete write to file /tmp/TestStore-output-1409999045866600108.txt_cleanupOnFailure_succeeded2 by DFSClient_-1459031065
    [junit] 	at org.apache.hadoop.hdfs.server.namenode.NameNode.complete(NameNode.java:449)
    [junit] 	at sun.reflect.GeneratedMethodAccessor18.invoke(Unknown Source)
    [junit] 	at sun.reflect.DelegatingMethodAccessorImpl.invoke(DelegatingMethodAccessorImpl.java:25)
    [junit] 	at java.lang.reflect.Method.invoke(Method.java:597)
    [junit] 	at org.apache.hadoop.ipc.RPC$Server.call(RPC.java:508)
    [junit] 	at org.apache.hadoop.ipc.Server$Handler$1.run(Server.java:959)
    [junit] 	at org.apache.hadoop.ipc.Server$Handler$1.run(Server.java:955)
    [junit] 	at java.security.AccessController.doPrivileged(Native Method)
    [junit] 	at javax.security.auth.Subject.doAs(Subject.java:396)
    [junit] 	at org.apache.hadoop.ipc.Server$Handler.run(Server.java:953)
    [junit] 
    [junit] 	at org.apache.hadoop.ipc.Client.call(Client.java:740)
    [junit] 	at org.apache.hadoop.ipc.RPC$Invoker.invoke(RPC.java:220)
    [junit] 	at $Proxy0.complete(Unknown Source)
    [junit] 	at sun.reflect.GeneratedMethodAccessor18.invoke(Unknown Source)
    [junit] 	at sun.reflect.DelegatingMethodAccessorImpl.invoke(DelegatingMethodAccessorImpl.java:25)
    [junit] 	at java.lang.reflect.Method.invoke(Method.java:597)
    [junit] 	at org.apache.hadoop.io.retry.RetryInvocationHandler.invokeMethod(RetryInvocationHandler.java:82)
    [junit] 	at org.apache.hadoop.io.retry.RetryInvocationHandler.invoke(RetryInvocationHandler.java:59)
    [junit] 	at $Proxy0.complete(Unknown Source)
    [junit] 	at org.apache.hadoop.hdfs.DFSClient$DFSOutputStream.closeInternal(DFSClient.java:3264)
    [junit] 	at org.apache.hadoop.hdfs.DFSClient$DFSOutputStream.close(DFSClient.java:3188)
    [junit] 	at org.apache.hadoop.hdfs.DFSClient$LeaseChecker.close(DFSClient.java:1043)
    [junit] 	at org.apache.hadoop.hdfs.DFSClient.close(DFSClient.java:237)
    [junit] 	at org.apache.hadoop.hdfs.DistributedFileSystem.close(DistributedFileSystem.java:269)
    [junit] 	at org.apache.pig.test.MiniGenericCluster.shutdownMiniDfsClusters(MiniGenericCluster.java:83)
    [junit] 	at org.apache.pig.test.MiniGenericCluster.shutdownMiniDfsAndMrClusters(MiniGenericCluster.java:77)
    [junit] 	at org.apache.pig.test.MiniGenericCluster.shutDown(MiniGenericCluster.java:68)
    [junit] 	at org.apache.pig.test.TestStore.oneTimeTearDown(TestStore.java:127)
    [junit] 	at sun.reflect.NativeMethodAccessorImpl.invoke0(Native Method)
    [junit] 	at sun.reflect.NativeMethodAccessorImpl.invoke(NativeMethodAccessorImpl.java:39)
    [junit] 	at sun.reflect.DelegatingMethodAccessorImpl.invoke(DelegatingMethodAccessorImpl.java:25)
    [junit] 	at java.lang.reflect.Method.invoke(Method.java:597)
    [junit] 	at org.junit.runners.model.FrameworkMethod$1.runReflectiveCall(FrameworkMethod.java:44)
    [junit] 	at org.junit.internal.runners.model.ReflectiveCallable.run(ReflectiveCallable.java:15)
    [junit] 	at org.junit.runners.model.FrameworkMethod.invokeExplosively(FrameworkMethod.java:41)
    [junit] 	at org.junit.internal.runners.statements.RunAfters.evaluate(RunAfters.java:37)
    [junit] 	at org.junit.runners.ParentRunner.run(ParentRunner.java:220)
    [junit] 	at junit.framework.JUnit4TestAdapter.run(JUnit4TestAdapter.java:39)
    [junit] 	at org.apache.tools.ant.taskdefs.optional.junit.JUnitTestRunner.run(JUnitTestRunner.java:420)
    [junit] 	at org.apache.tools.ant.taskdefs.optional.junit.JUnitTestRunner.launch(JUnitTestRunner.java:911)
    [junit] 	at org.apache.tools.ant.taskdefs.optional.junit.JUnitTestRunner.main(JUnitTestRunner.java:768)
    [junit] 11/08/16 10:27:58 WARN hdfs.StateChange: DIR* NameSystem.completeFile: failed to complete /tmp/TestStore-output-6171916119939214908.txt_cleanupOnFailure_succeeded because dir.getFileBlocks() is null  and pendingFile is null
    [junit] 11/08/16 10:27:58 INFO ipc.Server: IPC Server handler 1 on 56467, call complete(/tmp/TestStore-output-6171916119939214908.txt_cleanupOnFailure_succeeded, DFSClient_-1459031065) from 127.0.0.1:35168: error: java.io.IOException: Could not complete write to file /tmp/TestStore-output-6171916119939214908.txt_cleanupOnFailure_succeeded by DFSClient_-1459031065
    [junit] java.io.IOException: Could not complete write to file /tmp/TestStore-output-6171916119939214908.txt_cleanupOnFailure_succeeded by DFSClient_-1459031065
    [junit] 	at org.apache.hadoop.hdfs.server.namenode.NameNode.complete(NameNode.java:449)
    [junit] 	at sun.reflect.GeneratedMethodAccessor18.invoke(Unknown Source)
    [junit] 	at sun.reflect.DelegatingMethodAccessorImpl.invoke(DelegatingMethodAccessorImpl.java:25)
    [junit] 	at java.lang.reflect.Method.invoke(Method.java:597)
    [junit] 	at org.apache.hadoop.ipc.RPC$Server.call(RPC.java:508)
    [junit] 	at org.apache.hadoop.ipc.Server$Handler$1.run(Server.java:959)
    [junit] 	at org.apache.hadoop.ipc.Server$Handler$1.run(Server.java:955)
    [junit] 	at java.security.AccessController.doPrivileged(Native Method)
    [junit] 	at javax.security.auth.Subject.doAs(Subject.java:396)
    [junit] 	at org.apache.hadoop.ipc.Server$Handler.run(Server.java:953)
    [junit] 11/08/16 10:27:58 ERROR hdfs.DFSClient: Exception closing file /tmp/TestStore-output-6171916119939214908.txt_cleanupOnFailure_succeeded : org.apache.hadoop.ipc.RemoteException: java.io.IOException: Could not complete write to file /tmp/TestStore-output-6171916119939214908.txt_cleanupOnFailure_succeeded by DFSClient_-1459031065
    [junit] 	at org.apache.hadoop.hdfs.server.namenode.NameNode.complete(NameNode.java:449)
    [junit] 	at sun.reflect.GeneratedMethodAccessor18.invoke(Unknown Source)
    [junit] 	at sun.reflect.DelegatingMethodAccessorImpl.invoke(DelegatingMethodAccessorImpl.java:25)
    [junit] 	at java.lang.reflect.Method.invoke(Method.java:597)
    [junit] 	at org.apache.hadoop.ipc.RPC$Server.call(RPC.java:508)
    [junit] 	at org.apache.hadoop.ipc.Server$Handler$1.run(Server.java:959)
    [junit] 	at org.apache.hadoop.ipc.Server$Handler$1.run(Server.java:955)
    [junit] 	at java.security.AccessController.doPrivileged(Native Method)
    [junit] 	at javax.security.auth.Subject.doAs(Subject.java:396)
    [junit] 	at org.apache.hadoop.ipc.Server$Handler.run(Server.java:953)
    [junit] 
    [junit] org.apache.hadoop.ipc.RemoteException: java.io.IOException: Could not complete write to file /tmp/TestStore-output-6171916119939214908.txt_cleanupOnFailure_succeeded by DFSClient_-1459031065
    [junit] 	at org.apache.hadoop.hdfs.server.namenode.NameNode.complete(NameNode.java:449)
    [junit] 	at sun.reflect.GeneratedMethodAccessor18.invoke(Unknown Source)
    [junit] 	at sun.reflect.DelegatingMethodAccessorImpl.invoke(DelegatingMethodAccessorImpl.java:25)
    [junit] 	at java.lang.reflect.Method.invoke(Method.java:597)
    [junit] 	at org.apache.hadoop.ipc.RPC$Server.call(RPC.java:508)
    [junit] 	at org.apache.hadoop.ipc.Server$Handler$1.run(Server.java:959)
    [junit] 	at org.apache.hadoop.ipc.Server$Handler$1.run(Server.java:955)
    [junit] 	at java.security.AccessController.doPrivileged(Native Method)
    [junit] 	at javax.security.auth.Subject.doAs(Subject.java:396)
    [junit] 	at org.apache.hadoop.ipc.Server$Handler.run(Server.java:953)
    [junit] 
    [junit] 	at org.apache.hadoop.ipc.Client.call(Client.java:740)
    [junit] Shutting down the Mini HDFS Cluster
    [junit] Shutting down DataNode 3
    [junit] 	at org.apache.hadoop.ipc.RPC$Invoker.invoke(RPC.java:220)
    [junit] 	at $Proxy0.complete(Unknown Source)
    [junit] 	at sun.reflect.GeneratedMethodAccessor18.invoke(Unknown Source)
    [junit] 	at sun.reflect.DelegatingMethodAccessorImpl.invoke(DelegatingMethodAccessorImpl.java:25)
    [junit] 	at java.lang.reflect.Method.invoke(Method.java:597)
    [junit] 	at org.apache.hadoop.io.retry.RetryInvocationHandler.invokeMethod(RetryInvocationHandler.java:82)
    [junit] 	at org.apache.hadoop.io.retry.RetryInvocationHandler.invoke(RetryInvocationHandler.java:59)
    [junit] 	at $Proxy0.complete(Unknown Source)
    [junit] 	at org.apache.hadoop.hdfs.DFSClient$DFSOutputStream.closeInternal(DFSClient.java:3264)
    [junit] 	at org.apache.hadoop.hdfs.DFSClient$DFSOutputStream.close(DFSClient.java:3188)
    [junit] 	at org.apache.hadoop.hdfs.DFSClient$LeaseChecker.close(DFSClient.java:1043)
    [junit] 	at org.apache.hadoop.hdfs.DFSClient.close(DFSClient.java:237)
    [junit] 	at org.apache.hadoop.hdfs.DistributedFileSystem.close(DistributedFileSystem.java:269)
    [junit] 	at org.apache.pig.test.MiniGenericCluster.shutdownMiniDfsClusters(MiniGenericCluster.java:83)
    [junit] 	at org.apache.pig.test.MiniGenericCluster.shutdownMiniDfsAndMrClusters(MiniGenericCluster.java:77)
    [junit] 	at org.apache.pig.test.MiniGenericCluster.shutDown(MiniGenericCluster.java:68)
    [junit] 	at org.apache.pig.test.TestStore.oneTimeTearDown(TestStore.java:127)
    [junit] 	at sun.reflect.NativeMethodAccessorImpl.invoke0(Native Method)
    [junit] 	at sun.reflect.NativeMethodAccessorImpl.invoke(NativeMethodAccessorImpl.java:39)
    [junit] 	at sun.reflect.DelegatingMethodAccessorImpl.invoke(DelegatingMethodAccessorImpl.java:25)
    [junit] 	at java.lang.reflect.Method.invoke(Method.java:597)
    [junit] 	at org.junit.runners.model.FrameworkMethod$1.runReflectiveCall(FrameworkMethod.java:44)
    [junit] 	at org.junit.internal.runners.model.ReflectiveCallable.run(ReflectiveCallable.java:15)
    [junit] 	at org.junit.runners.model.FrameworkMethod.invokeExplosively(FrameworkMethod.java:41)
    [junit] 	at org.junit.internal.runners.statements.RunAfters.evaluate(RunAfters.java:37)
    [junit] 	at org.junit.runners.ParentRunner.run(ParentRunner.java:220)
    [junit] 	at junit.framework.JUnit4TestAdapter.run(JUnit4TestAdapter.java:39)
    [junit] 	at org.apache.tools.ant.taskdefs.optional.junit.JUnitTestRunner.run(JUnitTestRunner.java:420)
    [junit] 	at org.apache.tools.ant.taskdefs.optional.junit.JUnitTestRunner.launch(JUnitTestRunner.java:911)
    [junit] 	at org.apache.tools.ant.taskdefs.optional.junit.JUnitTestRunner.main(JUnitTestRunner.java:768)
    [junit] 11/08/16 10:27:58 INFO ipc.Server: Stopping server on 55204
    [junit] 11/08/16 10:27:58 INFO ipc.Server: IPC Server handler 0 on 55204: exiting
    [junit] 11/08/16 10:27:58 INFO ipc.Server: IPC Server handler 1 on 55204: exiting
    [junit] 11/08/16 10:27:58 INFO ipc.Server: Stopping IPC Server Responder
    [junit] 11/08/16 10:27:58 INFO ipc.Server: Stopping IPC Server listener on 55204
    [junit] 11/08/16 10:27:58 INFO ipc.Server: IPC Server handler 2 on 55204: exiting
    [junit] 11/08/16 10:27:58 INFO datanode.DataNode: Waiting for threadgroup to exit, active threads is 1
    [junit] 11/08/16 10:27:58 WARN datanode.DataNode: DatanodeRegistration(127.0.0.1:55764, storageID=DS-1022535491-67.195.138.20-55764-1313490114615, infoPort=54612, ipcPort=55204):DataXceiveServer: java.nio.channels.AsynchronousCloseException
    [junit] 	at java.nio.channels.spi.AbstractInterruptibleChannel.end(AbstractInterruptibleChannel.java:185)
    [junit] 	at sun.nio.ch.ServerSocketChannelImpl.accept(ServerSocketChannelImpl.java:159)
    [junit] 	at sun.nio.ch.ServerSocketAdaptor.accept(ServerSocketAdaptor.java:84)
    [junit] 	at org.apache.hadoop.hdfs.server.datanode.DataXceiverServer.run(DataXceiverServer.java:130)
    [junit] 	at java.lang.Thread.run(Thread.java:662)
    [junit] 
    [junit] 11/08/16 10:27:58 INFO datanode.DataBlockScanner: Exiting DataBlockScanner thread.
    [junit] 11/08/16 10:27:58 INFO hdfs.StateChange: BLOCK* ask 127.0.0.1:55764 to delete  blk_-6190182308265560105_1124 blk_3864566442333302877_1121 blk_-6723324578939432735_1123 blk_8736452677902245293_1122
    [junit] 11/08/16 10:27:58 INFO hdfs.StateChange: BLOCK* ask 127.0.0.1:55115 to delete  blk_-6190182308265560105_1124 blk_3864566442333302877_1121 blk_4813792788401998404_1126 blk_-6723324578939432735_1123 blk_7382334549492735563_1127
    [junit] 11/08/16 10:27:59 INFO datanode.DataNode: Waiting for threadgroup to exit, active threads is 0
    [junit] 11/08/16 10:27:59 INFO datanode.DataNode: DatanodeRegistration(127.0.0.1:55764, storageID=DS-1022535491-67.195.138.20-55764-1313490114615, infoPort=54612, ipcPort=55204):Finishing DataNode in: FSDataset{dirpath='<https://builds.apache.org/job/Pig-trunk/ws/trunk/build/test/data/dfs/data/data7/current,/home/jenkins/jenkins-slave/workspace/Pig-trunk/trunk/build/test/data/dfs/data/data8/current'}>
    [junit] 11/08/16 10:27:59 INFO ipc.Server: Stopping server on 55204
    [junit] 11/08/16 10:27:59 INFO datanode.DataNode: Waiting for threadgroup to exit, active threads is 0
    [junit] Shutting down DataNode 2
    [junit] 11/08/16 10:27:59 INFO ipc.Server: Stopping server on 53328
    [junit] 11/08/16 10:27:59 INFO ipc.Server: IPC Server handler 0 on 53328: exiting
    [junit] 11/08/16 10:27:59 INFO ipc.Server: IPC Server handler 2 on 53328: exiting
    [junit] 11/08/16 10:27:59 INFO ipc.Server: Stopping IPC Server Responder
    [junit] 11/08/16 10:27:59 INFO ipc.Server: IPC Server handler 1 on 53328: exiting
    [junit] 11/08/16 10:27:59 WARN datanode.DataNode: DatanodeRegistration(127.0.0.1:55115, storageID=DS-1665742722-67.195.138.20-55115-1313490114346, infoPort=58723, ipcPort=53328):DataXceiveServer: java.nio.channels.AsynchronousCloseException
    [junit] 	at java.nio.channels.spi.AbstractInterruptibleChannel.end(AbstractInterruptibleChannel.java:185)
    [junit] 	at sun.nio.ch.ServerSocketChannelImpl.accept(ServerSocketChannelImpl.java:159)
    [junit] 	at sun.nio.ch.ServerSocketAdaptor.accept(ServerSocketAdaptor.java:84)
    [junit] 	at org.apache.hadoop.hdfs.server.datanode.DataXceiverServer.run(DataXceiverServer.java:130)
    [junit] 	at java.lang.Thread.run(Thread.java:662)
    [junit] 
    [junit] 11/08/16 10:27:59 INFO ipc.Server: Stopping IPC Server listener on 53328
    [junit] 11/08/16 10:27:59 INFO datanode.DataNode: Waiting for threadgroup to exit, active threads is 0
    [junit] 11/08/16 10:27:59 INFO datanode.DataBlockScanner: Exiting DataBlockScanner thread.
    [junit] 11/08/16 10:27:59 INFO datanode.DataNode: DatanodeRegistration(127.0.0.1:55115, storageID=DS-1665742722-67.195.138.20-55115-1313490114346, infoPort=58723, ipcPort=53328):Finishing DataNode in: FSDataset{dirpath='<https://builds.apache.org/job/Pig-trunk/ws/trunk/build/test/data/dfs/data/data5/current,/home/jenkins/jenkins-slave/workspace/Pig-trunk/trunk/build/test/data/dfs/data/data6/current'}>
    [junit] 11/08/16 10:27:59 INFO ipc.Server: Stopping server on 53328
    [junit] 11/08/16 10:27:59 INFO datanode.DataNode: Waiting for threadgroup to exit, active threads is 0
    [junit] Shutting down DataNode 1
    [junit] 11/08/16 10:27:59 INFO ipc.Server: Stopping server on 42244
    [junit] 11/08/16 10:27:59 INFO ipc.Server: IPC Server handler 0 on 42244: exiting
    [junit] 11/08/16 10:27:59 INFO ipc.Server: Stopping IPC Server Responder
    [junit] 11/08/16 10:27:59 WARN datanode.DataNode: DatanodeRegistration(127.0.0.1:54420, storageID=DS-335241179-67.195.138.20-54420-1313490114083, infoPort=54374, ipcPort=42244):DataXceiveServer: java.nio.channels.AsynchronousCloseException
    [junit] 	at java.nio.channels.spi.AbstractInterruptibleChannel.end(AbstractInterruptibleChannel.java:185)
    [junit] 	at sun.nio.ch.ServerSocketChannelImpl.accept(ServerSocketChannelImpl.java:159)
    [junit] 	at sun.nio.ch.ServerSocketAdaptor.accept(ServerSocketAdaptor.java:84)
    [junit] 	at org.apache.hadoop.hdfs.server.datanode.DataXceiverServer.run(DataXceiverServer.java:130)
    [junit] 	at java.lang.Thread.run(Thread.java:662)
    [junit] 
    [junit] 11/08/16 10:27:59 INFO datanode.DataNode: Waiting for threadgroup to exit, active threads is 1
    [junit] 11/08/16 10:27:59 INFO ipc.Server: IPC Server handler 2 on 42244: exiting
    [junit] 11/08/16 10:27:59 INFO ipc.Server: IPC Server handler 1 on 42244: exiting
    [junit] 11/08/16 10:27:59 INFO ipc.Server: Stopping IPC Server listener on 42244
    [junit] 11/08/16 10:27:59 INFO datanode.DataBlockScanner: Exiting DataBlockScanner thread.
    [junit] 11/08/16 10:27:59 INFO datanode.DataNode: DatanodeRegistration(127.0.0.1:54420, storageID=DS-335241179-67.195.138.20-54420-1313490114083, infoPort=54374, ipcPort=42244):Finishing DataNode in: FSDataset{dirpath='<https://builds.apache.org/job/Pig-trunk/ws/trunk/build/test/data/dfs/data/data3/current,/home/jenkins/jenkins-slave/workspace/Pig-trunk/trunk/build/test/data/dfs/data/data4/current'}>
    [junit] 11/08/16 10:27:59 INFO ipc.Server: Stopping server on 42244
    [junit] 11/08/16 10:27:59 INFO datanode.DataNode: Waiting for threadgroup to exit, active threads is 0
    [junit] Shutting down DataNode 0
    [junit] 11/08/16 10:27:59 INFO ipc.Server: Stopping server on 57893
    [junit] 11/08/16 10:27:59 INFO ipc.Server: Stopping IPC Server listener on 57893
    [junit] 11/08/16 10:27:59 INFO datanode.DataNode: Waiting for threadgroup to exit, active threads is 1
    [junit] 11/08/16 10:27:59 INFO ipc.Server: IPC Server handler 2 on 57893: exiting
    [junit] 11/08/16 10:27:59 INFO ipc.Server: IPC Server handler 1 on 57893: exiting
    [junit] 11/08/16 10:27:59 INFO ipc.Server: IPC Server handler 0 on 57893: exiting
    [junit] 11/08/16 10:27:59 INFO ipc.Server: Stopping IPC Server Responder
    [junit] 11/08/16 10:27:59 WARN datanode.DataNode: DatanodeRegistration(127.0.0.1:51519, storageID=DS-661048642-67.195.138.20-51519-1313490113805, infoPort=43125, ipcPort=57893):DataXceiveServer: java.nio.channels.AsynchronousCloseException
    [junit] 	at java.nio.channels.spi.AbstractInterruptibleChannel.end(AbstractInterruptibleChannel.java:185)
    [junit] 	at sun.nio.ch.ServerSocketChannelImpl.accept(ServerSocketChannelImpl.java:159)
    [junit] 	at sun.nio.ch.ServerSocketAdaptor.accept(ServerSocketAdaptor.java:84)
    [junit] 	at org.apache.hadoop.hdfs.server.datanode.DataXceiverServer.run(DataXceiverServer.java:130)
    [junit] 	at java.lang.Thread.run(Thread.java:662)
    [junit] 
    [junit] 11/08/16 10:28:00 INFO datanode.DataBlockScanner: Exiting DataBlockScanner thread.
    [junit] 11/08/16 10:28:00 INFO datanode.DataNode: Waiting for threadgroup to exit, active threads is 0
    [junit] 11/08/16 10:28:00 INFO datanode.DataNode: DatanodeRegistration(127.0.0.1:51519, storageID=DS-661048642-67.195.138.20-51519-1313490113805, infoPort=43125, ipcPort=57893):Finishing DataNode in: FSDataset{dirpath='<https://builds.apache.org/job/Pig-trunk/ws/trunk/build/test/data/dfs/data/data1/current,/home/jenkins/jenkins-slave/workspace/Pig-trunk/trunk/build/test/data/dfs/data/data2/current'}>
    [junit] 11/08/16 10:28:00 INFO ipc.Server: Stopping server on 57893
    [junit] 11/08/16 10:28:00 INFO datanode.DataNode: Waiting for threadgroup to exit, active threads is 0
    [junit] 11/08/16 10:28:01 WARN namenode.FSNamesystem: ReplicationMonitor thread received InterruptedException.java.lang.InterruptedException: sleep interrupted
    [junit] 11/08/16 10:28:01 INFO namenode.DecommissionManager: Interrupted Monitor
    [junit] java.lang.InterruptedException: sleep interrupted
    [junit] 	at java.lang.Thread.sleep(Native Method)
    [junit] 	at org.apache.hadoop.hdfs.server.namenode.DecommissionManager$Monitor.run(DecommissionManager.java:65)
    [junit] 	at java.lang.Thread.run(Thread.java:662)
    [junit] 11/08/16 10:28:01 INFO namenode.FSNamesystem: Number of transactions: 694 Total time for transactions(ms): 20Number of transactions batched in Syncs: 113 Number of syncs: 485 SyncTimes(ms): 10548 616 
    [junit] 11/08/16 10:28:01 INFO ipc.Server: Stopping server on 56467
    [junit] 11/08/16 10:28:01 INFO ipc.Server: IPC Server handler 0 on 56467: exiting
    [junit] 11/08/16 10:28:01 INFO ipc.Server: IPC Server handler 1 on 56467: exiting
    [junit] 11/08/16 10:28:01 INFO ipc.Server: IPC Server handler 2 on 56467: exiting
    [junit] 11/08/16 10:28:01 INFO ipc.Server: IPC Server handler 3 on 56467: exiting
    [junit] 11/08/16 10:28:01 INFO ipc.Server: IPC Server handler 4 on 56467: exiting
    [junit] 11/08/16 10:28:01 INFO ipc.Server: Stopping IPC Server listener on 56467
    [junit] 11/08/16 10:28:01 INFO ipc.Server: IPC Server handler 5 on 56467: exiting
    [junit] 11/08/16 10:28:01 INFO ipc.Server: IPC Server handler 6 on 56467: exiting
    [junit] 11/08/16 10:28:01 INFO ipc.Server: IPC Server handler 8 on 56467: exiting
    [junit] 11/08/16 10:28:01 INFO ipc.Server: IPC Server handler 9 on 56467: exiting
    [junit] 11/08/16 10:28:01 INFO ipc.Server: IPC Server handler 7 on 56467: exiting
    [junit] 11/08/16 10:28:01 INFO ipc.Server: Stopping IPC Server Responder
    [junit] Tests run: 17, Failures: 0, Errors: 0, Time elapsed: 364.432 sec
    [junit] Running org.apache.pig.test.TestStringUDFs
    [junit] 11/08/16 10:28:01 WARN builtin.SUBSTRING: No logger object provided to UDF: org.apache.pig.builtin.SUBSTRING. java.lang.NullPointerException
    [junit] 11/08/16 10:28:01 WARN builtin.SUBSTRING: No logger object provided to UDF: org.apache.pig.builtin.SUBSTRING. java.lang.StringIndexOutOfBoundsException: String index out of range: -2
    [junit] 11/08/16 10:28:01 WARN builtin.SUBSTRING: No logger object provided to UDF: org.apache.pig.builtin.SUBSTRING. java.lang.StringIndexOutOfBoundsException: String index out of range: -1
    [junit] 11/08/16 10:28:01 WARN builtin.SUBSTRING: No logger object provided to UDF: org.apache.pig.builtin.SUBSTRING. java.lang.StringIndexOutOfBoundsException: String index out of range: -8
    [junit] 11/08/16 10:28:01 WARN builtin.SUBSTRING: No logger object provided to UDF: org.apache.pig.builtin.SUBSTRING. java.lang.StringIndexOutOfBoundsException: String index out of range: -2
    [junit] 11/08/16 10:28:01 WARN builtin.INDEXOF: No logger object provided to UDF: org.apache.pig.builtin.INDEXOF. Failed to process input; error - null
    [junit] 11/08/16 10:28:01 WARN builtin.LAST_INDEX_OF: No logger object provided to UDF: org.apache.pig.builtin.LAST_INDEX_OF. Failed to process input; error - null
    [junit] Tests run: 11, Failures: 0, Errors: 0, Time elapsed: 0.093 sec
   [delete] Deleting directory /tmp/pig_junit_tmp834394781

BUILD FAILED
<https://builds.apache.org/job/Pig-trunk/ws/trunk/build.xml>:673: The following error occurred while executing this line:
<https://builds.apache.org/job/Pig-trunk/ws/trunk/build.xml>:728: Tests failed!

Total time: 17 minutes 16 seconds
[FINDBUGS] Skipping publisher since build result is FAILURE
Recording test results
Publishing Javadoc
Archiving artifacts
Recording fingerprints
Publishing Clover coverage report...
No Clover report will be published due to a Build Failure