You are viewing a plain text version of this content. The canonical link for it is here.
Posted to ci@buildr.apache.org by Apache Jenkins Server <je...@builds.apache.org> on 2011/07/22 13:23:21 UTC
Build failed in Jenkins: Buildr-ci-build #250
See <https://builds.apache.org/job/Buildr-ci-build/250/changes>
Changes:
[donaldp] Fix several minor spelling mistakes
------------------------------------------
[...truncated 549 lines...]
0 Fri Jul 22 11:22:24 UTC 2011 EmptyDir2/
21 Fri Jul 22 11:22:24 UTC 2011 Test1.txt
22 Fri Jul 22 11:22:24 UTC 2011 Text2.html
0 Fri Jul 22 11:22:24 UTC 2011 subdir/
15 Fri Jul 22 11:22:24 UTC 2011 subdir/test3.css
21 Fri Jul 22 11:22:24 UTC 2011 Test1.txt
22 Fri Jul 22 11:22:24 UTC 2011 Text2.html
15 Fri Jul 22 11:22:24 UTC 2011 Test1.txt
22 Fri Jul 22 11:22:24 UTC 2011 Text2.html
22 Fri Jul 22 11:22:24 UTC 2011 Text2.html
No known dependencies. Compiling everything
model contains 0 documentable templates
No known dependencies. Compiling everything
No known dependencies. Compiling everything
[36mRun starting. Expected test count is: 1[0m
[32mSuite Starting - MySuite[0m
[32mTest Starting - MySuite: addition[0m
[32mTest Succeeded - MySuite: addition[0m
[32mSuite Completed - MySuite[0m
[36mRun completed in 145 milliseconds.[0m
[36mTotal number of tests run: 1[0m
[36mSuites: completed 1, aborted 0[0m
[36mTests: succeeded 1, failed 0, ignored 0, pending 0[0m
[32mAll tests passed.[0m
No known dependencies. Compiling everything
No known dependencies. Compiling everything
[36mRun starting. Expected test count is: 1[0m
[32mSuite Starting - InnerClassTest[0m
[32mTest Starting - InnerClassTest: addition[0m
[32mTest Succeeded - InnerClassTest: addition[0m
[32mSuite Completed - InnerClassTest[0m
[36mRun completed in 140 milliseconds.[0m
[36mTotal number of tests run: 1[0m
[36mSuites: completed 1, aborted 0[0m
[36mTests: succeeded 1, failed 0, ignored 0, pending 0[0m
[32mAll tests passed.[0m
No known dependencies. Compiling everything
[36mRun starting. Expected test count is: 1[0m
[32mSuite Starting - PassingSuite[0m
[32mTest Starting - PassingSuite: addition[0m
[32mTest Succeeded - PassingSuite: addition[0m
[32mSuite Completed - PassingSuite[0m
[36mRun completed in 153 milliseconds.[0m
[36mTotal number of tests run: 1[0m
[36mSuites: completed 1, aborted 0[0m
[36mTests: succeeded 1, failed 0, ignored 0, pending 0[0m
[32mAll tests passed.[0m
No known dependencies. Compiling everything
[36mRun starting. Expected test count is: 1[0m
[32mSuite Starting - FailingSuite[0m
[32mTest Starting - FailingSuite: failing[0m
[31mTEST FAILED - FailingSuite: failing (FailingSuite.scala:3)[0m
[31m org.scalatest.TestFailedException[0m
[31m ...[0m
[31m at FailingSuite$$anonfun$1.apply$mcV$sp(FailingSuite.scala:3)[0m
[31m at FailingSuite$$anonfun$1.apply(FailingSuite.scala:3)[0m
[31m at FailingSuite$$anonfun$1.apply(FailingSuite.scala:3)[0m
[31m at org.scalatest.FunSuite$$anon$2.apply(FunSuite.scala:1146)[0m
[31m at org.scalatest.Suite$class.withFixture(Suite.scala:1477)[0m
[31m at FailingSuite.withFixture(FailingSuite.scala:1)[0m
[31m at org.scalatest.FunSuite$class.runTest(FunSuite.scala:1143)[0m
[31m ...[0m
[32mSuite Completed - FailingSuite[0m
[36mRun completed in 155 milliseconds.[0m
[36mTotal number of tests run: 1[0m
[36mSuites: completed 1, aborted 0[0m
[36mTests: succeeded 0, failed 1, ignored 0, pending 0[0m
[31m*** 1 TEST FAILED ***[0m
No known dependencies. Compiling everything
[36mRun starting. Expected test count is: 1[0m
[32mSuite Starting - FailingSuite[0m
[32mTest Starting - FailingSuite: failing[0m
[31mTEST FAILED - FailingSuite: failing (FailingSuite.scala:3)[0m
[31m org.scalatest.TestFailedException[0m
[31m ...[0m
[31m at FailingSuite$$anonfun$1.apply$mcV$sp(FailingSuite.scala:3)[0m
[31m at FailingSuite$$anonfun$1.apply(FailingSuite.scala:3)[0m
[31m at FailingSuite$$anonfun$1.apply(FailingSuite.scala:3)[0m
[31m at org.scalatest.FunSuite$$anon$2.apply(FunSuite.scala:1146)[0m
[31m at org.scalatest.Suite$class.withFixture(Suite.scala:1477)[0m
[31m at FailingSuite.withFixture(FailingSuite.scala:1)[0m
[31m at org.scalatest.FunSuite$class.runTest(FunSuite.scala:1143)[0m
[31m ...[0m
[32mSuite Completed - FailingSuite[0m
[36mRun completed in 165 milliseconds.[0m
[36mTotal number of tests run: 1[0m
[36mSuites: completed 1, aborted 0[0m
[36mTests: succeeded 0, failed 1, ignored 0, pending 0[0m
[31m*** 1 TEST FAILED ***[0m
No known dependencies. Compiling everything
[36mRun starting. Expected test count is: 1[0m
[32mSuite Starting - PassingSuite[0m
[32mTest Starting - PassingSuite: passing[0m
[32mTest Succeeded - PassingSuite: passing[0m
[32mSuite Completed - PassingSuite[0m
[36mRun completed in 232 milliseconds.[0m
[36mTotal number of tests run: 1[0m
[36mSuites: completed 1, aborted 0[0m
[36mTests: succeeded 1, failed 0, ignored 0, pending 0[0m
[32mAll tests passed.[0m
No known dependencies. Compiling everything
[36mRun starting. Expected test count is: 1[0m
[32mSuite Starting - PassingSuite[0m
[32mTest Starting - PassingSuite: passing[0m
[32mTest Succeeded - PassingSuite: passing[0m
[32mSuite Completed - PassingSuite[0m
[36mRun completed in 146 milliseconds.[0m
[36mTotal number of tests run: 1[0m
[36mSuites: completed 1, aborted 0[0m
[36mTests: succeeded 1, failed 0, ignored 0, pending 0[0m
[32mAll tests passed.[0m
No known dependencies. Compiling everything
[36mRun starting. Expected test count is: 1[0m
[32mSuite Starting - PropertyTestSuite[0m
[32mTest Starting - PropertyTestSuite: testProperty[0m
[32mTest Succeeded - PropertyTestSuite: testProperty[0m
[32mSuite Completed - PropertyTestSuite[0m
[36mRun completed in 140 milliseconds.[0m
[36mTotal number of tests run: 1[0m
[36mSuites: completed 1, aborted 0[0m
[36mTests: succeeded 1, failed 0, ignored 0, pending 0[0m
[32mAll tests passed.[0m
No known dependencies. Compiling everything
[36mRun starting. Expected test count is: 2[0m
[32mSuite Starting - MySuite[0m
[32mTest Starting - MySuite: list concatenation[0m
[32mTest Succeeded - MySuite: list concatenation[0m
[32mTest Starting - MySuite: list concatenation using a test method[0m
[32mTest Succeeded - MySuite: list concatenation using a test method[0m
[32mSuite Completed - MySuite[0m
[36mRun completed in 654 milliseconds.[0m
[36mTotal number of tests run: 2[0m
[36mSuites: completed 1, aborted 0[0m
[36mTests: succeeded 2, failed 0, ignored 0, pending 0[0m
[32mAll tests passed.[0m
No known dependencies. Compiling everything
[36mRun starting. Expected test count is: 5[0m
[32mSuite Starting - StringSuite[0m
[32mTest Starting - StringSuite: startsWith[0m
[32mTest Succeeded - StringSuite: startsWith[0m
[32mTest Starting - StringSuite: endsWith[0m
[32mTest Succeeded - StringSuite: endsWith[0m
[32mTest Starting - StringSuite: concat[0m
[31mTEST FAILED - StringSuite: concat (Checkers.scala:241)[0m
[31m Falsified after 0 passed tests:
> ARG_0 = ""
> ARG_1 = ""[0m
[31m org.scalatest.prop.PropertyTestFailedException: Falsified after 0 passed tests:
> ARG_0 = ""
> ARG_1 = ""[0m
[31m ...[0m
[31m at org.scalatest.prop.Checkers$class.check(Checkers.scala:241)[0m
[31m at StringSuite.check(StringSuite.scala:6)[0m
[31m at org.scalatest.prop.Checkers$class.check(Checkers.scala:304)[0m
[31m at StringSuite.check(StringSuite.scala:6)[0m
[31m at org.scalatest.prop.Checkers$class.check(Checkers.scala:115)[0m
[31m at StringSuite.check(StringSuite.scala:6)[0m
[31m at StringSuite$$anonfun$3.apply$mcV$sp(StringSuite.scala:17)[0m
[31m ...[0m
[32mTest Starting - StringSuite: substring2[0m
[32mTest Succeeded - StringSuite: substring2[0m
[32mTest Starting - StringSuite: substring3[0m
[32mTest Succeeded - StringSuite: substring3[0m
[32mSuite Completed - StringSuite[0m
[36mRun completed in 745 milliseconds.[0m
[36mTotal number of tests run: 5[0m
[36mSuites: completed 1, aborted 0[0m
[36mTests: succeeded 4, failed 1, ignored 0, pending 0[0m
[31m*** 1 TEST FAILED ***[0m
No known dependencies. Compiling everything
Specification "MySpecs"
it should
[32m+[0m add
Total for specification "MySpecs":
Finished in 0 second, 61 ms
1 example, 1 expectation, 0 failure, 0 error
No known dependencies. Compiling everything
Specification "MySpecs"
it should
[32m+[0m add
Total for specification "MySpecs":
Finished in 0 second, 62 ms
1 example, 1 expectation, 0 failure, 0 error
No known dependencies. Compiling everything
Specification "PassingSpecs"
it should
[32m+[0m add
Total for specification "PassingSpecs":
Finished in 0 second, 61 ms
1 example, 1 expectation, 0 failure, 0 error
No known dependencies. Compiling everything
Specification "StringSpecs"
empty string should
[31mx[0m have a zero length
'0' is not equal to '1' (StringSpecs.scala:7)
Total for specification "StringSpecs":
Finished in 0 second, 63 ms
1 example, 1 expectation, [31m1 failure[0m, 0 error
No known dependencies. Compiling everything
No known dependencies. Compiling everything
No known dependencies. Compiling everything
No known dependencies. Compiling everything
No known dependencies. Compiling everything
No known dependencies. Compiling everything
No known dependencies. Compiling everything
No known dependencies. Compiling everything
mkdir -p <https://builds.apache.org/job/Buildr-ci-build/ws/tmp/home>
mkdir -p <https://builds.apache.org/job/Buildr-ci-build/ws/tmp/home/.buildr>
rake aborted!
ruby -S bundle exec rspec --format html --out _reports/specs.html --backtrace spec/groovy/doc_spec.rb spec/groovy/bdd_spec.rb spec/groovy/compiler_spec.rb spec/addon/bnd_spec.rb spec/addon/drb_spec.rb spec/addon/jaxb_xjc_spec.rb spec/java/commands_spec.rb spec/java/external_spec.rb spec/java/ecj_spec.rb spec/java/doc_spec.rb spec/java/run_spec.rb spec/java/packaging_spec.rb spec/java/tests_spec.rb spec/java/bdd_spec.rb spec/java/emma_spec.rb spec/java/ant_spec.rb spec/java/cobertura_spec.rb spec/java/compiler_spec.rb spec/java/java_spec.rb spec/core/compile_spec.rb spec/core/doc_spec.rb spec/core/run_spec.rb spec/core/common_spec.rb spec/core/cc_spec.rb spec/core/project_spec.rb spec/core/generate_spec.rb spec/core/checks_spec.rb spec/core/application_spec.rb spec/core/util_spec.rb spec/core/extension_spec.rb spec/core/transport_spec.rb spec/core/shell_spec.rb spec/core/test_spec.rb spec/core/build_spec.rb spec/ide/idea_spec.rb spec/ide/eclipse_spec.rb spec/packaging/artifact_spec.rb spec/packaging/artifact_namespace_spec.rb spec/packaging/packaging_spec.rb spec/packaging/archive_spec.rb spec/version_requirement_spec.rb spec/scala/doc_spec.rb spec/scala/tests_spec.rb spec/scala/bdd_spec.rb spec/scala/compiler_spec.rb failed
/home/hudson/.rvm/gems/ruby-1.8.7-p334/gems/rspec-core-2.1.0/lib/rspec/core/rake_task.rb:139:in `initialize'
/home/hudson/.rvm/gems/ruby-1.8.7-p334/gems/rake-0.8.7/lib/rake.rb:1112:in `verbose'
/home/hudson/.rvm/gems/ruby-1.8.7-p334/gems/rspec-core-2.1.0/lib/rspec/core/rake_task.rb:131:in `send'
/home/hudson/.rvm/gems/ruby-1.8.7-p334/gems/rspec-core-2.1.0/lib/rspec/core/rake_task.rb:131:in `initialize'
/home/hudson/.rvm/gems/ruby-1.8.7-p334/gems/rake-0.8.7/lib/rake.rb:636:in `call'
/home/hudson/.rvm/gems/ruby-1.8.7-p334/gems/rake-0.8.7/lib/rake.rb:636:in `execute'
/home/hudson/.rvm/gems/ruby-1.8.7-p334/gems/rake-0.8.7/lib/rake.rb:631:in `each'
/home/hudson/.rvm/gems/ruby-1.8.7-p334/gems/rake-0.8.7/lib/rake.rb:631:in `execute'
/home/hudson/.rvm/gems/ruby-1.8.7-p334/gems/rake-0.8.7/lib/rake.rb:597:in `invoke_with_call_chain'
/home/hudson/.rvm/rubies/ruby-1.8.7-p334/lib/ruby/1.8/monitor.rb:242:in `synchronize'
/home/hudson/.rvm/gems/ruby-1.8.7-p334/gems/rake-0.8.7/lib/rake.rb:590:in `invoke_with_call_chain'
/home/hudson/.rvm/gems/ruby-1.8.7-p334/gems/rake-0.8.7/lib/rake.rb:607:in `invoke_prerequisites'
/home/hudson/.rvm/gems/ruby-1.8.7-p334/gems/rake-0.8.7/lib/rake.rb:604:in `each'
/home/hudson/.rvm/gems/ruby-1.8.7-p334/gems/rake-0.8.7/lib/rake.rb:604:in `invoke_prerequisites'
/home/hudson/.rvm/gems/ruby-1.8.7-p334/gems/rake-0.8.7/lib/rake.rb:596:in `invoke_with_call_chain'
/home/hudson/.rvm/rubies/ruby-1.8.7-p334/lib/ruby/1.8/monitor.rb:242:in `synchronize'
/home/hudson/.rvm/gems/ruby-1.8.7-p334/gems/rake-0.8.7/lib/rake.rb:590:in `invoke_with_call_chain'
/home/hudson/.rvm/gems/ruby-1.8.7-p334/gems/rake-0.8.7/lib/rake.rb:583:in `invoke'
/home/hudson/.rvm/gems/ruby-1.8.7-p334/gems/rake-0.8.7/lib/rake.rb:2051:in `invoke_task'
/home/hudson/.rvm/gems/ruby-1.8.7-p334/gems/rake-0.8.7/lib/rake.rb:2029:in `top_level'
/home/hudson/.rvm/gems/ruby-1.8.7-p334/gems/rake-0.8.7/lib/rake.rb:2029:in `each'
/home/hudson/.rvm/gems/ruby-1.8.7-p334/gems/rake-0.8.7/lib/rake.rb:2029:in `top_level'
/home/hudson/.rvm/gems/ruby-1.8.7-p334/gems/rake-0.8.7/lib/rake.rb:2068:in `standard_exception_handling'
/home/hudson/.rvm/gems/ruby-1.8.7-p334/gems/rake-0.8.7/lib/rake.rb:2023:in `top_level'
/home/hudson/.rvm/gems/ruby-1.8.7-p334/gems/rake-0.8.7/lib/rake.rb:2001:in `run'
/home/hudson/.rvm/gems/ruby-1.8.7-p334/gems/rake-0.8.7/lib/rake.rb:2068:in `standard_exception_handling'
/home/hudson/.rvm/gems/ruby-1.8.7-p334/gems/rake-0.8.7/lib/rake.rb:1998:in `run'
/home/hudson/.rvm/gems/ruby-1.8.7-p334/gems/rake-0.8.7/bin/rake:31
/home/hudson/.rvm/gems/ruby-1.8.7-p334/bin/rake:19:in `load'
/home/hudson/.rvm/gems/ruby-1.8.7-p334/bin/rake:19
Recording test results
Jenkins build is back to normal : Buildr-ci-build #252
Posted by Apache Jenkins Server <je...@builds.apache.org>.
See <https://builds.apache.org/job/Buildr-ci-build/252/changes>
Build failed in Jenkins: Buildr-ci-build #251
Posted by Apache Jenkins Server <je...@builds.apache.org>.
See <https://builds.apache.org/job/Buildr-ci-build/251/changes>
Changes:
[donaldp] Remove empty directory
[donaldp] Fix spelling
[donaldp] Fix spelling and grammar in the comment
[donaldp] Disable specs for tests that fail on the CI box when run as a batch. Unable to determine the root cause so disabling the test temporarily to return the build to green status
------------------------------------------
[...truncated 860 lines...]
0 Fri Jul 22 12:24:18 UTC 2011 EmptyDir2/
21 Fri Jul 22 12:24:18 UTC 2011 Test1.txt
22 Fri Jul 22 12:24:18 UTC 2011 Text2.html
0 Fri Jul 22 12:24:18 UTC 2011 subdir/
15 Fri Jul 22 12:24:18 UTC 2011 subdir/test3.css
21 Fri Jul 22 12:24:18 UTC 2011 Test1.txt
22 Fri Jul 22 12:24:18 UTC 2011 Text2.html
15 Fri Jul 22 12:24:18 UTC 2011 Test1.txt
22 Fri Jul 22 12:24:18 UTC 2011 Text2.html
22 Fri Jul 22 12:24:18 UTC 2011 Text2.html
No known dependencies. Compiling everything
model contains 0 documentable templates
No known dependencies. Compiling everything
No known dependencies. Compiling everything
[36mRun starting. Expected test count is: 1[0m
[32mSuite Starting - MySuite[0m
[32mTest Starting - MySuite: addition[0m
[32mTest Succeeded - MySuite: addition[0m
[32mSuite Completed - MySuite[0m
[36mRun completed in 159 milliseconds.[0m
[36mTotal number of tests run: 1[0m
[36mSuites: completed 1, aborted 0[0m
[36mTests: succeeded 1, failed 0, ignored 0, pending 0[0m
[32mAll tests passed.[0m
No known dependencies. Compiling everything
No known dependencies. Compiling everything
[36mRun starting. Expected test count is: 1[0m
[32mSuite Starting - InnerClassTest[0m
[32mTest Starting - InnerClassTest: addition[0m
[32mTest Succeeded - InnerClassTest: addition[0m
[32mSuite Completed - InnerClassTest[0m
[36mRun completed in 258 milliseconds.[0m
[36mTotal number of tests run: 1[0m
[36mSuites: completed 1, aborted 0[0m
[36mTests: succeeded 1, failed 0, ignored 0, pending 0[0m
[32mAll tests passed.[0m
No known dependencies. Compiling everything
[36mRun starting. Expected test count is: 1[0m
[32mSuite Starting - PassingSuite[0m
[32mTest Starting - PassingSuite: addition[0m
[32mTest Succeeded - PassingSuite: addition[0m
[32mSuite Completed - PassingSuite[0m
[36mRun completed in 161 milliseconds.[0m
[36mTotal number of tests run: 1[0m
[36mSuites: completed 1, aborted 0[0m
[36mTests: succeeded 1, failed 0, ignored 0, pending 0[0m
[32mAll tests passed.[0m
No known dependencies. Compiling everything
[36mRun starting. Expected test count is: 1[0m
[32mSuite Starting - FailingSuite[0m
[32mTest Starting - FailingSuite: failing[0m
[31mTEST FAILED - FailingSuite: failing (FailingSuite.scala:3)[0m
[31m org.scalatest.TestFailedException[0m
[31m ...[0m
[31m at FailingSuite$$anonfun$1.apply$mcV$sp(FailingSuite.scala:3)[0m
[31m at FailingSuite$$anonfun$1.apply(FailingSuite.scala:3)[0m
[31m at FailingSuite$$anonfun$1.apply(FailingSuite.scala:3)[0m
[31m at org.scalatest.FunSuite$$anon$2.apply(FunSuite.scala:1146)[0m
[31m at org.scalatest.Suite$class.withFixture(Suite.scala:1477)[0m
[31m at FailingSuite.withFixture(FailingSuite.scala:1)[0m
[31m at org.scalatest.FunSuite$class.runTest(FunSuite.scala:1143)[0m
[31m ...[0m
[32mSuite Completed - FailingSuite[0m
[36mRun completed in 144 milliseconds.[0m
[36mTotal number of tests run: 1[0m
[36mSuites: completed 1, aborted 0[0m
[36mTests: succeeded 0, failed 1, ignored 0, pending 0[0m
[31m*** 1 TEST FAILED ***[0m
No known dependencies. Compiling everything
[36mRun starting. Expected test count is: 1[0m
[32mSuite Starting - FailingSuite[0m
[32mTest Starting - FailingSuite: failing[0m
[31mTEST FAILED - FailingSuite: failing (FailingSuite.scala:3)[0m
[31m org.scalatest.TestFailedException[0m
[31m ...[0m
[31m at FailingSuite$$anonfun$1.apply$mcV$sp(FailingSuite.scala:3)[0m
[31m at FailingSuite$$anonfun$1.apply(FailingSuite.scala:3)[0m
[31m at FailingSuite$$anonfun$1.apply(FailingSuite.scala:3)[0m
[31m at org.scalatest.FunSuite$$anon$2.apply(FunSuite.scala:1146)[0m
[31m at org.scalatest.Suite$class.withFixture(Suite.scala:1477)[0m
[31m at FailingSuite.withFixture(FailingSuite.scala:1)[0m
[31m at org.scalatest.FunSuite$class.runTest(FunSuite.scala:1143)[0m
[31m ...[0m
[32mSuite Completed - FailingSuite[0m
[36mRun completed in 143 milliseconds.[0m
[36mTotal number of tests run: 1[0m
[36mSuites: completed 1, aborted 0[0m
[36mTests: succeeded 0, failed 1, ignored 0, pending 0[0m
[31m*** 1 TEST FAILED ***[0m
No known dependencies. Compiling everything
[36mRun starting. Expected test count is: 1[0m
[32mSuite Starting - PassingSuite[0m
[32mTest Starting - PassingSuite: passing[0m
[32mTest Succeeded - PassingSuite: passing[0m
[32mSuite Completed - PassingSuite[0m
[36mRun completed in 140 milliseconds.[0m
[36mTotal number of tests run: 1[0m
[36mSuites: completed 1, aborted 0[0m
[36mTests: succeeded 1, failed 0, ignored 0, pending 0[0m
[32mAll tests passed.[0m
No known dependencies. Compiling everything
[36mRun starting. Expected test count is: 1[0m
[32mSuite Starting - PassingSuite[0m
[32mTest Starting - PassingSuite: passing[0m
[32mTest Succeeded - PassingSuite: passing[0m
[32mSuite Completed - PassingSuite[0m
[36mRun completed in 228 milliseconds.[0m
[36mTotal number of tests run: 1[0m
[36mSuites: completed 1, aborted 0[0m
[36mTests: succeeded 1, failed 0, ignored 0, pending 0[0m
[32mAll tests passed.[0m
No known dependencies. Compiling everything
[36mRun starting. Expected test count is: 1[0m
[32mSuite Starting - PropertyTestSuite[0m
[32mTest Starting - PropertyTestSuite: testProperty[0m
[32mTest Succeeded - PropertyTestSuite: testProperty[0m
[32mSuite Completed - PropertyTestSuite[0m
[36mRun completed in 144 milliseconds.[0m
[36mTotal number of tests run: 1[0m
[36mSuites: completed 1, aborted 0[0m
[36mTests: succeeded 1, failed 0, ignored 0, pending 0[0m
[32mAll tests passed.[0m
No known dependencies. Compiling everything
[36mRun starting. Expected test count is: 2[0m
[32mSuite Starting - MySuite[0m
[32mTest Starting - MySuite: list concatenation[0m
[32mTest Succeeded - MySuite: list concatenation[0m
[32mTest Starting - MySuite: list concatenation using a test method[0m
[32mTest Succeeded - MySuite: list concatenation using a test method[0m
[32mSuite Completed - MySuite[0m
[36mRun completed in 604 milliseconds.[0m
[36mTotal number of tests run: 2[0m
[36mSuites: completed 1, aborted 0[0m
[36mTests: succeeded 2, failed 0, ignored 0, pending 0[0m
[32mAll tests passed.[0m
No known dependencies. Compiling everything
[36mRun starting. Expected test count is: 5[0m
[32mSuite Starting - StringSuite[0m
[32mTest Starting - StringSuite: startsWith[0m
[32mTest Succeeded - StringSuite: startsWith[0m
[32mTest Starting - StringSuite: endsWith[0m
[32mTest Succeeded - StringSuite: endsWith[0m
[32mTest Starting - StringSuite: concat[0m
[31mTEST FAILED - StringSuite: concat (Checkers.scala:241)[0m
[31m Falsified after 0 passed tests:
> ARG_0 = ""
> ARG_1 = ""[0m
[31m org.scalatest.prop.PropertyTestFailedException: Falsified after 0 passed tests:
> ARG_0 = ""
> ARG_1 = ""[0m
[31m ...[0m
[31m at org.scalatest.prop.Checkers$class.check(Checkers.scala:241)[0m
[31m at StringSuite.check(StringSuite.scala:6)[0m
[31m at org.scalatest.prop.Checkers$class.check(Checkers.scala:304)[0m
[31m at StringSuite.check(StringSuite.scala:6)[0m
[31m at org.scalatest.prop.Checkers$class.check(Checkers.scala:115)[0m
[31m at StringSuite.check(StringSuite.scala:6)[0m
[31m at StringSuite$$anonfun$3.apply$mcV$sp(StringSuite.scala:17)[0m
[31m ...[0m
[32mTest Starting - StringSuite: substring2[0m
[32mTest Succeeded - StringSuite: substring2[0m
[32mTest Starting - StringSuite: substring3[0m
[32mTest Succeeded - StringSuite: substring3[0m
[32mSuite Completed - StringSuite[0m
[36mRun completed in 532 milliseconds.[0m
[36mTotal number of tests run: 5[0m
[36mSuites: completed 1, aborted 0[0m
[36mTests: succeeded 4, failed 1, ignored 0, pending 0[0m
[31m*** 1 TEST FAILED ***[0m
No known dependencies. Compiling everything
Specification "MySpecs"
it should
[32m+[0m add
Total for specification "MySpecs":
Finished in 0 second, 77 ms
1 example, 1 expectation, 0 failure, 0 error
No known dependencies. Compiling everything
Specification "MySpecs"
it should
[32m+[0m add
Total for specification "MySpecs":
Finished in 0 second, 61 ms
1 example, 1 expectation, 0 failure, 0 error
No known dependencies. Compiling everything
Specification "PassingSpecs"
it should
[32m+[0m add
Total for specification "PassingSpecs":
Finished in 0 second, 61 ms
1 example, 1 expectation, 0 failure, 0 error
No known dependencies. Compiling everything
Specification "StringSpecs"
empty string should
[31mx[0m have a zero length
'0' is not equal to '1' (StringSpecs.scala:7)
Total for specification "StringSpecs":
Finished in 0 second, 63 ms
1 example, 1 expectation, [31m1 failure[0m, 0 error
No known dependencies. Compiling everything
No known dependencies. Compiling everything
No known dependencies. Compiling everything
No known dependencies. Compiling everything
No known dependencies. Compiling everything
No known dependencies. Compiling everything
No known dependencies. Compiling everything
No known dependencies. Compiling everything
mkdir -p <https://builds.apache.org/job/Buildr-ci-build/ws/tmp/home>
mkdir -p <https://builds.apache.org/job/Buildr-ci-build/ws/tmp/home/.buildr>
rake aborted!
ruby -S bundle exec rspec --format html --out _reports/specs.html --backtrace spec/groovy/doc_spec.rb spec/groovy/bdd_spec.rb spec/groovy/compiler_spec.rb spec/addon/bnd_spec.rb spec/addon/drb_spec.rb spec/addon/jaxb_xjc_spec.rb spec/java/commands_spec.rb spec/java/external_spec.rb spec/java/ecj_spec.rb spec/java/doc_spec.rb spec/java/run_spec.rb spec/java/packaging_spec.rb spec/java/tests_spec.rb spec/java/bdd_spec.rb spec/java/emma_spec.rb spec/java/ant_spec.rb spec/java/cobertura_spec.rb spec/java/compiler_spec.rb spec/java/java_spec.rb spec/core/compile_spec.rb spec/core/doc_spec.rb spec/core/run_spec.rb spec/core/common_spec.rb spec/core/cc_spec.rb spec/core/project_spec.rb spec/core/generate_spec.rb spec/core/checks_spec.rb spec/core/application_spec.rb spec/core/util_spec.rb spec/core/extension_spec.rb spec/core/transport_spec.rb spec/core/shell_spec.rb spec/core/test_spec.rb spec/core/build_spec.rb spec/ide/idea_spec.rb spec/ide/eclipse_spec.rb spec/packaging/artifact_spec.rb spec/packaging/artifact_namespace_spec.rb spec/packaging/packaging_spec.rb spec/packaging/archive_spec.rb spec/version_requirement_spec.rb spec/scala/doc_spec.rb spec/scala/tests_spec.rb spec/scala/bdd_spec.rb spec/scala/compiler_spec.rb failed
/home/hudson/.rvm/gems/ruby-1.8.7-p334/gems/rspec-core-2.1.0/lib/rspec/core/rake_task.rb:139:in `initialize'
/home/hudson/.rvm/gems/ruby-1.8.7-p334/gems/rake-0.8.7/lib/rake.rb:1112:in `verbose'
/home/hudson/.rvm/gems/ruby-1.8.7-p334/gems/rspec-core-2.1.0/lib/rspec/core/rake_task.rb:131:in `send'
/home/hudson/.rvm/gems/ruby-1.8.7-p334/gems/rspec-core-2.1.0/lib/rspec/core/rake_task.rb:131:in `initialize'
/home/hudson/.rvm/gems/ruby-1.8.7-p334/gems/rake-0.8.7/lib/rake.rb:636:in `call'
/home/hudson/.rvm/gems/ruby-1.8.7-p334/gems/rake-0.8.7/lib/rake.rb:636:in `execute'
/home/hudson/.rvm/gems/ruby-1.8.7-p334/gems/rake-0.8.7/lib/rake.rb:631:in `each'
/home/hudson/.rvm/gems/ruby-1.8.7-p334/gems/rake-0.8.7/lib/rake.rb:631:in `execute'
/home/hudson/.rvm/gems/ruby-1.8.7-p334/gems/rake-0.8.7/lib/rake.rb:597:in `invoke_with_call_chain'
/home/hudson/.rvm/rubies/ruby-1.8.7-p334/lib/ruby/1.8/monitor.rb:242:in `synchronize'
/home/hudson/.rvm/gems/ruby-1.8.7-p334/gems/rake-0.8.7/lib/rake.rb:590:in `invoke_with_call_chain'
/home/hudson/.rvm/gems/ruby-1.8.7-p334/gems/rake-0.8.7/lib/rake.rb:607:in `invoke_prerequisites'
/home/hudson/.rvm/gems/ruby-1.8.7-p334/gems/rake-0.8.7/lib/rake.rb:604:in `each'
/home/hudson/.rvm/gems/ruby-1.8.7-p334/gems/rake-0.8.7/lib/rake.rb:604:in `invoke_prerequisites'
/home/hudson/.rvm/gems/ruby-1.8.7-p334/gems/rake-0.8.7/lib/rake.rb:596:in `invoke_with_call_chain'
/home/hudson/.rvm/rubies/ruby-1.8.7-p334/lib/ruby/1.8/monitor.rb:242:in `synchronize'
/home/hudson/.rvm/gems/ruby-1.8.7-p334/gems/rake-0.8.7/lib/rake.rb:590:in `invoke_with_call_chain'
/home/hudson/.rvm/gems/ruby-1.8.7-p334/gems/rake-0.8.7/lib/rake.rb:583:in `invoke'
/home/hudson/.rvm/gems/ruby-1.8.7-p334/gems/rake-0.8.7/lib/rake.rb:2051:in `invoke_task'
/home/hudson/.rvm/gems/ruby-1.8.7-p334/gems/rake-0.8.7/lib/rake.rb:2029:in `top_level'
/home/hudson/.rvm/gems/ruby-1.8.7-p334/gems/rake-0.8.7/lib/rake.rb:2029:in `each'
/home/hudson/.rvm/gems/ruby-1.8.7-p334/gems/rake-0.8.7/lib/rake.rb:2029:in `top_level'
/home/hudson/.rvm/gems/ruby-1.8.7-p334/gems/rake-0.8.7/lib/rake.rb:2068:in `standard_exception_handling'
/home/hudson/.rvm/gems/ruby-1.8.7-p334/gems/rake-0.8.7/lib/rake.rb:2023:in `top_level'
/home/hudson/.rvm/gems/ruby-1.8.7-p334/gems/rake-0.8.7/lib/rake.rb:2001:in `run'
/home/hudson/.rvm/gems/ruby-1.8.7-p334/gems/rake-0.8.7/lib/rake.rb:2068:in `standard_exception_handling'
/home/hudson/.rvm/gems/ruby-1.8.7-p334/gems/rake-0.8.7/lib/rake.rb:1998:in `run'
/home/hudson/.rvm/gems/ruby-1.8.7-p334/gems/rake-0.8.7/bin/rake:31
/home/hudson/.rvm/gems/ruby-1.8.7-p334/bin/rake:19:in `load'
/home/hudson/.rvm/gems/ruby-1.8.7-p334/bin/rake:19
Recording test results