You are viewing a plain text version of this content. The canonical link for it is here.
Posted to dev@kafka.apache.org by Apache Jenkins Server <je...@builds.apache.org> on 2020/05/20 09:12:12 UTC
Build failed in Jenkins: kafka-trunk-jdk8 #4548
See <https://builds.apache.org/job/kafka-trunk-jdk8/4548/display/redirect>
Changes:
------------------------------------------
Started by an SCM change
Running as SYSTEM
[EnvInject] - Loading node environment variables.
Building remotely on H44 (ubuntu) in workspace <https://builds.apache.org/job/kafka-trunk-jdk8/ws/>
[WS-CLEANUP] Deleting project workspace...
[WS-CLEANUP] Deferred wipeout is used...
FATAL: java.nio.file.FileSystemException: <https://builds.apache.org/job/kafka-trunk-jdk8/ws/>: Input/output error
java.nio.file.FileSystemException: <https://builds.apache.org/job/kafka-trunk-jdk8/ws/>: Input/output error
at sun.nio.fs.UnixException.translateToIOException(UnixException.java:91)
at sun.nio.fs.UnixException.asIOException(UnixException.java:111)
at sun.nio.fs.UnixDirectoryStream$UnixDirectoryIterator.readNextEntry(UnixDirectoryStream.java:171)
Also: hudson.remoting.Channel$CallSiteStackTrace: Remote call to H44
at hudson.remoting.Channel.attachCallSiteStackTrace(Channel.java:1743)
at hudson.remoting.UserRequest$ExceptionResponse.retrieve(UserRequest.java:357)
at hudson.remoting.Channel.call(Channel.java:957)
at hudson.FilePath.act(FilePath.java:1072)
at hudson.FilePath.act(FilePath.java:1061)
at hudson.FilePath.deleteRecursive(FilePath.java:1268)
at hudson.plugins.ws_cleanup.Wipeout.performDelete(Wipeout.java:82)
at hudson.plugins.ws_cleanup.Wipeout.perform(Wipeout.java:78)
at hudson.plugins.ws_cleanup.PreBuildCleanup.preCheckout(PreBuildCleanup.java:107)
at jenkins.scm.SCMCheckoutStrategy.preCheckout(SCMCheckoutStrategy.java:76)
at hudson.model.AbstractBuild$AbstractBuildExecution.run(AbstractBuild.java:498)
at hudson.model.Run.execute(Run.java:1815)
at hudson.model.FreeStyleBuild.run(FreeStyleBuild.java:43)
at hudson.model.ResourceController.execute(ResourceController.java:97)
at hudson.model.Executor.run(Executor.java:429)
Caused: java.nio.file.DirectoryIteratorException
at sun.nio.fs.UnixDirectoryStream$UnixDirectoryIterator.readNextEntry(UnixDirectoryStream.java:172)
at sun.nio.fs.UnixDirectoryStream$UnixDirectoryIterator.hasNext(UnixDirectoryStream.java:201)
at jenkins.util.io.PathRemover.tryRemoveDirectoryContents(PathRemover.java:225)
at jenkins.util.io.PathRemover.tryRemoveRecursive(PathRemover.java:215)
at jenkins.util.io.PathRemover.forceRemoveRecursive(PathRemover.java:96)
at hudson.Util.deleteRecursive(Util.java:293)
at hudson.FilePath$DeleteRecursive.invoke(FilePath.java:1274)
at hudson.FilePath$DeleteRecursive.invoke(FilePath.java:1270)
at hudson.FilePath$FileCallableWrapper.call(FilePath.java:3052)
at hudson.remoting.UserRequest.perform(UserRequest.java:212)
at hudson.remoting.UserRequest.perform(UserRequest.java:54)
at hudson.remoting.Request$2.run(Request.java:369)
at hudson.remoting.InterceptingExecutorService$1.call(InterceptingExecutorService.java:72)
at java.util.concurrent.FutureTask.run(FutureTask.java:266)
at java.util.concurrent.ThreadPoolExecutor.runWorker(ThreadPoolExecutor.java:1149)
at java.util.concurrent.ThreadPoolExecutor$Worker.run(ThreadPoolExecutor.java:624)
at java.lang.Thread.run(Thread.java:748)
[FINDBUGS] Collecting findbugs analysis files...
ERROR: Step ?[Deprecated] Publish FindBugs analysis results? aborted due to exception:
Also: hudson.remoting.Channel$CallSiteStackTrace: Remote call to H44
at hudson.remoting.Channel.attachCallSiteStackTrace(Channel.java:1743)
at hudson.remoting.UserRequest$ExceptionResponse.retrieve(UserRequest.java:357)
at hudson.remoting.Channel.call(Channel.java:957)
at hudson.FilePath.act(FilePath.java:1072)
at hudson.FilePath.act(FilePath.java:1061)
at hudson.plugins.findbugs.FindBugsPublisher.perform(FindBugsPublisher.java:144)
at hudson.plugins.analysis.core.HealthAwarePublisher.perform(HealthAwarePublisher.java:69)
at hudson.plugins.analysis.core.HealthAwareRecorder.perform(HealthAwareRecorder.java:298)
at hudson.tasks.BuildStepCompatibilityLayer.perform(BuildStepCompatibilityLayer.java:79)
at hudson.tasks.BuildStepMonitor$1.perform(BuildStepMonitor.java:20)
at hudson.model.AbstractBuild$AbstractBuildExecution.perform(AbstractBuild.java:741)
at hudson.model.AbstractBuild$AbstractBuildExecution.performAllBuildSteps(AbstractBuild.java:690)
at hudson.model.Build$BuildExecution.post2(Build.java:186)
at hudson.model.AbstractBuild$AbstractBuildExecution.post(AbstractBuild.java:635)
at hudson.model.Run.execute(Run.java:1840)
at hudson.model.FreeStyleBuild.run(FreeStyleBuild.java:43)
at hudson.model.ResourceController.execute(ResourceController.java:97)
at hudson.model.Executor.run(Executor.java:429)
java.lang.NoClassDefFoundError: hudson/plugins/analysis/Messages
at hudson.plugins.analysis.core.FilesParser.parserCollectionOfFiles(FilesParser.java:227)
at hudson.plugins.analysis.core.FilesParser.invoke(FilesParser.java:203)
at hudson.plugins.analysis.core.FilesParser.invoke(FilesParser.java:31)
at hudson.FilePath$FileCallableWrapper.call(FilePath.java:3052)
at hudson.remoting.UserRequest.perform(UserRequest.java:212)
at hudson.remoting.UserRequest.perform(UserRequest.java:54)
at hudson.remoting.Request$2.run(Request.java:369)
at hudson.remoting.InterceptingExecutorService$1.call(InterceptingExecutorService.java:72)
at java.util.concurrent.FutureTask.run(FutureTask.java:266)
at java.util.concurrent.ThreadPoolExecutor.runWorker(ThreadPoolExecutor.java:1149)
at java.util.concurrent.ThreadPoolExecutor$Worker.run(ThreadPoolExecutor.java:624)
at java.lang.Thread.run(Thread.java:748)
Caused: java.io.IOException: Remote call on H44 failed
at hudson.remoting.Channel.call(Channel.java:963)
at hudson.FilePath.act(FilePath.java:1072)
at hudson.FilePath.act(FilePath.java:1061)
at hudson.plugins.findbugs.FindBugsPublisher.perform(FindBugsPublisher.java:144)
at hudson.plugins.analysis.core.HealthAwarePublisher.perform(HealthAwarePublisher.java:69)
at hudson.plugins.analysis.core.HealthAwareRecorder.perform(HealthAwareRecorder.java:298)
at hudson.tasks.BuildStepCompatibilityLayer.perform(BuildStepCompatibilityLayer.java:79)
at hudson.tasks.BuildStepMonitor$1.perform(BuildStepMonitor.java:20)
at hudson.model.AbstractBuild$AbstractBuildExecution.perform(AbstractBuild.java:741)
at hudson.model.AbstractBuild$AbstractBuildExecution.performAllBuildSteps(AbstractBuild.java:690)
at hudson.model.Build$BuildExecution.post2(Build.java:186)
at hudson.model.AbstractBuild$AbstractBuildExecution.post(AbstractBuild.java:635)
at hudson.model.Run.execute(Run.java:1840)
at hudson.model.FreeStyleBuild.run(FreeStyleBuild.java:43)
at hudson.model.ResourceController.execute(ResourceController.java:97)
at hudson.model.Executor.run(Executor.java:429)
Recording test results
ERROR: Step ?Publish JUnit test result report? failed: No test report files were found. Configuration error?
Not sending mail to unregistered user noreply@github.com
Jenkins build is back to normal : kafka-trunk-jdk8 #4559
Posted by Apache Jenkins Server <je...@builds.apache.org>.
See <https://builds.apache.org/job/kafka-trunk-jdk8/4559/display/redirect?page=changes>
Build failed in Jenkins: kafka-trunk-jdk8 #4558
Posted by Apache Jenkins Server <je...@builds.apache.org>.
See <https://builds.apache.org/job/kafka-trunk-jdk8/4558/display/redirect?page=changes>
Changes:
[github] KAFKA-9780: Deprecate commit records without record metadata (#8379)
------------------------------------------
[...truncated 1.79 MB...]
kafka.server.epoch.LeaderEpochFileCacheTest > shouldNotClearAnythingIfOffsetToFirstOffset STARTED
kafka.server.epoch.LeaderEpochFileCacheTest > shouldNotClearAnythingIfOffsetToFirstOffset PASSED
kafka.server.epoch.LeaderEpochFileCacheTest > shouldGetFirstOffsetOfSubsequentEpochWhenOffsetRequestedForPreviousEpoch STARTED
kafka.server.epoch.LeaderEpochFileCacheTest > shouldGetFirstOffsetOfSubsequentEpochWhenOffsetRequestedForPreviousEpoch PASSED
kafka.server.epoch.LeaderEpochFileCacheTest > shouldEnforceOffsetsIncreaseMonotonically STARTED
kafka.server.epoch.LeaderEpochFileCacheTest > shouldEnforceOffsetsIncreaseMonotonically PASSED
kafka.server.epoch.LeaderEpochFileCacheTest > shouldUpdateOffsetBetweenEpochBoundariesOnClearEarliest2 STARTED
kafka.server.epoch.LeaderEpochFileCacheTest > shouldUpdateOffsetBetweenEpochBoundariesOnClearEarliest2 PASSED
kafka.server.epoch.LeaderEpochFileCacheTest > shouldClearEarliestOnEmptyCache STARTED
kafka.server.epoch.LeaderEpochFileCacheTest > shouldClearEarliestOnEmptyCache PASSED
kafka.server.epoch.LeaderEpochFileCacheTest > shouldPreserveResetOffsetOnClearEarliestIfOneExists STARTED
kafka.server.epoch.LeaderEpochFileCacheTest > shouldPreserveResetOffsetOnClearEarliestIfOneExists PASSED
kafka.server.epoch.LeaderEpochFileCacheTest > shouldUpdateOffsetBetweenEpochBoundariesOnClearEarliest STARTED
kafka.server.epoch.LeaderEpochFileCacheTest > shouldUpdateOffsetBetweenEpochBoundariesOnClearEarliest PASSED
kafka.server.epoch.LeaderEpochFileCacheTest > shouldReturnInvalidOffsetIfEpochIsRequestedWhichIsNotCurrentlyTracked STARTED
kafka.server.epoch.LeaderEpochFileCacheTest > shouldReturnInvalidOffsetIfEpochIsRequestedWhichIsNotCurrentlyTracked PASSED
kafka.server.epoch.LeaderEpochFileCacheTest > shouldEnforceMonotonicallyIncreasingStartOffsets STARTED
kafka.server.epoch.LeaderEpochFileCacheTest > shouldEnforceMonotonicallyIncreasingStartOffsets PASSED
kafka.server.epoch.LeaderEpochFileCacheTest > shouldFetchEndOffsetOfEmptyCache STARTED
kafka.server.epoch.LeaderEpochFileCacheTest > shouldFetchEndOffsetOfEmptyCache PASSED
kafka.server.epoch.LeaderEpochFileCacheTest > shouldRetainLatestEpochOnClearAllEarliestAndUpdateItsOffset STARTED
kafka.server.epoch.LeaderEpochFileCacheTest > shouldRetainLatestEpochOnClearAllEarliestAndUpdateItsOffset PASSED
kafka.server.epoch.LeaderEpochFileCacheTest > shouldClearAllEntries STARTED
kafka.server.epoch.LeaderEpochFileCacheTest > shouldClearAllEntries PASSED
kafka.server.epoch.LeaderEpochFileCacheTest > shouldClearLatestOnEmptyCache STARTED
kafka.server.epoch.LeaderEpochFileCacheTest > shouldClearLatestOnEmptyCache PASSED
kafka.server.epoch.LeaderEpochFileCacheTest > shouldNotResetEpochHistoryHeadIfUndefinedPassed STARTED
kafka.server.epoch.LeaderEpochFileCacheTest > shouldNotResetEpochHistoryHeadIfUndefinedPassed PASSED
kafka.server.StopReplicaRequestTest > testStopReplicaRequest STARTED
kafka.server.StopReplicaRequestTest > testStopReplicaRequest PASSED
kafka.server.AlterReplicaLogDirsRequestTest > testAlterReplicaLogDirsRequest STARTED
kafka.server.AlterReplicaLogDirsRequestTest > testAlterReplicaLogDirsRequest PASSED
kafka.server.AlterReplicaLogDirsRequestTest > testAlterReplicaLogDirsRequestErrorCode STARTED
kafka.server.AlterReplicaLogDirsRequestTest > testAlterReplicaLogDirsRequestErrorCode PASSED
kafka.server.ClientQuotasRequestTest > testAlterClientQuotasBadClientId STARTED
kafka.server.ClientQuotasRequestTest > testAlterClientQuotasBadClientId PASSED
kafka.server.ClientQuotasRequestTest > testAlterClientQuotasBadConfigKey STARTED
kafka.server.ClientQuotasRequestTest > testAlterClientQuotasBadConfigKey PASSED
kafka.server.ClientQuotasRequestTest > testDescribeClientQuotasMatchPartial STARTED
kafka.server.ClientQuotasRequestTest > testDescribeClientQuotasMatchPartial PASSED
kafka.server.ClientQuotasRequestTest > testAlterClientQuotasRequestValidateOnly STARTED
kafka.server.ClientQuotasRequestTest > testAlterClientQuotasRequestValidateOnly PASSED
kafka.server.ClientQuotasRequestTest > testAlterClientQuotasBadUser STARTED
kafka.server.ClientQuotasRequestTest > testAlterClientQuotasBadUser PASSED
kafka.server.ClientQuotasRequestTest > testAlterClientQuotasEmptyEntity STARTED
kafka.server.ClientQuotasRequestTest > testAlterClientQuotasEmptyEntity PASSED
kafka.server.ClientQuotasRequestTest > testClientQuotasSanitized STARTED
kafka.server.ClientQuotasRequestTest > testClientQuotasSanitized PASSED
kafka.server.ClientQuotasRequestTest > testAlterClientQuotasBadConfigValue STARTED
kafka.server.ClientQuotasRequestTest > testAlterClientQuotasBadConfigValue PASSED
kafka.server.ClientQuotasRequestTest > testClientQuotasUnsupportedEntityTypes STARTED
kafka.server.ClientQuotasRequestTest > testClientQuotasUnsupportedEntityTypes PASSED
kafka.server.ClientQuotasRequestTest > testAlterClientQuotasBadEntityType STARTED
kafka.server.ClientQuotasRequestTest > testAlterClientQuotasBadEntityType PASSED
kafka.server.ClientQuotasRequestTest > testAlterClientQuotasRequest STARTED
kafka.server.ClientQuotasRequestTest > testAlterClientQuotasRequest PASSED
kafka.server.ClientQuotasRequestTest > testDescribeClientQuotasMatchExact STARTED
kafka.server.ClientQuotasRequestTest > testDescribeClientQuotasMatchExact PASSED
kafka.server.DelayedOperationTest > testRequestPurge STARTED
kafka.server.DelayedOperationTest > testRequestPurge PASSED
kafka.server.DelayedOperationTest > testRequestExpiry STARTED
kafka.server.DelayedOperationTest > testRequestExpiry PASSED
kafka.server.DelayedOperationTest > shouldReturnNilOperationsOnCancelForKeyWhenKeyDoesntExist STARTED
kafka.server.DelayedOperationTest > shouldReturnNilOperationsOnCancelForKeyWhenKeyDoesntExist PASSED
kafka.server.DelayedOperationTest > testDelayedOperationLockOverride STARTED
kafka.server.DelayedOperationTest > testDelayedOperationLockOverride PASSED
kafka.server.DelayedOperationTest > testTryCompleteLockContention STARTED
kafka.server.DelayedOperationTest > testTryCompleteLockContention PASSED
kafka.server.DelayedOperationTest > testTryCompleteWithMultipleThreads STARTED
kafka.server.DelayedOperationTest > testTryCompleteWithMultipleThreads PASSED
kafka.server.DelayedOperationTest > shouldCancelForKeyReturningCancelledOperations STARTED
kafka.server.DelayedOperationTest > shouldCancelForKeyReturningCancelledOperations PASSED
kafka.server.DelayedOperationTest > testDelayedFuture STARTED
kafka.server.DelayedOperationTest > testDelayedFuture PASSED
kafka.server.DelayedOperationTest > testRequestSatisfaction STARTED
kafka.server.DelayedOperationTest > testRequestSatisfaction PASSED
kafka.server.DelayedOperationTest > testDelayedOperationLock STARTED
kafka.server.DelayedOperationTest > testDelayedOperationLock PASSED
kafka.server.DynamicBrokerReconfigurationTest > testDefaultTopicConfig STARTED
kafka.server.DynamicBrokerReconfigurationTest > testDefaultTopicConfig PASSED
kafka.server.DynamicBrokerReconfigurationTest > testMetricsReporterUpdate STARTED
kafka.server.DynamicBrokerReconfigurationTest > testMetricsReporterUpdate PASSED
kafka.server.DynamicBrokerReconfigurationTest > testAdvertisedListenerUpdate STARTED
kafka.server.DynamicBrokerReconfigurationTest > testAdvertisedListenerUpdate PASSED
kafka.server.DynamicBrokerReconfigurationTest > testConsecutiveConfigChange STARTED
kafka.server.DynamicBrokerReconfigurationTest > testConsecutiveConfigChange PASSED
kafka.server.DynamicBrokerReconfigurationTest > testThreadPoolResize STARTED
kafka.server.DynamicBrokerReconfigurationTest > testThreadPoolResize PASSED
kafka.server.DynamicBrokerReconfigurationTest > testAddRemoveSaslListeners STARTED
kafka.server.DynamicBrokerReconfigurationTest > testAddRemoveSaslListeners PASSED
kafka.server.DynamicBrokerReconfigurationTest > testTrustStoreAlter STARTED
FATAL: command execution failed
java.io.EOFException
at java.io.ObjectInputStream$PeekInputStream.readFully(ObjectInputStream.java:2681)
at java.io.ObjectInputStream$BlockDataInputStream.readShort(ObjectInputStream.java:3156)
at java.io.ObjectInputStream.readStreamHeader(ObjectInputStream.java:862)
at java.io.ObjectInputStream.<init>(ObjectInputStream.java:358)
at hudson.remoting.ObjectInputStreamEx.<init>(ObjectInputStreamEx.java:49)
at hudson.remoting.Command.readFrom(Command.java:140)
at hudson.remoting.Command.readFrom(Command.java:126)
at hudson.remoting.AbstractSynchronousByteArrayCommandTransport.read(AbstractSynchronousByteArrayCommandTransport.java:36)
at hudson.remoting.SynchronousCommandTransport$ReaderThread.run(SynchronousCommandTransport.java:63)
Caused: java.io.IOException: Unexpected termination of the channel
at hudson.remoting.SynchronousCommandTransport$ReaderThread.run(SynchronousCommandTransport.java:77)
Caused: java.io.IOException: Backing channel 'H27' is disconnected.
at hudson.remoting.RemoteInvocationHandler.channelOrFail(RemoteInvocationHandler.java:214)
at hudson.remoting.RemoteInvocationHandler.invoke(RemoteInvocationHandler.java:283)
at com.sun.proxy.$Proxy141.isAlive(Unknown Source)
at hudson.Launcher$RemoteLauncher$ProcImpl.isAlive(Launcher.java:1150)
at hudson.Launcher$RemoteLauncher$ProcImpl.join(Launcher.java:1142)
at hudson.tasks.CommandInterpreter.join(CommandInterpreter.java:155)
at hudson.tasks.CommandInterpreter.perform(CommandInterpreter.java:109)
at hudson.tasks.CommandInterpreter.perform(CommandInterpreter.java:66)
at hudson.tasks.BuildStepMonitor$1.perform(BuildStepMonitor.java:20)
at hudson.model.AbstractBuild$AbstractBuildExecution.perform(AbstractBuild.java:741)
at hudson.model.Build$BuildExecution.build(Build.java:206)
at hudson.model.Build$BuildExecution.doRun(Build.java:163)
at hudson.model.AbstractBuild$AbstractBuildExecution.run(AbstractBuild.java:504)
at hudson.model.Run.execute(Run.java:1815)
at hudson.model.FreeStyleBuild.run(FreeStyleBuild.java:43)
at hudson.model.ResourceController.execute(ResourceController.java:97)
at hudson.model.Executor.run(Executor.java:429)
FATAL: Unable to delete script file /tmp/jenkins6194733928896545487.sh
java.io.EOFException
at java.io.ObjectInputStream$PeekInputStream.readFully(ObjectInputStream.java:2681)
at java.io.ObjectInputStream$BlockDataInputStream.readShort(ObjectInputStream.java:3156)
at java.io.ObjectInputStream.readStreamHeader(ObjectInputStream.java:862)
at java.io.ObjectInputStream.<init>(ObjectInputStream.java:358)
at hudson.remoting.ObjectInputStreamEx.<init>(ObjectInputStreamEx.java:49)
at hudson.remoting.Command.readFrom(Command.java:140)
at hudson.remoting.Command.readFrom(Command.java:126)
at hudson.remoting.AbstractSynchronousByteArrayCommandTransport.read(AbstractSynchronousByteArrayCommandTransport.java:36)
at hudson.remoting.SynchronousCommandTransport$ReaderThread.run(SynchronousCommandTransport.java:63)
Caused: java.io.IOException: Unexpected termination of the channel
at hudson.remoting.SynchronousCommandTransport$ReaderThread.run(SynchronousCommandTransport.java:77)
Caused: hudson.remoting.ChannelClosedException: Channel "unknown": Remote call on H27 failed. The channel is closing down or has closed down
at hudson.remoting.Channel.call(Channel.java:950)
at hudson.FilePath.act(FilePath.java:1072)
at hudson.FilePath.act(FilePath.java:1061)
at hudson.FilePath.delete(FilePath.java:1542)
at hudson.tasks.CommandInterpreter.perform(CommandInterpreter.java:123)
at hudson.tasks.CommandInterpreter.perform(CommandInterpreter.java:66)
at hudson.tasks.BuildStepMonitor$1.perform(BuildStepMonitor.java:20)
at hudson.model.AbstractBuild$AbstractBuildExecution.perform(AbstractBuild.java:741)
at hudson.model.Build$BuildExecution.build(Build.java:206)
at hudson.model.Build$BuildExecution.doRun(Build.java:163)
at hudson.model.AbstractBuild$AbstractBuildExecution.run(AbstractBuild.java:504)
at hudson.model.Run.execute(Run.java:1815)
at hudson.model.FreeStyleBuild.run(FreeStyleBuild.java:43)
at hudson.model.ResourceController.execute(ResourceController.java:97)
at hudson.model.Executor.run(Executor.java:429)
Build step 'Execute shell' marked build as failure
ERROR: Step ?[Deprecated] Publish FindBugs analysis results? failed: no workspace for kafka-trunk-jdk8 #4558
ERROR: Step ?Publish JUnit test result report? failed: no workspace for kafka-trunk-jdk8 #4558
ERROR: H27 is offline; cannot locate JDK 1.8 (latest)
ERROR: H27 is offline; cannot locate Gradle 4.10.3
Setting GRADLE_4_10_3_HOME=/home/jenkins/tools/gradle/4.10.3
Not sending mail to unregistered user noreply@github.com
Build failed in Jenkins: kafka-trunk-jdk8 #4557
Posted by Apache Jenkins Server <je...@builds.apache.org>.
See <https://builds.apache.org/job/kafka-trunk-jdk8/4557/display/redirect?page=changes>
Changes:
[github] MINOR: Added unit tests for ConnectionQuotas (#8650)
[github] MINOR: Deploy VerifiableClient in constructor to avoid test timeouts
------------------------------------------
[...truncated 1.48 MB...]
kafka.server.DelayedOperationTest > testRequestPurge STARTED
kafka.server.DelayedOperationTest > testRequestPurge PASSED
kafka.server.DelayedOperationTest > testRequestExpiry STARTED
kafka.server.DelayedOperationTest > testRequestExpiry PASSED
kafka.server.DelayedOperationTest > shouldReturnNilOperationsOnCancelForKeyWhenKeyDoesntExist STARTED
kafka.server.DelayedOperationTest > shouldReturnNilOperationsOnCancelForKeyWhenKeyDoesntExist PASSED
kafka.server.DelayedOperationTest > testDelayedOperationLockOverride STARTED
kafka.server.DelayedOperationTest > testDelayedOperationLockOverride PASSED
kafka.server.DelayedOperationTest > testTryCompleteLockContention STARTED
kafka.server.DelayedOperationTest > testTryCompleteLockContention PASSED
kafka.server.DelayedOperationTest > testTryCompleteWithMultipleThreads STARTED
kafka.server.DelayedOperationTest > testTryCompleteWithMultipleThreads PASSED
kafka.server.DelayedOperationTest > shouldCancelForKeyReturningCancelledOperations STARTED
kafka.server.DelayedOperationTest > shouldCancelForKeyReturningCancelledOperations PASSED
kafka.server.DelayedOperationTest > testDelayedFuture STARTED
kafka.server.DelayedOperationTest > testDelayedFuture PASSED
kafka.server.DelayedOperationTest > testRequestSatisfaction STARTED
kafka.server.DelayedOperationTest > testRequestSatisfaction PASSED
kafka.server.DelayedOperationTest > testDelayedOperationLock STARTED
kafka.server.DelayedOperationTest > testDelayedOperationLock PASSED
kafka.server.ReplicaManagerTest > testStopReplicaWithDeletePartitionAndExistingPartitionAndOlderLeaderEpoch STARTED
kafka.server.ReplicaManagerTest > testStopReplicaWithDeletePartitionAndExistingPartitionAndOlderLeaderEpoch PASSED
kafka.server.ReplicaManagerTest > testStopReplicaWithDeletePartitionAndExistingPartitionAndEqualLeaderEpoch STARTED
kafka.server.ReplicaManagerTest > testStopReplicaWithDeletePartitionAndExistingPartitionAndEqualLeaderEpoch PASSED
kafka.server.ReplicaManagerTest > testStopReplicaWithExistingPartitionAndDeleteSentinel STARTED
kafka.log.LogTest > testCorruptIndexRebuild PASSED
kafka.log.LogTest > shouldDeleteTimeBasedSegmentsReadyToBeDeleted STARTED
kafka.server.ReplicaManagerTest > testStopReplicaWithExistingPartitionAndDeleteSentinel PASSED
kafka.server.ReplicaManagerTest > testPreferredReplicaAsLeader STARTED
kafka.server.ReplicaManagerTest > testPreferredReplicaAsLeader PASSED
kafka.server.ReplicaManagerTest > testFetchRequestRateMetrics STARTED
kafka.server.ReplicaManagerTest > testFetchRequestRateMetrics PASSED
kafka.server.ReplicaManagerTest > testReplicaSelector STARTED
kafka.server.ReplicaManagerTest > testReplicaSelector PASSED
kafka.server.ReplicaManagerTest > testFetchBeyondHighWatermark STARTED
kafka.log.LogTest > shouldDeleteTimeBasedSegmentsReadyToBeDeleted PASSED
kafka.log.LogTest > testReadWithTooSmallMaxLength STARTED
kafka.server.ReplicaManagerTest > testFetchBeyondHighWatermark PASSED
kafka.server.ReplicaManagerTest > testStopReplicaWithStaleControllerEpoch STARTED
kafka.server.ReplicaManagerTest > testStopReplicaWithStaleControllerEpoch PASSED
kafka.server.ReplicaManagerTest > testHighWaterMarkDirectoryMapping STARTED
kafka.server.ReplicaManagerTest > testHighWaterMarkDirectoryMapping PASSED
kafka.server.ReplicaManagerTest > testBecomeFollowerWhenLeaderIsUnchangedButMissedLeaderUpdate STARTED
kafka.server.ReplicaManagerTest > testBecomeFollowerWhenLeaderIsUnchangedButMissedLeaderUpdate PASSED
kafka.server.ReplicaManagerTest > testFollowerStateNotUpdatedIfLogReadFails STARTED
kafka.server.ReplicaManagerTest > testFollowerStateNotUpdatedIfLogReadFails PASSED
kafka.server.ReplicaManagerTest > testStopReplicaWithExistingPartitionAndNewerLeaderEpoch STARTED
kafka.server.ReplicaManagerTest > testStopReplicaWithExistingPartitionAndNewerLeaderEpoch PASSED
kafka.server.ReplicaManagerTest > testFencedErrorCausedByBecomeLeader STARTED
kafka.server.ReplicaManagerTest > testFencedErrorCausedByBecomeLeader PASSED
kafka.server.ReplicaManagerTest > testClearFetchPurgatoryOnStopReplica STARTED
kafka.server.ReplicaManagerTest > testClearFetchPurgatoryOnStopReplica PASSED
kafka.server.ReplicaManagerTest > testStopReplicaWithInexistentPartitionAndPartitionsDelete STARTED
kafka.server.ReplicaManagerTest > testStopReplicaWithInexistentPartitionAndPartitionsDelete PASSED
kafka.server.ReplicaManagerTest > testFetchFromLeaderAlwaysAllowed STARTED
kafka.server.ReplicaManagerTest > testFetchFromLeaderAlwaysAllowed PASSED
kafka.server.ReplicaManagerTest > testFetchMessagesWhenNotFollowerForOnePartition STARTED
kafka.server.ReplicaManagerTest > testFetchMessagesWhenNotFollowerForOnePartition PASSED
kafka.server.ReplicaManagerTest > testIllegalRequiredAcks STARTED
kafka.server.ReplicaManagerTest > testIllegalRequiredAcks PASSED
kafka.server.ReplicaManagerTest > testStopReplicaWithInexistentPartitionAndPartitionsDeleteAndIOException STARTED
kafka.server.ReplicaManagerTest > testStopReplicaWithInexistentPartitionAndPartitionsDeleteAndIOException PASSED
kafka.server.ReplicaManagerTest > testStopReplicaWithDeletePartitionAndExistingPartitionAndNewerLeaderEpoch STARTED
kafka.server.ReplicaManagerTest > testStopReplicaWithDeletePartitionAndExistingPartitionAndNewerLeaderEpoch PASSED
kafka.server.ReplicaManagerTest > testClearPurgatoryOnBecomingFollower STARTED
kafka.log.LogTest > testReadWithTooSmallMaxLength PASSED
kafka.log.LogTest > testOverCompactedLogRecovery STARTED
kafka.log.LogTest > testOverCompactedLogRecovery PASSED
kafka.log.LogTest > testBogusIndexSegmentsAreRemoved STARTED
kafka.log.LogTest > testBogusIndexSegmentsAreRemoved PASSED
kafka.log.LogTest > testMetricsRemovedOnLogDeletion STARTED
kafka.log.LogTest > testMetricsRemovedOnLogDeletion PASSED
kafka.log.LogTest > testLeaderEpochCacheClearedAfterStaticMessageFormatDowngrade STARTED
kafka.log.LogTest > testLeaderEpochCacheClearedAfterStaticMessageFormatDowngrade PASSED
kafka.log.LogTest > testCompressedMessages STARTED
kafka.log.LogTest > testCompressedMessages PASSED
kafka.log.LogTest > testAppendMessageWithNullPayload STARTED
kafka.log.LogTest > testAppendMessageWithNullPayload PASSED
kafka.log.LogTest > testCorruptLog STARTED
kafka.server.ReplicaManagerTest > testClearPurgatoryOnBecomingFollower PASSED
kafka.server.ReplicaManagerTest > testFetchFollowerNotAllowedForOlderClients STARTED
kafka.server.ReplicaManagerTest > testFetchFollowerNotAllowedForOlderClients PASSED
kafka.server.ReplicaManagerTest > testOldLeaderLosesMetricsWhenReassignPartitions STARTED
kafka.server.ReplicaManagerTest > testOldLeaderLosesMetricsWhenReassignPartitions PASSED
kafka.server.ReplicaManagerTest > testClearProducePurgatoryOnStopReplica STARTED
kafka.server.ReplicaManagerTest > testClearProducePurgatoryOnStopReplica PASSED
kafka.server.ReplicaManagerTest > testStopReplicaWithInexistentPartition STARTED
kafka.server.ReplicaManagerTest > testStopReplicaWithInexistentPartition PASSED
kafka.server.ReplicaManagerTest > testHighwaterMarkRelativeDirectoryMapping STARTED
kafka.server.ReplicaManagerTest > testHighwaterMarkRelativeDirectoryMapping PASSED
kafka.server.ReplicaManagerTest > testOldFollowerLosesMetricsWhenReassignPartitions STARTED
FATAL: command execution failed
java.io.EOFException
at java.io.ObjectInputStream$PeekInputStream.readFully(ObjectInputStream.java:2681)
at java.io.ObjectInputStream$BlockDataInputStream.readShort(ObjectInputStream.java:3156)
at java.io.ObjectInputStream.readStreamHeader(ObjectInputStream.java:862)
at java.io.ObjectInputStream.<init>(ObjectInputStream.java:358)
at hudson.remoting.ObjectInputStreamEx.<init>(ObjectInputStreamEx.java:49)
at hudson.remoting.Command.readFrom(Command.java:140)
at hudson.remoting.Command.readFrom(Command.java:126)
at hudson.remoting.AbstractSynchronousByteArrayCommandTransport.read(AbstractSynchronousByteArrayCommandTransport.java:36)
at hudson.remoting.SynchronousCommandTransport$ReaderThread.run(SynchronousCommandTransport.java:63)
Caused: java.io.IOException: Unexpected termination of the channel
at hudson.remoting.SynchronousCommandTransport$ReaderThread.run(SynchronousCommandTransport.java:77)
Caused: java.io.IOException: Backing channel 'H42' is disconnected.
at hudson.remoting.RemoteInvocationHandler.channelOrFail(RemoteInvocationHandler.java:214)
at hudson.remoting.RemoteInvocationHandler.invoke(RemoteInvocationHandler.java:283)
at com.sun.proxy.$Proxy141.isAlive(Unknown Source)
at hudson.Launcher$RemoteLauncher$ProcImpl.isAlive(Launcher.java:1150)
at hudson.Launcher$RemoteLauncher$ProcImpl.join(Launcher.java:1142)
at hudson.tasks.CommandInterpreter.join(CommandInterpreter.java:155)
at hudson.tasks.CommandInterpreter.perform(CommandInterpreter.java:109)
at hudson.tasks.CommandInterpreter.perform(CommandInterpreter.java:66)
at hudson.tasks.BuildStepMonitor$1.perform(BuildStepMonitor.java:20)
at hudson.model.AbstractBuild$AbstractBuildExecution.perform(AbstractBuild.java:741)
at hudson.model.Build$BuildExecution.build(Build.java:206)
at hudson.model.Build$BuildExecution.doRun(Build.java:163)
at hudson.model.AbstractBuild$AbstractBuildExecution.run(AbstractBuild.java:504)
at hudson.model.Run.execute(Run.java:1815)
at hudson.model.FreeStyleBuild.run(FreeStyleBuild.java:43)
at hudson.model.ResourceController.execute(ResourceController.java:97)
at hudson.model.Executor.run(Executor.java:429)
FATAL: Unable to delete script file /tmp/jenkins4298854914049948747.sh
java.io.EOFException
at java.io.ObjectInputStream$PeekInputStream.readFully(ObjectInputStream.java:2681)
at java.io.ObjectInputStream$BlockDataInputStream.readShort(ObjectInputStream.java:3156)
at java.io.ObjectInputStream.readStreamHeader(ObjectInputStream.java:862)
at java.io.ObjectInputStream.<init>(ObjectInputStream.java:358)
at hudson.remoting.ObjectInputStreamEx.<init>(ObjectInputStreamEx.java:49)
at hudson.remoting.Command.readFrom(Command.java:140)
at hudson.remoting.Command.readFrom(Command.java:126)
at hudson.remoting.AbstractSynchronousByteArrayCommandTransport.read(AbstractSynchronousByteArrayCommandTransport.java:36)
at hudson.remoting.SynchronousCommandTransport$ReaderThread.run(SynchronousCommandTransport.java:63)
Caused: java.io.IOException: Unexpected termination of the channel
at hudson.remoting.SynchronousCommandTransport$ReaderThread.run(SynchronousCommandTransport.java:77)
Caused: hudson.remoting.ChannelClosedException: Channel "unknown": Remote call on H42 failed. The channel is closing down or has closed down
at hudson.remoting.Channel.call(Channel.java:950)
at hudson.FilePath.act(FilePath.java:1072)
at hudson.FilePath.act(FilePath.java:1061)
at hudson.FilePath.delete(FilePath.java:1542)
at hudson.tasks.CommandInterpreter.perform(CommandInterpreter.java:123)
at hudson.tasks.CommandInterpreter.perform(CommandInterpreter.java:66)
at hudson.tasks.BuildStepMonitor$1.perform(BuildStepMonitor.java:20)
at hudson.model.AbstractBuild$AbstractBuildExecution.perform(AbstractBuild.java:741)
at hudson.model.Build$BuildExecution.build(Build.java:206)
at hudson.model.Build$BuildExecution.doRun(Build.java:163)
at hudson.model.AbstractBuild$AbstractBuildExecution.run(AbstractBuild.java:504)
at hudson.model.Run.execute(Run.java:1815)
at hudson.model.FreeStyleBuild.run(FreeStyleBuild.java:43)
at hudson.model.ResourceController.execute(ResourceController.java:97)
at hudson.model.Executor.run(Executor.java:429)
Build step 'Execute shell' marked build as failure
ERROR: Step ?[Deprecated] Publish FindBugs analysis results? failed: no workspace for kafka-trunk-jdk8 #4557
ERROR: Step ?Publish JUnit test result report? failed: no workspace for kafka-trunk-jdk8 #4557
ERROR: H42 is offline; cannot locate JDK 1.8 (latest)
ERROR: H42 is offline; cannot locate Gradle 4.10.3
Setting GRADLE_4_10_3_HOME=/home/jenkins/tools/gradle/4.10.3
Not sending mail to unregistered user noreply@github.com
Build failed in Jenkins: kafka-trunk-jdk8 #4556
Posted by Apache Jenkins Server <je...@builds.apache.org>.
See <https://builds.apache.org/job/kafka-trunk-jdk8/4556/display/redirect?page=changes>
Changes:
[github] MINOR: Correct MirrorMaker2 integration test configs for Connect
------------------------------------------
[...truncated 1.44 MB...]
kafka.api.PlaintextAdminIntegrationTest > testAlterReplicaLogDirs STARTED
kafka.api.PlaintextAdminIntegrationTest > testAlterReplicaLogDirs PASSED
kafka.api.PlaintextAdminIntegrationTest > testLogStartOffsetCheckpoint STARTED
kafka.api.SaslGssapiSslEndToEndAuthorizationTest > testNoGroupAcl PASSED
kafka.api.SaslGssapiSslEndToEndAuthorizationTest > testNoProduceWithDescribeAcl STARTED
kafka.api.PlaintextAdminIntegrationTest > testLogStartOffsetCheckpoint PASSED
kafka.api.PlaintextAdminIntegrationTest > testAlterConfigsForLog4jLogLevelsDoesNotWork STARTED
kafka.api.PlaintextAdminIntegrationTest > testAlterConfigsForLog4jLogLevelsDoesNotWork SKIPPED
kafka.api.PlaintextAdminIntegrationTest > testAclOperations STARTED
kafka.api.PlaintextAdminIntegrationTest > testAclOperations PASSED
kafka.api.PlaintextAdminIntegrationTest > testDescribeCluster STARTED
kafka.api.PlaintextAdminIntegrationTest > testDescribeCluster PASSED
kafka.api.PlaintextAdminIntegrationTest > testElectUncleanLeadersForManyPartitions STARTED
kafka.api.SaslGssapiSslEndToEndAuthorizationTest > testNoProduceWithDescribeAcl PASSED
kafka.api.SaslGssapiSslEndToEndAuthorizationTest > testNoDescribeProduceOrConsumeWithoutTopicDescribeAcl STARTED
kafka.api.PlaintextAdminIntegrationTest > testElectUncleanLeadersForManyPartitions PASSED
kafka.api.PlaintextAdminIntegrationTest > testElectUncleanLeadersForUnknownPartitions STARTED
kafka.api.PlaintextAdminIntegrationTest > testElectUncleanLeadersForUnknownPartitions PASSED
kafka.api.PlaintextAdminIntegrationTest > testCreatePartitions STARTED
kafka.api.PlaintextAdminIntegrationTest > testCreatePartitions PASSED
kafka.api.PlaintextAdminIntegrationTest > testDescribeNonExistingTopic STARTED
kafka.api.PlaintextAdminIntegrationTest > testDescribeNonExistingTopic PASSED
kafka.api.PlaintextAdminIntegrationTest > testMetadataRefresh STARTED
kafka.api.PlaintextAdminIntegrationTest > testMetadataRefresh PASSED
kafka.api.PlaintextAdminIntegrationTest > testDescribeAndAlterConfigs STARTED
kafka.api.SaslGssapiSslEndToEndAuthorizationTest > testNoDescribeProduceOrConsumeWithoutTopicDescribeAcl PASSED
kafka.api.SaslGssapiSslEndToEndAuthorizationTest > testProduceConsumeViaSubscribe STARTED
kafka.api.PlaintextAdminIntegrationTest > testDescribeAndAlterConfigs PASSED
kafka.api.PlaintextAdminIntegrationTest > testElectUncleanLeadersForAllPartitions STARTED
kafka.api.PlaintextAdminIntegrationTest > testElectUncleanLeadersForAllPartitions PASSED
kafka.api.PlaintextAdminIntegrationTest > testLogStartOffsetAfterDeleteRecords STARTED
kafka.api.PlaintextAdminIntegrationTest > testLogStartOffsetAfterDeleteRecords PASSED
kafka.api.PlaintextAdminIntegrationTest > testElectUncleanLeadersForOnePartition STARTED
kafka.api.PlaintextAdminIntegrationTest > testElectUncleanLeadersForOnePartition PASSED
kafka.api.PlaintextAdminIntegrationTest > testValidIncrementalAlterConfigs STARTED
kafka.api.PlaintextAdminIntegrationTest > testValidIncrementalAlterConfigs PASSED
kafka.api.PlaintextAdminIntegrationTest > testInvalidIncrementalAlterConfigs STARTED
kafka.api.SaslGssapiSslEndToEndAuthorizationTest > testProduceConsumeViaSubscribe PASSED
kafka.api.SslProducerSendTest > testSendNonCompressedMessageWithCreateTime STARTED
kafka.api.PlaintextAdminIntegrationTest > testInvalidIncrementalAlterConfigs PASSED
kafka.api.PlaintextAdminIntegrationTest > testSeekAfterDeleteRecords STARTED
kafka.api.SslProducerSendTest > testSendNonCompressedMessageWithCreateTime PASSED
kafka.api.SslProducerSendTest > testClose STARTED
kafka.api.SslProducerSendTest > testClose PASSED
kafka.api.SslProducerSendTest > testFlush STARTED
kafka.api.PlaintextAdminIntegrationTest > testSeekAfterDeleteRecords PASSED
kafka.api.PlaintextAdminIntegrationTest > testCallInFlightTimeouts STARTED
kafka.api.PlaintextAdminIntegrationTest > testCallInFlightTimeouts PASSED
kafka.api.PlaintextAdminIntegrationTest > testNullConfigs STARTED
kafka.api.SslProducerSendTest > testFlush PASSED
kafka.api.SslProducerSendTest > testSendToPartition STARTED
kafka.api.SslProducerSendTest > testSendToPartition PASSED
kafka.api.SslProducerSendTest > testSendOffset STARTED
kafka.api.PlaintextAdminIntegrationTest > testNullConfigs PASSED
kafka.api.PlaintextAdminIntegrationTest > testDescribeConfigsForTopic STARTED
kafka.api.SslProducerSendTest > testSendOffset PASSED
kafka.api.SslProducerSendTest > testSendCompressedMessageWithCreateTime STARTED
kafka.api.PlaintextAdminIntegrationTest > testDescribeConfigsForTopic PASSED
kafka.api.PlaintextAdminIntegrationTest > testConsumerGroups STARTED
kafka.api.PlaintextAdminIntegrationTest > testConsumerGroups PASSED
kafka.api.PlaintextAdminIntegrationTest > testElectUncleanLeadersWhenNoLiveBrokers STARTED
kafka.api.SslProducerSendTest > testSendCompressedMessageWithCreateTime PASSED
kafka.api.SslProducerSendTest > testCloseWithZeroTimeoutFromCallerThread STARTED
kafka.api.PlaintextAdminIntegrationTest > testElectUncleanLeadersWhenNoLiveBrokers PASSED
kafka.api.PlaintextAdminIntegrationTest > testCreateExistingTopicsThrowTopicExistsException STARTED
kafka.api.PlaintextAdminIntegrationTest > testCreateExistingTopicsThrowTopicExistsException PASSED
kafka.api.PlaintextAdminIntegrationTest > testCreateDeleteTopics STARTED
kafka.api.PlaintextAdminIntegrationTest > testCreateDeleteTopics PASSED
kafka.api.PlaintextAdminIntegrationTest > testAuthorizedOperations STARTED
kafka.api.SslProducerSendTest > testCloseWithZeroTimeoutFromCallerThread PASSED
kafka.api.SslProducerSendTest > testCloseWithZeroTimeoutFromSenderThread STARTED
kafka.api.PlaintextAdminIntegrationTest > testAuthorizedOperations PASSED
kafka.api.GroupEndToEndAuthorizationTest > testTwoConsumersWithDifferentSaslCredentials STARTED
kafka.api.GroupEndToEndAuthorizationTest > testTwoConsumersWithDifferentSaslCredentials PASSED
kafka.api.GroupEndToEndAuthorizationTest > testNoConsumeWithoutDescribeAclViaSubscribe STARTED
kafka.api.GroupEndToEndAuthorizationTest > testNoConsumeWithoutDescribeAclViaSubscribe PASSED
kafka.api.GroupEndToEndAuthorizationTest > testProduceConsumeWithPrefixedAcls STARTED
kafka.api.SslProducerSendTest > testCloseWithZeroTimeoutFromSenderThread PASSED
kafka.api.SslProducerSendTest > testSendBeforeAndAfterPartitionExpansion STARTED
kafka.api.GroupEndToEndAuthorizationTest > testProduceConsumeWithPrefixedAcls PASSED
kafka.api.GroupEndToEndAuthorizationTest > testProduceConsumeViaAssign STARTED
kafka.api.GroupEndToEndAuthorizationTest > testProduceConsumeViaAssign PASSED
kafka.api.GroupEndToEndAuthorizationTest > testNoConsumeWithDescribeAclViaAssign STARTED
kafka.api.SslProducerSendTest > testSendBeforeAndAfterPartitionExpansion PASSED
kafka.api.UserQuotaTest > testProducerConsumerOverrideLowerQuota STARTED
kafka.api.GroupEndToEndAuthorizationTest > testNoConsumeWithDescribeAclViaAssign PASSED
kafka.api.GroupEndToEndAuthorizationTest > testProduceConsumeTopicAutoCreateTopicCreateAcl STARTED
kafka.api.GroupEndToEndAuthorizationTest > testProduceConsumeTopicAutoCreateTopicCreateAcl PASSED
kafka.api.GroupEndToEndAuthorizationTest > testProduceConsumeWithWildcardAcls STARTED
kafka.api.GroupEndToEndAuthorizationTest > testProduceConsumeWithWildcardAcls PASSED
kafka.api.GroupEndToEndAuthorizationTest > testNoConsumeWithDescribeAclViaSubscribe STARTED
FATAL: command execution failed
java.io.EOFException
at java.io.ObjectInputStream$PeekInputStream.readFully(ObjectInputStream.java:2681)
at java.io.ObjectInputStream$BlockDataInputStream.readShort(ObjectInputStream.java:3156)
at java.io.ObjectInputStream.readStreamHeader(ObjectInputStream.java:862)
at java.io.ObjectInputStream.<init>(ObjectInputStream.java:358)
at hudson.remoting.ObjectInputStreamEx.<init>(ObjectInputStreamEx.java:49)
at hudson.remoting.Command.readFrom(Command.java:140)
at hudson.remoting.Command.readFrom(Command.java:126)
at hudson.remoting.AbstractSynchronousByteArrayCommandTransport.read(AbstractSynchronousByteArrayCommandTransport.java:36)
at hudson.remoting.SynchronousCommandTransport$ReaderThread.run(SynchronousCommandTransport.java:63)
Caused: java.io.IOException: Unexpected termination of the channel
at hudson.remoting.SynchronousCommandTransport$ReaderThread.run(SynchronousCommandTransport.java:77)
Caused: hudson.remoting.ChannelClosedException: Channel "unknown": Remote call on H44 failed. The channel is closing down or has closed down
at hudson.remoting.Channel.call(Channel.java:950)
at hudson.remoting.RemoteInvocationHandler.invoke(RemoteInvocationHandler.java:283)
at com.sun.proxy.$Proxy141.isAlive(Unknown Source)
at hudson.Launcher$RemoteLauncher$ProcImpl.isAlive(Launcher.java:1150)
at hudson.Launcher$RemoteLauncher$ProcImpl.join(Launcher.java:1142)
at hudson.tasks.CommandInterpreter.join(CommandInterpreter.java:155)
at hudson.tasks.CommandInterpreter.perform(CommandInterpreter.java:109)
at hudson.tasks.CommandInterpreter.perform(CommandInterpreter.java:66)
at hudson.tasks.BuildStepMonitor$1.perform(BuildStepMonitor.java:20)
at hudson.model.AbstractBuild$AbstractBuildExecution.perform(AbstractBuild.java:741)
at hudson.model.Build$BuildExecution.build(Build.java:206)
at hudson.model.Build$BuildExecution.doRun(Build.java:163)
at hudson.model.AbstractBuild$AbstractBuildExecution.run(AbstractBuild.java:504)
at hudson.model.Run.execute(Run.java:1815)
at hudson.model.FreeStyleBuild.run(FreeStyleBuild.java:43)
at hudson.model.ResourceController.execute(ResourceController.java:97)
at hudson.model.Executor.run(Executor.java:429)
FATAL: Unable to delete script file /tmp/jenkins1816105478045210935.sh
java.io.EOFException
at java.io.ObjectInputStream$PeekInputStream.readFully(ObjectInputStream.java:2681)
at java.io.ObjectInputStream$BlockDataInputStream.readShort(ObjectInputStream.java:3156)
at java.io.ObjectInputStream.readStreamHeader(ObjectInputStream.java:862)
at java.io.ObjectInputStream.<init>(ObjectInputStream.java:358)
at hudson.remoting.ObjectInputStreamEx.<init>(ObjectInputStreamEx.java:49)
at hudson.remoting.Command.readFrom(Command.java:140)
at hudson.remoting.Command.readFrom(Command.java:126)
at hudson.remoting.AbstractSynchronousByteArrayCommandTransport.read(AbstractSynchronousByteArrayCommandTransport.java:36)
at hudson.remoting.SynchronousCommandTransport$ReaderThread.run(SynchronousCommandTransport.java:63)
Caused: java.io.IOException: Unexpected termination of the channel
at hudson.remoting.SynchronousCommandTransport$ReaderThread.run(SynchronousCommandTransport.java:77)
Caused: hudson.remoting.ChannelClosedException: Channel "unknown": Remote call on H44 failed. The channel is closing down or has closed down
at hudson.remoting.Channel.call(Channel.java:950)
at hudson.FilePath.act(FilePath.java:1072)
at hudson.FilePath.act(FilePath.java:1061)
at hudson.FilePath.delete(FilePath.java:1542)
at hudson.tasks.CommandInterpreter.perform(CommandInterpreter.java:123)
at hudson.tasks.CommandInterpreter.perform(CommandInterpreter.java:66)
at hudson.tasks.BuildStepMonitor$1.perform(BuildStepMonitor.java:20)
at hudson.model.AbstractBuild$AbstractBuildExecution.perform(AbstractBuild.java:741)
at hudson.model.Build$BuildExecution.build(Build.java:206)
at hudson.model.Build$BuildExecution.doRun(Build.java:163)
at hudson.model.AbstractBuild$AbstractBuildExecution.run(AbstractBuild.java:504)
at hudson.model.Run.execute(Run.java:1815)
at hudson.model.FreeStyleBuild.run(FreeStyleBuild.java:43)
at hudson.model.ResourceController.execute(ResourceController.java:97)
at hudson.model.Executor.run(Executor.java:429)
Build step 'Execute shell' marked build as failure
ERROR: Step ?[Deprecated] Publish FindBugs analysis results? failed: no workspace for kafka-trunk-jdk8 #4556
ERROR: Step ?Publish JUnit test result report? failed: no workspace for kafka-trunk-jdk8 #4556
ERROR: H44 is offline; cannot locate JDK 1.8 (latest)
ERROR: H44 is offline; cannot locate Gradle 4.10.3
Setting GRADLE_4_10_3_HOME=/home/jenkins/tools/gradle/4.10.3
Not sending mail to unregistered user noreply@github.com
Build failed in Jenkins: kafka-trunk-jdk8 #4555
Posted by Apache Jenkins Server <je...@builds.apache.org>.
See <https://builds.apache.org/job/kafka-trunk-jdk8/4555/display/redirect?page=changes>
Changes:
[github] KAFKA-8869: Remove task configs for deleted connectors from config
[github] KAFKA-9950: Construct new ConfigDef for MirrorTaskConfig before defining
[github] KAFKA-9855 - return cached Structs for Schemas with no fields (#8472)
------------------------------------------
[...truncated 2.08 MB...]
org.apache.kafka.streams.state.internals.ThreadCacheTest > shouldNotBlowUpOnNonExistentKeyWhenDeleting STARTED
org.apache.kafka.streams.state.internals.ThreadCacheTest > shouldNotBlowUpOnNonExistentKeyWhenDeleting PASSED
org.apache.kafka.streams.state.internals.ThreadCacheTest > shouldNotFlushAfterDelete STARTED
org.apache.kafka.streams.state.internals.ThreadCacheTest > shouldNotFlushAfterDelete PASSED
org.apache.kafka.streams.state.internals.ThreadCacheTest > shouldNotForwardCleanEntryOnEviction STARTED
org.apache.kafka.streams.state.internals.ThreadCacheTest > shouldNotForwardCleanEntryOnEviction PASSED
org.apache.kafka.streams.state.internals.ThreadCacheTest > shouldNotBlowUpOnNonExistentNamespaceWhenDeleting STARTED
org.apache.kafka.streams.state.internals.ThreadCacheTest > shouldNotBlowUpOnNonExistentNamespaceWhenDeleting PASSED
org.apache.kafka.streams.state.internals.ThreadCacheTest > cacheOverheadsSmallValues STARTED
org.apache.kafka.streams.state.internals.RocksDBSessionStoreTest > shouldFetchExactKeys PASSED
org.apache.kafka.streams.state.internals.RocksDBSessionStoreTest > shouldFetchExactSession STARTED
org.apache.kafka.streams.state.internals.RocksDBSessionStoreTest > shouldFetchExactSession PASSED
org.apache.kafka.streams.state.internals.RocksDBSessionStoreTest > shouldLogAndMeasureExpiredRecordsWithBuiltInMetricsVersion0100To24 STARTED
org.apache.kafka.streams.state.internals.RocksDBSessionStoreTest > shouldLogAndMeasureExpiredRecordsWithBuiltInMetricsVersion0100To24 PASSED
org.apache.kafka.streams.state.internals.RocksDBSessionStoreTest > shouldRemove STARTED
org.apache.kafka.streams.state.internals.RocksDBSessionStoreTest > shouldRemove PASSED
org.apache.kafka.streams.state.internals.RocksDBSessionStoreTest > shouldFindValuesWithinMergingSessionWindowRange STARTED
org.apache.kafka.streams.state.internals.RocksDBSessionStoreTest > shouldFindValuesWithinMergingSessionWindowRange PASSED
org.apache.kafka.streams.state.internals.RocksDBSessionStoreTest > shouldLogAndMeasureExpiredRecordsWithBuiltInMetricsVersionLatest STARTED
org.apache.kafka.streams.state.internals.ThreadCacheTest > cacheOverheadsSmallValues PASSED
org.apache.kafka.streams.state.internals.ThreadCacheTest > shouldPutIfAbsent STARTED
org.apache.kafka.streams.state.internals.ThreadCacheTest > shouldPutIfAbsent PASSED
org.apache.kafka.streams.state.internals.ThreadCacheTest > shouldReturnFalseIfNoNextKey STARTED
org.apache.kafka.streams.state.internals.ThreadCacheTest > shouldReturnFalseIfNoNextKey PASSED
org.apache.kafka.streams.state.internals.ThreadCacheTest > shouldFlushDirtyEntriesForNamespace STARTED
org.apache.kafka.streams.state.internals.ThreadCacheTest > shouldFlushDirtyEntriesForNamespace PASSED
org.apache.kafka.streams.state.internals.ThreadCacheTest > shouldPeekNextKey STARTED
org.apache.kafka.streams.state.internals.ThreadCacheTest > shouldPeekNextKey PASSED
org.apache.kafka.streams.state.internals.ThreadCacheTest > shouldReturnNullIfKeyIsNull STARTED
org.apache.kafka.streams.state.internals.ThreadCacheTest > shouldReturnNullIfKeyIsNull PASSED
org.apache.kafka.streams.state.internals.ThreadCacheTest > shouldNotFlushCleanEntriesForNamespace STARTED
org.apache.kafka.streams.state.internals.ThreadCacheTest > shouldNotFlushCleanEntriesForNamespace PASSED
org.apache.kafka.streams.state.internals.ThreadCacheTest > shouldEvictAfterPutIfAbsent STARTED
org.apache.kafka.streams.state.internals.ThreadCacheTest > shouldEvictAfterPutIfAbsent PASSED
org.apache.kafka.streams.state.internals.ThreadCacheTest > shouldEvictAfterPutAll STARTED
org.apache.kafka.streams.state.internals.ThreadCacheTest > shouldEvictAfterPutAll PASSED
org.apache.kafka.streams.state.internals.ThreadCacheTest > shouldEvictImmediatelyIfCacheSizeIsVerySmall STARTED
org.apache.kafka.streams.state.internals.ThreadCacheTest > shouldEvictImmediatelyIfCacheSizeIsVerySmall PASSED
org.apache.kafka.streams.state.internals.MergedSortedCacheKeyValueBytesStoreIteratorTest > shouldNotHaveNextIfOnlyCacheItemsAndAllDeleted STARTED
org.apache.kafka.streams.state.internals.MergedSortedCacheKeyValueBytesStoreIteratorTest > shouldNotHaveNextIfOnlyCacheItemsAndAllDeleted PASSED
org.apache.kafka.streams.state.internals.MergedSortedCacheKeyValueBytesStoreIteratorTest > shouldNotHaveNextIfAllCachedItemsDeleted STARTED
org.apache.kafka.streams.state.internals.MergedSortedCacheKeyValueBytesStoreIteratorTest > shouldNotHaveNextIfAllCachedItemsDeleted PASSED
org.apache.kafka.streams.state.internals.MergedSortedCacheKeyValueBytesStoreIteratorTest > shouldIterateOverRange STARTED
org.apache.kafka.streams.state.internals.MergedSortedCacheKeyValueBytesStoreIteratorTest > shouldIterateOverRange PASSED
org.apache.kafka.streams.state.internals.MergedSortedCacheKeyValueBytesStoreIteratorTest > shouldIgnoreIfDeletedInCacheButExistsInStore STARTED
org.apache.kafka.streams.state.internals.MergedSortedCacheKeyValueBytesStoreIteratorTest > shouldIgnoreIfDeletedInCacheButExistsInStore PASSED
org.apache.kafka.streams.state.internals.MergedSortedCacheKeyValueBytesStoreIteratorTest > shouldSkipAllDeletedFromCache STARTED
org.apache.kafka.streams.state.internals.MergedSortedCacheKeyValueBytesStoreIteratorTest > shouldSkipAllDeletedFromCache PASSED
org.apache.kafka.streams.state.internals.MergedSortedCacheKeyValueBytesStoreIteratorTest > shouldSkipLargerDeletedCacheValue STARTED
org.apache.kafka.streams.state.internals.MergedSortedCacheKeyValueBytesStoreIteratorTest > shouldSkipLargerDeletedCacheValue PASSED
org.apache.kafka.streams.state.internals.MergedSortedCacheKeyValueBytesStoreIteratorTest > shouldSkipSmallerDeletedCachedValue STARTED
org.apache.kafka.streams.state.internals.MergedSortedCacheKeyValueBytesStoreIteratorTest > shouldSkipSmallerDeletedCachedValue PASSED
org.apache.kafka.streams.state.internals.MergedSortedCacheKeyValueBytesStoreIteratorTest > shouldPeekNextKey STARTED
org.apache.kafka.streams.state.internals.MergedSortedCacheKeyValueBytesStoreIteratorTest > shouldPeekNextKey PASSED
org.apache.kafka.streams.state.internals.CachingKeyValueStoreTest > shouldThrowNullPointerExceptionOnPutAllWithNullKey STARTED
org.apache.kafka.streams.state.internals.RocksDBSessionStoreTest > shouldLogAndMeasureExpiredRecordsWithBuiltInMetricsVersionLatest PASSED
org.apache.kafka.streams.state.internals.RocksDBSessionStoreTest > shouldThrowNullPointerExceptionOnRemoveNullKey STARTED
org.apache.kafka.streams.state.internals.RocksDBSessionStoreTest > shouldThrowNullPointerExceptionOnRemoveNullKey PASSED
org.apache.kafka.streams.state.internals.RocksDBSessionStoreTest > shouldCloseOpenIteratorsWhenStoreIsClosedAndNotThrowInvalidStateStoreExceptionOnHasNext STARTED
org.apache.kafka.streams.state.internals.CachingKeyValueStoreTest > shouldThrowNullPointerExceptionOnPutAllWithNullKey PASSED
org.apache.kafka.streams.state.internals.CachingKeyValueStoreTest > shouldIterateAllStoredItems STARTED
org.apache.kafka.streams.state.internals.CachingKeyValueStoreTest > shouldIterateAllStoredItems PASSED
org.apache.kafka.streams.state.internals.CachingKeyValueStoreTest > shouldDeleteItemsFromCache STARTED
org.apache.kafka.streams.state.internals.RocksDBSessionStoreTest > shouldCloseOpenIteratorsWhenStoreIsClosedAndNotThrowInvalidStateStoreExceptionOnHasNext PASSED
org.apache.kafka.streams.state.internals.RocksDBSessionStoreTest > shouldFetchAllSessionsWithinKeyRange STARTED
org.apache.kafka.streams.state.internals.CachingKeyValueStoreTest > shouldDeleteItemsFromCache PASSED
org.apache.kafka.streams.state.internals.CachingKeyValueStoreTest > shouldNotForwardOldValuesWhenDisabled STARTED
org.apache.kafka.streams.state.internals.CachingKeyValueStoreTest > shouldNotForwardOldValuesWhenDisabled PASSED
org.apache.kafka.streams.state.internals.CachingKeyValueStoreTest > shouldPutAll STARTED
org.apache.kafka.streams.state.internals.RocksDBSessionStoreTest > shouldFetchAllSessionsWithinKeyRange PASSED
org.apache.kafka.streams.state.internals.RocksDBSessionStoreTest > shouldReturnNullOnSessionNotFound STARTED
org.apache.kafka.streams.state.internals.RocksDBSessionStoreTest > shouldReturnNullOnSessionNotFound PASSED
org.apache.kafka.streams.state.internals.RocksDBSessionStoreTest > shouldThrowNullPointerExceptionOnFetchNullFromKey STARTED
org.apache.kafka.streams.state.internals.RocksDBSessionStoreTest > shouldThrowNullPointerExceptionOnFetchNullFromKey PASSED
org.apache.kafka.streams.state.internals.RocksDBSessionStoreTest > shouldNotThrowInvalidRangeExceptionWithNegativeFromKey STARTED
org.apache.kafka.streams.state.internals.RocksDBSessionStoreTest > shouldNotThrowInvalidRangeExceptionWithNegativeFromKey PASSED
org.apache.kafka.streams.state.internals.RocksDBSessionStoreTest > shouldThrowNullPointerExceptionOnFindSessionsNullFromKey STARTED
org.apache.kafka.streams.state.internals.RocksDBSessionStoreTest > shouldThrowNullPointerExceptionOnFindSessionsNullFromKey PASSED
org.apache.kafka.streams.state.internals.RocksDBSessionStoreTest > shouldNotThrowExceptionRemovingNonexistentKey STARTED
org.apache.kafka.streams.state.internals.RocksDBSessionStoreTest > shouldNotThrowExceptionRemovingNonexistentKey PASSED
org.apache.kafka.streams.state.internals.RocksDBSessionStoreTest > shouldFetchAllSessionsWithSameRecordKey STARTED
org.apache.kafka.streams.state.internals.CachingKeyValueStoreTest > shouldPutAll PASSED
org.apache.kafka.streams.state.internals.CachingKeyValueStoreTest > shouldThrowIfTryingToDoRangeQueryOnClosedCachingStore STARTED
org.apache.kafka.streams.state.internals.CachingKeyValueStoreTest > shouldThrowIfTryingToDoRangeQueryOnClosedCachingStore PASSED
org.apache.kafka.streams.state.internals.CachingKeyValueStoreTest > shouldThrowIfTryingToDoGetApproxSizeOnClosedCachingStore STARTED
org.apache.kafka.streams.state.internals.RocksDBSessionStoreTest > shouldFetchAllSessionsWithSameRecordKey PASSED
org.apache.kafka.streams.state.internals.RocksDBSessionStoreTest > shouldThrowNullPointerExceptionOnFetchNullToKey STARTED
org.apache.kafka.streams.state.internals.RocksDBSessionStoreTest > shouldThrowNullPointerExceptionOnFetchNullToKey PASSED
org.apache.kafka.streams.state.internals.RocksDBSessionStoreTest > shouldThrowNullPointerExceptionOnPutNullKey STARTED
org.apache.kafka.streams.state.internals.RocksDBSessionStoreTest > shouldThrowNullPointerExceptionOnPutNullKey PASSED
org.apache.kafka.streams.state.internals.RocksDBSessionStoreTest > shouldFindSessionsToMerge STARTED
FATAL: command execution failed
java.io.EOFException
at java.io.ObjectInputStream$PeekInputStream.readFully(ObjectInputStream.java:2681)
at java.io.ObjectInputStream$BlockDataInputStream.readShort(ObjectInputStream.java:3156)
at java.io.ObjectInputStream.readStreamHeader(ObjectInputStream.java:862)
at java.io.ObjectInputStream.<init>(ObjectInputStream.java:358)
at hudson.remoting.ObjectInputStreamEx.<init>(ObjectInputStreamEx.java:49)
at hudson.remoting.Command.readFrom(Command.java:140)
at hudson.remoting.Command.readFrom(Command.java:126)
at hudson.remoting.AbstractSynchronousByteArrayCommandTransport.read(AbstractSynchronousByteArrayCommandTransport.java:36)
at hudson.remoting.SynchronousCommandTransport$ReaderThread.run(SynchronousCommandTransport.java:63)
Caused: java.io.IOException: Unexpected termination of the channel
at hudson.remoting.SynchronousCommandTransport$ReaderThread.run(SynchronousCommandTransport.java:77)
Caused: java.io.IOException: Backing channel 'H32' is disconnected.
at hudson.remoting.RemoteInvocationHandler.channelOrFail(RemoteInvocationHandler.java:214)
at hudson.remoting.RemoteInvocationHandler.invoke(RemoteInvocationHandler.java:283)
at com.sun.proxy.$Proxy141.isAlive(Unknown Source)
at hudson.Launcher$RemoteLauncher$ProcImpl.isAlive(Launcher.java:1150)
at hudson.Launcher$RemoteLauncher$ProcImpl.join(Launcher.java:1142)
at hudson.tasks.CommandInterpreter.join(CommandInterpreter.java:155)
at hudson.tasks.CommandInterpreter.perform(CommandInterpreter.java:109)
at hudson.tasks.CommandInterpreter.perform(CommandInterpreter.java:66)
at hudson.tasks.BuildStepMonitor$1.perform(BuildStepMonitor.java:20)
at hudson.model.AbstractBuild$AbstractBuildExecution.perform(AbstractBuild.java:741)
at hudson.model.Build$BuildExecution.build(Build.java:206)
at hudson.model.Build$BuildExecution.doRun(Build.java:163)
at hudson.model.AbstractBuild$AbstractBuildExecution.run(AbstractBuild.java:504)
at hudson.model.Run.execute(Run.java:1815)
at hudson.model.FreeStyleBuild.run(FreeStyleBuild.java:43)
at hudson.model.ResourceController.execute(ResourceController.java:97)
at hudson.model.Executor.run(Executor.java:429)
FATAL: Unable to delete script file /tmp/jenkins7019399953311001751.sh
java.io.EOFException
at java.io.ObjectInputStream$PeekInputStream.readFully(ObjectInputStream.java:2681)
at java.io.ObjectInputStream$BlockDataInputStream.readShort(ObjectInputStream.java:3156)
at java.io.ObjectInputStream.readStreamHeader(ObjectInputStream.java:862)
at java.io.ObjectInputStream.<init>(ObjectInputStream.java:358)
at hudson.remoting.ObjectInputStreamEx.<init>(ObjectInputStreamEx.java:49)
at hudson.remoting.Command.readFrom(Command.java:140)
at hudson.remoting.Command.readFrom(Command.java:126)
at hudson.remoting.AbstractSynchronousByteArrayCommandTransport.read(AbstractSynchronousByteArrayCommandTransport.java:36)
at hudson.remoting.SynchronousCommandTransport$ReaderThread.run(SynchronousCommandTransport.java:63)
Caused: java.io.IOException: Unexpected termination of the channel
at hudson.remoting.SynchronousCommandTransport$ReaderThread.run(SynchronousCommandTransport.java:77)
Caused: hudson.remoting.ChannelClosedException: Channel "unknown": Remote call on H32 failed. The channel is closing down or has closed down
at hudson.remoting.Channel.call(Channel.java:950)
at hudson.FilePath.act(FilePath.java:1072)
at hudson.FilePath.act(FilePath.java:1061)
at hudson.FilePath.delete(FilePath.java:1542)
at hudson.tasks.CommandInterpreter.perform(CommandInterpreter.java:123)
at hudson.tasks.CommandInterpreter.perform(CommandInterpreter.java:66)
at hudson.tasks.BuildStepMonitor$1.perform(BuildStepMonitor.java:20)
at hudson.model.AbstractBuild$AbstractBuildExecution.perform(AbstractBuild.java:741)
at hudson.model.Build$BuildExecution.build(Build.java:206)
at hudson.model.Build$BuildExecution.doRun(Build.java:163)
at hudson.model.AbstractBuild$AbstractBuildExecution.run(AbstractBuild.java:504)
at hudson.model.Run.execute(Run.java:1815)
at hudson.model.FreeStyleBuild.run(FreeStyleBuild.java:43)
at hudson.model.ResourceController.execute(ResourceController.java:97)
at hudson.model.Executor.run(Executor.java:429)
Build step 'Execute shell' marked build as failure
ERROR: Step ?[Deprecated] Publish FindBugs analysis results? failed: no workspace for kafka-trunk-jdk8 #4555
ERROR: Step ?Publish JUnit test result report? failed: no workspace for kafka-trunk-jdk8 #4555
ERROR: H32 is offline; cannot locate JDK 1.8 (latest)
ERROR: H32 is offline; cannot locate Gradle 4.10.3
Setting GRADLE_4_10_3_HOME=/home/jenkins/tools/gradle/4.10.3
Not sending mail to unregistered user noreply@github.com
Build failed in Jenkins: kafka-trunk-jdk8 #4554
Posted by Apache Jenkins Server <je...@builds.apache.org>.
See <https://builds.apache.org/job/kafka-trunk-jdk8/4554/display/redirect?page=changes>
Changes:
[github] KAFKA-9409: Supplement immutability of ClusterConfigState class in
------------------------------------------
[...truncated 3.08 MB...]
org.apache.kafka.streams.test.ConsumerRecordFactoryTest > shouldNotAllowToCreateTopicWithNullTopicName STARTED
org.apache.kafka.streams.test.ConsumerRecordFactoryTest > shouldNotAllowToCreateTopicWithNullTopicName PASSED
org.apache.kafka.streams.test.ConsumerRecordFactoryTest > shouldCreateConsumerRecordsFromKeyValuePairsWithCustomTimestampAndIncrementsAndNotAdvanceTime STARTED
org.apache.kafka.streams.test.ConsumerRecordFactoryTest > shouldCreateConsumerRecordsFromKeyValuePairsWithCustomTimestampAndIncrementsAndNotAdvanceTime PASSED
org.apache.kafka.streams.test.ConsumerRecordFactoryTest > shouldCreateNullKeyConsumerRecordWithTimestampWithTimestamp STARTED
org.apache.kafka.streams.test.ConsumerRecordFactoryTest > shouldCreateNullKeyConsumerRecordWithTimestampWithTimestamp PASSED
org.apache.kafka.streams.test.ConsumerRecordFactoryTest > shouldRequireCustomTopicNameIfNotDefaultFactoryTopicNameWithNullKeyAndDefaultTimestamp STARTED
org.apache.kafka.streams.test.ConsumerRecordFactoryTest > shouldRequireCustomTopicNameIfNotDefaultFactoryTopicNameWithNullKeyAndDefaultTimestamp PASSED
org.apache.kafka.streams.test.ConsumerRecordFactoryTest > shouldCreateConsumerRecordsFromKeyValuePairsWithTimestampAndIncrements STARTED
org.apache.kafka.streams.test.ConsumerRecordFactoryTest > shouldCreateConsumerRecordsFromKeyValuePairsWithTimestampAndIncrements PASSED
org.apache.kafka.streams.MockTimeTest > shouldGetNanosAsMillis STARTED
org.apache.kafka.streams.MockTimeTest > shouldGetNanosAsMillis PASSED
org.apache.kafka.streams.MockTimeTest > shouldSetStartTime STARTED
org.apache.kafka.streams.MockTimeTest > shouldSetStartTime PASSED
org.apache.kafka.streams.MockTimeTest > shouldNotAllowNegativeSleep STARTED
org.apache.kafka.streams.MockTimeTest > shouldNotAllowNegativeSleep PASSED
org.apache.kafka.streams.MockTimeTest > shouldAdvanceTimeOnSleep STARTED
org.apache.kafka.streams.MockTimeTest > shouldAdvanceTimeOnSleep PASSED
org.apache.kafka.streams.internals.KeyValueStoreFacadeTest > shouldReturnIsOpen STARTED
org.apache.kafka.streams.internals.KeyValueStoreFacadeTest > shouldReturnIsOpen PASSED
org.apache.kafka.streams.internals.KeyValueStoreFacadeTest > shouldDeleteAndReturnPlainValue STARTED
org.apache.kafka.streams.internals.KeyValueStoreFacadeTest > shouldDeleteAndReturnPlainValue PASSED
org.apache.kafka.streams.internals.KeyValueStoreFacadeTest > shouldReturnName STARTED
org.apache.kafka.streams.internals.KeyValueStoreFacadeTest > shouldReturnName PASSED
org.apache.kafka.streams.internals.KeyValueStoreFacadeTest > shouldPutWithUnknownTimestamp STARTED
org.apache.kafka.streams.internals.KeyValueStoreFacadeTest > shouldPutWithUnknownTimestamp PASSED
org.apache.kafka.streams.internals.KeyValueStoreFacadeTest > shouldPutAllWithUnknownTimestamp STARTED
org.apache.kafka.streams.internals.KeyValueStoreFacadeTest > shouldPutAllWithUnknownTimestamp PASSED
org.apache.kafka.streams.internals.KeyValueStoreFacadeTest > shouldReturnIsPersistent STARTED
org.apache.kafka.streams.internals.KeyValueStoreFacadeTest > shouldReturnIsPersistent PASSED
org.apache.kafka.streams.internals.KeyValueStoreFacadeTest > shouldPutIfAbsentWithUnknownTimestamp STARTED
org.apache.kafka.streams.internals.KeyValueStoreFacadeTest > shouldPutIfAbsentWithUnknownTimestamp PASSED
org.apache.kafka.streams.internals.KeyValueStoreFacadeTest > shouldForwardClose STARTED
org.apache.kafka.streams.internals.KeyValueStoreFacadeTest > shouldForwardClose PASSED
org.apache.kafka.streams.internals.KeyValueStoreFacadeTest > shouldForwardFlush STARTED
org.apache.kafka.streams.internals.KeyValueStoreFacadeTest > shouldForwardFlush PASSED
org.apache.kafka.streams.internals.KeyValueStoreFacadeTest > shouldForwardInit STARTED
org.apache.kafka.streams.internals.KeyValueStoreFacadeTest > shouldForwardInit PASSED
> Task :streams:upgrade-system-tests-0101:processTestResources NO-SOURCE
> Task :streams:upgrade-system-tests-0101:testClasses
> Task :streams:upgrade-system-tests-0101:checkstyleTest
> Task :streams:upgrade-system-tests-0101:spotbugsMain NO-SOURCE
> Task :streams:upgrade-system-tests-0101:test
> Task :streams:upgrade-system-tests-0102:compileJava NO-SOURCE
> Task :streams:upgrade-system-tests-0102:processResources NO-SOURCE
> Task :streams:upgrade-system-tests-0102:classes UP-TO-DATE
> Task :streams:upgrade-system-tests-0102:checkstyleMain NO-SOURCE
> Task :streams:upgrade-system-tests-0102:compileTestJava
> Task :streams:upgrade-system-tests-0102:processTestResources NO-SOURCE
> Task :streams:upgrade-system-tests-0102:testClasses
> Task :streams:upgrade-system-tests-0102:checkstyleTest
> Task :streams:upgrade-system-tests-0102:spotbugsMain NO-SOURCE
> Task :streams:upgrade-system-tests-0102:test
> Task :streams:upgrade-system-tests-0110:compileJava NO-SOURCE
> Task :streams:upgrade-system-tests-0110:processResources NO-SOURCE
> Task :streams:upgrade-system-tests-0110:classes UP-TO-DATE
> Task :streams:upgrade-system-tests-0110:checkstyleMain NO-SOURCE
> Task :streams:upgrade-system-tests-0110:compileTestJava
> Task :streams:upgrade-system-tests-0110:processTestResources NO-SOURCE
> Task :streams:upgrade-system-tests-0110:testClasses
> Task :streams:upgrade-system-tests-0110:checkstyleTest
> Task :streams:upgrade-system-tests-0110:spotbugsMain NO-SOURCE
> Task :streams:upgrade-system-tests-0110:test
> Task :streams:upgrade-system-tests-10:compileJava NO-SOURCE
> Task :streams:upgrade-system-tests-10:processResources NO-SOURCE
> Task :streams:upgrade-system-tests-10:classes UP-TO-DATE
> Task :streams:upgrade-system-tests-10:checkstyleMain NO-SOURCE
> Task :streams:upgrade-system-tests-10:compileTestJava
> Task :streams:upgrade-system-tests-10:processTestResources NO-SOURCE
> Task :streams:upgrade-system-tests-10:testClasses
> Task :streams:upgrade-system-tests-10:checkstyleTest
> Task :streams:upgrade-system-tests-10:spotbugsMain NO-SOURCE
> Task :streams:upgrade-system-tests-10:test
> Task :streams:upgrade-system-tests-11:compileJava NO-SOURCE
> Task :streams:upgrade-system-tests-11:processResources NO-SOURCE
> Task :streams:upgrade-system-tests-11:classes UP-TO-DATE
> Task :streams:upgrade-system-tests-11:checkstyleMain NO-SOURCE
> Task :streams:upgrade-system-tests-11:compileTestJava
> Task :streams:upgrade-system-tests-11:processTestResources NO-SOURCE
> Task :streams:upgrade-system-tests-11:testClasses
> Task :streams:upgrade-system-tests-11:checkstyleTest
> Task :streams:upgrade-system-tests-11:spotbugsMain NO-SOURCE
> Task :streams:upgrade-system-tests-11:test
> Task :streams:upgrade-system-tests-20:compileJava NO-SOURCE
> Task :streams:upgrade-system-tests-20:processResources NO-SOURCE
> Task :streams:upgrade-system-tests-20:classes UP-TO-DATE
> Task :streams:upgrade-system-tests-20:checkstyleMain NO-SOURCE
> Task :streams:upgrade-system-tests-20:compileTestJava
> Task :streams:upgrade-system-tests-20:processTestResources NO-SOURCE
> Task :streams:upgrade-system-tests-20:testClasses
> Task :streams:upgrade-system-tests-20:checkstyleTest
> Task :streams:upgrade-system-tests-20:spotbugsMain NO-SOURCE
> Task :streams:upgrade-system-tests-20:test
> Task :streams:upgrade-system-tests-21:compileJava NO-SOURCE
> Task :streams:upgrade-system-tests-21:processResources NO-SOURCE
> Task :streams:upgrade-system-tests-21:classes UP-TO-DATE
> Task :streams:upgrade-system-tests-21:checkstyleMain NO-SOURCE
> Task :streams:upgrade-system-tests-21:compileTestJava
> Task :streams:upgrade-system-tests-21:processTestResources NO-SOURCE
> Task :streams:upgrade-system-tests-21:testClasses
> Task :streams:upgrade-system-tests-21:checkstyleTest
> Task :streams:upgrade-system-tests-21:spotbugsMain NO-SOURCE
> Task :streams:upgrade-system-tests-21:test
> Task :streams:upgrade-system-tests-22:compileJava NO-SOURCE
> Task :streams:upgrade-system-tests-22:processResources NO-SOURCE
> Task :streams:upgrade-system-tests-22:classes UP-TO-DATE
> Task :streams:upgrade-system-tests-22:checkstyleMain NO-SOURCE
> Task :streams:upgrade-system-tests-22:compileTestJava
> Task :streams:upgrade-system-tests-22:processTestResources NO-SOURCE
> Task :streams:upgrade-system-tests-22:testClasses
> Task :streams:upgrade-system-tests-22:checkstyleTest
> Task :streams:upgrade-system-tests-22:spotbugsMain NO-SOURCE
> Task :streams:upgrade-system-tests-22:test
> Task :streams:upgrade-system-tests-23:compileJava NO-SOURCE
> Task :streams:upgrade-system-tests-23:processResources NO-SOURCE
> Task :streams:upgrade-system-tests-23:classes UP-TO-DATE
> Task :streams:upgrade-system-tests-23:checkstyleMain NO-SOURCE
> Task :streams:upgrade-system-tests-23:compileTestJava
> Task :streams:upgrade-system-tests-23:processTestResources NO-SOURCE
> Task :streams:upgrade-system-tests-23:testClasses
> Task :streams:upgrade-system-tests-23:checkstyleTest
> Task :streams:upgrade-system-tests-23:spotbugsMain NO-SOURCE
> Task :streams:upgrade-system-tests-23:test
> Task :streams:upgrade-system-tests-24:compileJava NO-SOURCE
> Task :streams:upgrade-system-tests-24:processResources NO-SOURCE
> Task :streams:upgrade-system-tests-24:classes UP-TO-DATE
> Task :streams:upgrade-system-tests-24:checkstyleMain NO-SOURCE
> Task :streams:upgrade-system-tests-24:compileTestJava
> Task :streams:upgrade-system-tests-24:processTestResources NO-SOURCE
> Task :streams:upgrade-system-tests-24:testClasses
> Task :streams:upgrade-system-tests-24:checkstyleTest
> Task :streams:upgrade-system-tests-24:spotbugsMain NO-SOURCE
> Task :streams:upgrade-system-tests-24:test
> Task :streams:upgrade-system-tests-25:compileJava NO-SOURCE
> Task :streams:upgrade-system-tests-25:processResources NO-SOURCE
> Task :streams:upgrade-system-tests-25:classes UP-TO-DATE
> Task :streams:upgrade-system-tests-25:checkstyleMain NO-SOURCE
> Task :streams:upgrade-system-tests-25:compileTestJava
> Task :streams:upgrade-system-tests-25:processTestResources NO-SOURCE
> Task :streams:upgrade-system-tests-25:testClasses
> Task :streams:upgrade-system-tests-25:checkstyleTest
> Task :streams:upgrade-system-tests-25:spotbugsMain NO-SOURCE
> Task :streams:upgrade-system-tests-25:test
FAILURE: Build completed with 2 failures.
1: Task failed with an exception.
-----------
* What went wrong:
Execution failed for task ':core:test'.
> There were failing tests. See the report at: file://<https://builds.apache.org/job/kafka-trunk-jdk8/ws/core/build/reports/tests/test/index.html>
* Try:
Run with --stacktrace option to get the stack trace. Run with --info or --debug option to get more log output. Run with --scan to get full insights.
==============================================================================
2: Task failed with an exception.
-----------
* What went wrong:
Execution failed for task ':streams:test'.
> There were failing tests. See the report at: file://<https://builds.apache.org/job/kafka-trunk-jdk8/ws/streams/build/reports/tests/test/index.html>
* Try:
Run with --stacktrace option to get the stack trace. Run with --info or --debug option to get more log output. Run with --scan to get full insights.
==============================================================================
* Get more help at https://help.gradle.org
Deprecated Gradle features were used in this build, making it incompatible with Gradle 7.0.
Use '--warning-mode all' to show the individual deprecation warnings.
See https://docs.gradle.org/6.4.1/userguide/command_line_interface.html#sec:command_line_warnings
BUILD FAILED in 1h 57m 47s
215 actionable tasks: 183 executed, 32 up-to-date
Build step 'Execute shell' marked build as failure
[FINDBUGS] Collecting findbugs analysis files...
Setting GRADLE_4_10_3_HOME=/home/jenkins/tools/gradle/4.10.3
ERROR: Could not install GRADLE_4_10_3_HOME
java.lang.NullPointerException
[FINDBUGS] Searching for all files in <https://builds.apache.org/job/kafka-trunk-jdk8/ws/> that match the pattern **/build/reports/*bugs/*.xml
[FINDBUGS] Parsing 19 files in <https://builds.apache.org/job/kafka-trunk-jdk8/ws/>
[FINDBUGS] Successfully parsed file <https://builds.apache.org/job/kafka-trunk-jdk8/ws/clients/build/reports/spotbugs/main.xml> with 0 unique warnings and 0 duplicates.
[FINDBUGS] Successfully parsed file <https://builds.apache.org/job/kafka-trunk-jdk8/ws/connect/api/build/reports/spotbugs/main.xml> with 0 unique warnings and 0 duplicates.
[FINDBUGS] Successfully parsed file <https://builds.apache.org/job/kafka-trunk-jdk8/ws/connect/basic-auth-extension/build/reports/spotbugs/main.xml> with 0 unique warnings and 0 duplicates.
[FINDBUGS] Successfully parsed file <https://builds.apache.org/job/kafka-trunk-jdk8/ws/connect/file/build/reports/spotbugs/main.xml> with 0 unique warnings and 0 duplicates.
[FINDBUGS] Successfully parsed file <https://builds.apache.org/job/kafka-trunk-jdk8/ws/connect/json/build/reports/spotbugs/main.xml> with 0 unique warnings and 0 duplicates.
[FINDBUGS] Successfully parsed file <https://builds.apache.org/job/kafka-trunk-jdk8/ws/connect/mirror-client/build/reports/spotbugs/main.xml> with 0 unique warnings and 0 duplicates.
[FINDBUGS] Successfully parsed file <https://builds.apache.org/job/kafka-trunk-jdk8/ws/connect/mirror/build/reports/spotbugs/main.xml> with 0 unique warnings and 0 duplicates.
[FINDBUGS] Successfully parsed file <https://builds.apache.org/job/kafka-trunk-jdk8/ws/connect/runtime/build/reports/spotbugs/main.xml> with 0 unique warnings and 0 duplicates.
[FINDBUGS] Successfully parsed file <https://builds.apache.org/job/kafka-trunk-jdk8/ws/connect/transforms/build/reports/spotbugs/main.xml> with 0 unique warnings and 0 duplicates.
[FINDBUGS] Successfully parsed file <https://builds.apache.org/job/kafka-trunk-jdk8/ws/core/build/reports/spotbugs/main.xml> with 0 unique warnings and 0 duplicates.
[FINDBUGS] Successfully parsed file <https://builds.apache.org/job/kafka-trunk-jdk8/ws/examples/build/reports/spotbugs/main.xml> with 0 unique warnings and 0 duplicates.
[FINDBUGS] Successfully parsed file <https://builds.apache.org/job/kafka-trunk-jdk8/ws/generator/build/reports/spotbugs/main.xml> with 0 unique warnings and 0 duplicates.
[FINDBUGS] Successfully parsed file <https://builds.apache.org/job/kafka-trunk-jdk8/ws/jmh-benchmarks/build/reports/spotbugs/main.xml> with 0 unique warnings and 0 duplicates.
[FINDBUGS] Successfully parsed file <https://builds.apache.org/job/kafka-trunk-jdk8/ws/log4j-appender/build/reports/spotbugs/main.xml> with 0 unique warnings and 0 duplicates.
[FINDBUGS] Successfully parsed file <https://builds.apache.org/job/kafka-trunk-jdk8/ws/streams/build/reports/spotbugs/main.xml> with 0 unique warnings and 0 duplicates.
[FINDBUGS] Successfully parsed file <https://builds.apache.org/job/kafka-trunk-jdk8/ws/streams/examples/build/reports/spotbugs/main.xml> with 0 unique warnings and 0 duplicates.
[FINDBUGS] Successfully parsed file <https://builds.apache.org/job/kafka-trunk-jdk8/ws/streams/streams-scala/build/reports/spotbugs/main.xml> with 0 unique warnings and 0 duplicates.
[FINDBUGS] Successfully parsed file <https://builds.apache.org/job/kafka-trunk-jdk8/ws/streams/test-utils/build/reports/spotbugs/main.xml> with 0 unique warnings and 0 duplicates.
[FINDBUGS] Successfully parsed file <https://builds.apache.org/job/kafka-trunk-jdk8/ws/tools/build/reports/spotbugs/main.xml> with 0 unique warnings and 0 duplicates.
Setting GRADLE_4_10_3_HOME=/home/jenkins/tools/gradle/4.10.3
No credentials specified
Setting GRADLE_4_10_3_HOME=/home/jenkins/tools/gradle/4.10.3
<Git Blamer> Using GitBlamer to create author and commit information for all warnings.
<Git Blamer> GIT_COMMIT=59efa12d0c0c098e6f57848bf5a43b459c0563e0, workspace=<https://builds.apache.org/job/kafka-trunk-jdk8/ws/>
[FINDBUGS] Computing warning deltas based on reference build #4543
Recording test results
Setting GRADLE_4_10_3_HOME=/home/jenkins/tools/gradle/4.10.3
Setting GRADLE_4_10_3_HOME=/home/jenkins/tools/gradle/4.10.3
Not sending mail to unregistered user noreply@github.com
Build failed in Jenkins: kafka-trunk-jdk8 #4553
Posted by Apache Jenkins Server <je...@builds.apache.org>.
See <https://builds.apache.org/job/kafka-trunk-jdk8/4553/display/redirect?page=changes>
Changes:
[github] MINOR: Increase gradle daemon’s heap size to 2g (#8700)
------------------------------------------
[...truncated 1.78 MB...]
kafka.server.epoch.EpochDrivenReplicationProtocolAcceptanceTest > shouldNotAllowDivergentLogs STARTED
kafka.server.FetchRequestTest > testBrokerRespectsPartitionsOrderAndSizeLimits PASSED
kafka.server.FetchRequestTest > testZStdCompressedTopic STARTED
kafka.server.FetchRequestTest > testZStdCompressedTopic PASSED
kafka.server.FetchRequestTest > testDownConversionFromBatchedToUnbatchedRespectsOffset STARTED
kafka.server.epoch.EpochDrivenReplicationProtocolAcceptanceTest > shouldNotAllowDivergentLogs PASSED
kafka.server.epoch.EpochDrivenReplicationProtocolAcceptanceTest > logsShouldNotDivergeOnUncleanLeaderElections STARTED
kafka.server.FetchRequestTest > testDownConversionFromBatchedToUnbatchedRespectsOffset PASSED
kafka.server.FetchRequestTest > testFetchRequestV2WithOversizedMessage STARTED
kafka.server.FetchRequestTest > testFetchRequestV2WithOversizedMessage PASSED
kafka.server.FetchRequestTest > testEpochValidationWithinFetchSession STARTED
kafka.server.FetchRequestTest > testEpochValidationWithinFetchSession PASSED
kafka.server.FetchRequestTest > testDownConversionWithConnectionFailure STARTED
kafka.server.epoch.EpochDrivenReplicationProtocolAcceptanceTest > logsShouldNotDivergeOnUncleanLeaderElections PASSED
kafka.server.epoch.OffsetsForLeaderEpochTest > shouldGetEpochsFromReplica STARTED
kafka.server.epoch.OffsetsForLeaderEpochTest > shouldGetEpochsFromReplica PASSED
kafka.server.epoch.OffsetsForLeaderEpochTest > shouldReturnUnknownTopicOrPartitionIfThrown STARTED
kafka.server.epoch.OffsetsForLeaderEpochTest > shouldReturnUnknownTopicOrPartitionIfThrown PASSED
kafka.server.epoch.OffsetsForLeaderEpochTest > shouldReturnNoLeaderForPartitionIfThrown STARTED
kafka.server.epoch.OffsetsForLeaderEpochTest > shouldReturnNoLeaderForPartitionIfThrown PASSED
kafka.server.KafkaMetricReporterClusterIdTest > testClusterIdPresent STARTED
kafka.server.KafkaMetricReporterClusterIdTest > testClusterIdPresent PASSED
kafka.server.ApiVersionsRequestTest > testApiVersionsRequestWithUnsupportedVersion STARTED
kafka.server.ApiVersionsRequestTest > testApiVersionsRequestWithUnsupportedVersion PASSED
kafka.server.ApiVersionsRequestTest > testApiVersionsRequestValidationV0 STARTED
kafka.server.FetchRequestTest > testDownConversionWithConnectionFailure PASSED
kafka.server.FetchRequestTest > testPartitionDataEquals STARTED
kafka.server.ApiVersionsRequestTest > testApiVersionsRequestValidationV0 PASSED
kafka.server.ApiVersionsRequestTest > testApiVersionsRequestValidationV3 STARTED
kafka.server.ApiVersionsRequestTest > testApiVersionsRequestValidationV3 PASSED
kafka.server.ApiVersionsRequestTest > testApiVersionsRequest STARTED
kafka.server.FetchRequestTest > testPartitionDataEquals PASSED
kafka.server.FetchRequestTest > testCurrentEpochValidation STARTED
kafka.server.ApiVersionsRequestTest > testApiVersionsRequest PASSED
kafka.server.ListOffsetsRequestTest > testListOffsetsErrorCodes STARTED
kafka.server.ListOffsetsRequestTest > testListOffsetsErrorCodes PASSED
kafka.server.ListOffsetsRequestTest > testCurrentEpochValidation STARTED
kafka.server.FetchRequestTest > testCurrentEpochValidation PASSED
kafka.server.FetchRequestTest > testCreateIncrementalFetchWithPartitionsInError STARTED
kafka.server.FetchRequestTest > testCreateIncrementalFetchWithPartitionsInError PASSED
kafka.server.FetchRequestTest > testFetchRequestV4WithReadCommitted STARTED
kafka.server.ListOffsetsRequestTest > testCurrentEpochValidation PASSED
kafka.server.ListOffsetsRequestTest > testResponseIncludesLeaderEpoch STARTED
kafka.server.FetchRequestTest > testFetchRequestV4WithReadCommitted PASSED
kafka.api.SaslGssapiSslEndToEndAuthorizationTest > testTwoConsumersWithDifferentSaslCredentials STARTED
kafka.server.ListOffsetsRequestTest > testResponseIncludesLeaderEpoch PASSED
kafka.server.IsrExpirationTest > testIsrExpirationForSlowFollowers STARTED
kafka.server.IsrExpirationTest > testIsrExpirationForSlowFollowers PASSED
kafka.server.IsrExpirationTest > testIsrExpirationForCaughtUpFollowers STARTED
kafka.server.IsrExpirationTest > testIsrExpirationForCaughtUpFollowers PASSED
kafka.server.IsrExpirationTest > testIsrExpirationForStuckFollowers STARTED
kafka.server.IsrExpirationTest > testIsrExpirationForStuckFollowers PASSED
kafka.server.IsrExpirationTest > testIsrExpirationIfNoFetchRequestMade STARTED
kafka.server.IsrExpirationTest > testIsrExpirationIfNoFetchRequestMade PASSED
kafka.api.SslAdminIntegrationTest > testAsynchronousAuthorizerAclUpdatesDontBlockRequestThreads STARTED
kafka.api.SaslGssapiSslEndToEndAuthorizationTest > testTwoConsumersWithDifferentSaslCredentials PASSED
kafka.api.SaslGssapiSslEndToEndAuthorizationTest > testNoConsumeWithoutDescribeAclViaSubscribe STARTED
kafka.api.SslAdminIntegrationTest > testAsynchronousAuthorizerAclUpdatesDontBlockRequestThreads PASSED
kafka.api.SslAdminIntegrationTest > testSynchronousAuthorizerAclUpdatesBlockRequestThreads STARTED
kafka.api.SaslGssapiSslEndToEndAuthorizationTest > testNoConsumeWithoutDescribeAclViaSubscribe PASSED
kafka.api.SaslGssapiSslEndToEndAuthorizationTest > testProduceConsumeWithPrefixedAcls STARTED
kafka.api.SslAdminIntegrationTest > testSynchronousAuthorizerAclUpdatesBlockRequestThreads PASSED
kafka.api.SslAdminIntegrationTest > testAclUpdatesUsingAsynchronousAuthorizer STARTED
kafka.api.SslAdminIntegrationTest > testAclUpdatesUsingAsynchronousAuthorizer PASSED
kafka.api.SslAdminIntegrationTest > testAclUpdatesUsingSynchronousAuthorizer STARTED
kafka.api.SslAdminIntegrationTest > testAclUpdatesUsingSynchronousAuthorizer PASSED
kafka.api.SslAdminIntegrationTest > testAclDescribe STARTED
kafka.api.SaslGssapiSslEndToEndAuthorizationTest > testProduceConsumeWithPrefixedAcls PASSED
kafka.api.SaslGssapiSslEndToEndAuthorizationTest > testProduceConsumeViaAssign STARTED
kafka.api.SslAdminIntegrationTest > testAclDescribe PASSED
kafka.api.SslAdminIntegrationTest > testLegacyAclOpsNeverAffectOrReturnPrefixed STARTED
kafka.api.SslAdminIntegrationTest > testLegacyAclOpsNeverAffectOrReturnPrefixed PASSED
kafka.api.SslAdminIntegrationTest > testCreateTopicsResponseMetadataAndConfig STARTED
kafka.api.SslAdminIntegrationTest > testCreateTopicsResponseMetadataAndConfig PASSED
kafka.api.SslAdminIntegrationTest > testAttemptToCreateInvalidAcls STARTED
kafka.api.SaslGssapiSslEndToEndAuthorizationTest > testProduceConsumeViaAssign PASSED
kafka.api.SaslGssapiSslEndToEndAuthorizationTest > testNoConsumeWithDescribeAclViaAssign STARTED
kafka.api.SslAdminIntegrationTest > testAttemptToCreateInvalidAcls PASSED
kafka.api.SslAdminIntegrationTest > testAclAuthorizationDenied STARTED
kafka.api.SslAdminIntegrationTest > testAclAuthorizationDenied PASSED
kafka.api.SslAdminIntegrationTest > testAclOperations STARTED
kafka.api.SslAdminIntegrationTest > testAclOperations PASSED
kafka.api.SslAdminIntegrationTest > testAclOperations2 STARTED
kafka.api.SslAdminIntegrationTest > testAclOperations2 PASSED
kafka.api.SslAdminIntegrationTest > testAclDelete STARTED
kafka.api.SaslGssapiSslEndToEndAuthorizationTest > testNoConsumeWithDescribeAclViaAssign PASSED
kafka.api.SaslGssapiSslEndToEndAuthorizationTest > testProduceConsumeTopicAutoCreateTopicCreateAcl STARTED
kafka.api.SslAdminIntegrationTest > testAclDelete PASSED
kafka.api.SslAdminIntegrationTest > testCreateDeleteTopics STARTED
kafka.api.SslAdminIntegrationTest > testCreateDeleteTopics PASSED
kafka.api.SslAdminIntegrationTest > testAuthorizedOperations STARTED
FATAL: command execution failed
java.io.EOFException
at java.io.ObjectInputStream$PeekInputStream.readFully(ObjectInputStream.java:2681)
at java.io.ObjectInputStream$BlockDataInputStream.readShort(ObjectInputStream.java:3156)
at java.io.ObjectInputStream.readStreamHeader(ObjectInputStream.java:862)
at java.io.ObjectInputStream.<init>(ObjectInputStream.java:358)
at hudson.remoting.ObjectInputStreamEx.<init>(ObjectInputStreamEx.java:49)
at hudson.remoting.Command.readFrom(Command.java:140)
at hudson.remoting.Command.readFrom(Command.java:126)
at hudson.remoting.AbstractSynchronousByteArrayCommandTransport.read(AbstractSynchronousByteArrayCommandTransport.java:36)
at hudson.remoting.SynchronousCommandTransport$ReaderThread.run(SynchronousCommandTransport.java:63)
Caused: java.io.IOException: Unexpected termination of the channel
at hudson.remoting.SynchronousCommandTransport$ReaderThread.run(SynchronousCommandTransport.java:77)
Caused: hudson.remoting.ChannelClosedException: Channel "unknown": Remote call on H31 failed. The channel is closing down or has closed down
at hudson.remoting.Channel.call(Channel.java:950)
at hudson.remoting.RemoteInvocationHandler.invoke(RemoteInvocationHandler.java:283)
at com.sun.proxy.$Proxy141.isAlive(Unknown Source)
at hudson.Launcher$RemoteLauncher$ProcImpl.isAlive(Launcher.java:1150)
at hudson.Launcher$RemoteLauncher$ProcImpl.join(Launcher.java:1142)
at hudson.tasks.CommandInterpreter.join(CommandInterpreter.java:155)
at hudson.tasks.CommandInterpreter.perform(CommandInterpreter.java:109)
at hudson.tasks.CommandInterpreter.perform(CommandInterpreter.java:66)
at hudson.tasks.BuildStepMonitor$1.perform(BuildStepMonitor.java:20)
at hudson.model.AbstractBuild$AbstractBuildExecution.perform(AbstractBuild.java:741)
at hudson.model.Build$BuildExecution.build(Build.java:206)
at hudson.model.Build$BuildExecution.doRun(Build.java:163)
at hudson.model.AbstractBuild$AbstractBuildExecution.run(AbstractBuild.java:504)
at hudson.model.Run.execute(Run.java:1815)
at hudson.model.FreeStyleBuild.run(FreeStyleBuild.java:43)
at hudson.model.ResourceController.execute(ResourceController.java:97)
at hudson.model.Executor.run(Executor.java:429)
FATAL: Unable to delete script file /tmp/jenkins6743834417884138967.sh
java.io.EOFException
at java.io.ObjectInputStream$PeekInputStream.readFully(ObjectInputStream.java:2681)
at java.io.ObjectInputStream$BlockDataInputStream.readShort(ObjectInputStream.java:3156)
at java.io.ObjectInputStream.readStreamHeader(ObjectInputStream.java:862)
at java.io.ObjectInputStream.<init>(ObjectInputStream.java:358)
at hudson.remoting.ObjectInputStreamEx.<init>(ObjectInputStreamEx.java:49)
at hudson.remoting.Command.readFrom(Command.java:140)
at hudson.remoting.Command.readFrom(Command.java:126)
at hudson.remoting.AbstractSynchronousByteArrayCommandTransport.read(AbstractSynchronousByteArrayCommandTransport.java:36)
at hudson.remoting.SynchronousCommandTransport$ReaderThread.run(SynchronousCommandTransport.java:63)
Caused: java.io.IOException: Unexpected termination of the channel
at hudson.remoting.SynchronousCommandTransport$ReaderThread.run(SynchronousCommandTransport.java:77)
Caused: hudson.remoting.ChannelClosedException: Channel "unknown": Remote call on H31 failed. The channel is closing down or has closed down
at hudson.remoting.Channel.call(Channel.java:950)
at hudson.FilePath.act(FilePath.java:1072)
at hudson.FilePath.act(FilePath.java:1061)
at hudson.FilePath.delete(FilePath.java:1542)
at hudson.tasks.CommandInterpreter.perform(CommandInterpreter.java:123)
at hudson.tasks.CommandInterpreter.perform(CommandInterpreter.java:66)
at hudson.tasks.BuildStepMonitor$1.perform(BuildStepMonitor.java:20)
at hudson.model.AbstractBuild$AbstractBuildExecution.perform(AbstractBuild.java:741)
at hudson.model.Build$BuildExecution.build(Build.java:206)
at hudson.model.Build$BuildExecution.doRun(Build.java:163)
at hudson.model.AbstractBuild$AbstractBuildExecution.run(AbstractBuild.java:504)
at hudson.model.Run.execute(Run.java:1815)
at hudson.model.FreeStyleBuild.run(FreeStyleBuild.java:43)
at hudson.model.ResourceController.execute(ResourceController.java:97)
at hudson.model.Executor.run(Executor.java:429)
Build step 'Execute shell' marked build as failure
ERROR: Step ?[Deprecated] Publish FindBugs analysis results? failed: no workspace for kafka-trunk-jdk8 #4553
ERROR: Step ?Publish JUnit test result report? failed: no workspace for kafka-trunk-jdk8 #4553
ERROR: H31 is offline; cannot locate JDK 1.8 (latest)
ERROR: H31 is offline; cannot locate Gradle 4.10.3
Setting GRADLE_4_10_3_HOME=/home/jenkins/tools/gradle/4.10.3
Not sending mail to unregistered user noreply@github.com
Build failed in Jenkins: kafka-trunk-jdk8 #4552
Posted by Apache Jenkins Server <je...@builds.apache.org>.
See <https://builds.apache.org/job/kafka-trunk-jdk8/4552/display/redirect?page=changes>
Changes:
[github] KAFKA-9603: Do not turn on bulk loading for segmented stores on stand-by
------------------------------------------
[...truncated 1.60 MB...]
kafka.admin.ReassignPartitionsIntegrationTest > testCancellation STARTED
kafka.api.PlaintextAdminIntegrationTest > testDescribeConfigsForTopic PASSED
kafka.api.PlaintextAdminIntegrationTest > testConsumerGroups STARTED
kafka.admin.ReassignPartitionsIntegrationTest > testCancellation PASSED
kafka.admin.ReassignPartitionsIntegrationTest > testThrottledReassignment STARTED
kafka.api.PlaintextAdminIntegrationTest > testConsumerGroups PASSED
kafka.api.PlaintextAdminIntegrationTest > testElectUncleanLeadersWhenNoLiveBrokers STARTED
kafka.admin.ReassignPartitionsIntegrationTest > testThrottledReassignment PASSED
kafka.admin.ReassignPartitionsIntegrationTest > testHighWaterMarkAfterPartitionReassignment STARTED
kafka.api.PlaintextAdminIntegrationTest > testElectUncleanLeadersWhenNoLiveBrokers PASSED
kafka.api.PlaintextAdminIntegrationTest > testCreateExistingTopicsThrowTopicExistsException STARTED
kafka.admin.ReassignPartitionsIntegrationTest > testHighWaterMarkAfterPartitionReassignment PASSED
kafka.admin.ReassignPartitionsIntegrationTest > testReplicaDirectoryMoves STARTED
kafka.api.PlaintextAdminIntegrationTest > testCreateExistingTopicsThrowTopicExistsException PASSED
kafka.api.PlaintextAdminIntegrationTest > testCreateDeleteTopics STARTED
kafka.api.PlaintextAdminIntegrationTest > testCreateDeleteTopics PASSED
kafka.api.PlaintextAdminIntegrationTest > testAuthorizedOperations STARTED
kafka.api.PlaintextAdminIntegrationTest > testAuthorizedOperations PASSED
kafka.api.PlaintextConsumerTest > testEarliestOrLatestOffsets STARTED
kafka.api.PlaintextConsumerTest > testEarliestOrLatestOffsets PASSED
kafka.api.PlaintextConsumerTest > testPartitionsForAutoCreate STARTED
kafka.api.PlaintextConsumerTest > testPartitionsForAutoCreate PASSED
kafka.api.PlaintextConsumerTest > testShrinkingTopicSubscriptions STARTED
kafka.admin.ReassignPartitionsIntegrationTest > testReplicaDirectoryMoves PASSED
kafka.admin.BrokerApiVersionsCommandTest > checkBrokerApiVersionCommandOutput STARTED
kafka.api.PlaintextConsumerTest > testShrinkingTopicSubscriptions PASSED
kafka.api.PlaintextConsumerTest > testMaxPollIntervalMs STARTED
kafka.admin.BrokerApiVersionsCommandTest > checkBrokerApiVersionCommandOutput PASSED
kafka.admin.TopicCommandTest > testIsNotUnderReplicatedWhenAdding STARTED
kafka.admin.TopicCommandTest > testIsNotUnderReplicatedWhenAdding PASSED
kafka.admin.AddPartitionsTest > testReplicaPlacementAllServers STARTED
kafka.admin.AddPartitionsTest > testReplicaPlacementAllServers PASSED
kafka.admin.AddPartitionsTest > testMissingPartition0 STARTED
kafka.api.PlaintextConsumerTest > testMaxPollIntervalMs PASSED
kafka.api.PlaintextConsumerTest > testOffsetsForTimes STARTED
kafka.admin.AddPartitionsTest > testMissingPartition0 PASSED
kafka.admin.AddPartitionsTest > testWrongReplicaCount STARTED
kafka.api.PlaintextConsumerTest > testOffsetsForTimes PASSED
kafka.api.PlaintextConsumerTest > testSubsequentPatternSubscription STARTED
kafka.admin.AddPartitionsTest > testWrongReplicaCount PASSED
kafka.admin.AddPartitionsTest > testReplicaPlacementPartialServers STARTED
kafka.api.PlaintextConsumerTest > testSubsequentPatternSubscription PASSED
kafka.api.PlaintextConsumerTest > testPerPartitionLeadMetricsCleanUpWithAssign STARTED
kafka.admin.AddPartitionsTest > testReplicaPlacementPartialServers PASSED
kafka.admin.AddPartitionsTest > testIncrementPartitions STARTED
kafka.api.PlaintextConsumerTest > testPerPartitionLeadMetricsCleanUpWithAssign PASSED
kafka.api.PlaintextConsumerTest > testConsumeMessagesWithCreateTime STARTED
kafka.admin.AddPartitionsTest > testIncrementPartitions PASSED
kafka.admin.AddPartitionsTest > testManualAssignmentOfReplicas STARTED
kafka.api.PlaintextConsumerTest > testConsumeMessagesWithCreateTime PASSED
kafka.api.PlaintextConsumerTest > testAsyncCommit STARTED
kafka.api.PlaintextConsumerTest > testAsyncCommit PASSED
kafka.api.PlaintextConsumerTest > testLowMaxFetchSizeForRequestAndPartition STARTED
kafka.admin.AddPartitionsTest > testManualAssignmentOfReplicas PASSED
kafka.admin.PreferredReplicaLeaderElectionCommandTest > testBasicPreferredReplicaElection STARTED
kafka.admin.PreferredReplicaLeaderElectionCommandTest > testBasicPreferredReplicaElection PASSED
kafka.admin.PreferredReplicaLeaderElectionCommandTest > testInvalidBrokerGiven STARTED
kafka.admin.PreferredReplicaLeaderElectionCommandTest > testInvalidBrokerGiven PASSED
kafka.admin.PreferredReplicaLeaderElectionCommandTest > testPreferredReplicaJsonData STARTED
kafka.admin.PreferredReplicaLeaderElectionCommandTest > testPreferredReplicaJsonData PASSED
kafka.admin.PreferredReplicaLeaderElectionCommandTest > testTimeout STARTED
kafka.admin.PreferredReplicaLeaderElectionCommandTest > testTimeout PASSED
kafka.admin.PreferredReplicaLeaderElectionCommandTest > testAuthzFailure STARTED
kafka.api.PlaintextConsumerTest > testLowMaxFetchSizeForRequestAndPartition PASSED
kafka.api.PlaintextConsumerTest > testMultiConsumerSessionTimeoutOnStopPolling STARTED
kafka.admin.PreferredReplicaLeaderElectionCommandTest > testAuthzFailure PASSED
kafka.admin.PreferredReplicaLeaderElectionCommandTest > testNoopElection STARTED
kafka.admin.PreferredReplicaLeaderElectionCommandTest > testNoopElection PASSED
kafka.admin.PreferredReplicaLeaderElectionCommandTest > testSingletonPartitionGiven STARTED
kafka.api.PlaintextConsumerTest > testMultiConsumerSessionTimeoutOnStopPolling PASSED
kafka.api.PlaintextConsumerTest > testMaxPollIntervalMsDelayInRevocation STARTED
kafka.api.PlaintextConsumerTest > testMaxPollIntervalMsDelayInRevocation PASSED
kafka.api.PlaintextConsumerTest > testPerPartitionLagMetricsCleanUpWithAssign STARTED
kafka.admin.PreferredReplicaLeaderElectionCommandTest > testSingletonPartitionGiven PASSED
kafka.admin.PreferredReplicaLeaderElectionCommandTest > testMultiplePartitionsSameAssignment STARTED
kafka.api.PlaintextConsumerTest > testPerPartitionLagMetricsCleanUpWithAssign PASSED
kafka.api.PlaintextConsumerTest > testPartitionsForInvalidTopic STARTED
kafka.api.PlaintextConsumerTest > testPartitionsForInvalidTopic PASSED
kafka.api.PlaintextConsumerTest > testMultiConsumerStickyAssignment STARTED
kafka.admin.PreferredReplicaLeaderElectionCommandTest > testMultiplePartitionsSameAssignment PASSED
kafka.admin.PreferredReplicaLeaderElectionCommandTest > testTopicDoesNotExist STARTED
kafka.admin.PreferredReplicaLeaderElectionCommandTest > testTopicDoesNotExist PASSED
kafka.admin.PreferredReplicaLeaderElectionCommandTest > testWithOfflinePreferredReplica STARTED
kafka.api.PlaintextConsumerTest > testMultiConsumerStickyAssignment PASSED
kafka.api.PlaintextConsumerTest > testPauseStateNotPreservedByRebalance STARTED
kafka.api.PlaintextConsumerTest > testPauseStateNotPreservedByRebalance PASSED
kafka.api.PlaintextConsumerTest > testFetchHonoursFetchSizeIfLargeRecordNotFirst STARTED
kafka.admin.PreferredReplicaLeaderElectionCommandTest > testWithOfflinePreferredReplica PASSED
kafka.admin.PreferredReplicaLeaderElectionCommandTest > testNoPartitionsGiven STARTED
kafka.api.PlaintextConsumerTest > testFetchHonoursFetchSizeIfLargeRecordNotFirst PASSED
kafka.api.PlaintextConsumerTest > testSeek STARTED
FATAL: command execution failed
java.io.EOFException
at java.io.ObjectInputStream$PeekInputStream.readFully(ObjectInputStream.java:2681)
at java.io.ObjectInputStream$BlockDataInputStream.readShort(ObjectInputStream.java:3156)
at java.io.ObjectInputStream.readStreamHeader(ObjectInputStream.java:862)
at java.io.ObjectInputStream.<init>(ObjectInputStream.java:358)
at hudson.remoting.ObjectInputStreamEx.<init>(ObjectInputStreamEx.java:49)
at hudson.remoting.Command.readFrom(Command.java:140)
at hudson.remoting.Command.readFrom(Command.java:126)
at hudson.remoting.AbstractSynchronousByteArrayCommandTransport.read(AbstractSynchronousByteArrayCommandTransport.java:36)
at hudson.remoting.SynchronousCommandTransport$ReaderThread.run(SynchronousCommandTransport.java:63)
Caused: java.io.IOException: Unexpected termination of the channel
at hudson.remoting.SynchronousCommandTransport$ReaderThread.run(SynchronousCommandTransport.java:77)
Caused: java.io.IOException: Backing channel 'H29' is disconnected.
at hudson.remoting.RemoteInvocationHandler.channelOrFail(RemoteInvocationHandler.java:214)
at hudson.remoting.RemoteInvocationHandler.invoke(RemoteInvocationHandler.java:283)
at com.sun.proxy.$Proxy141.isAlive(Unknown Source)
at hudson.Launcher$RemoteLauncher$ProcImpl.isAlive(Launcher.java:1150)
at hudson.Launcher$RemoteLauncher$ProcImpl.join(Launcher.java:1142)
at hudson.tasks.CommandInterpreter.join(CommandInterpreter.java:155)
at hudson.tasks.CommandInterpreter.perform(CommandInterpreter.java:109)
at hudson.tasks.CommandInterpreter.perform(CommandInterpreter.java:66)
at hudson.tasks.BuildStepMonitor$1.perform(BuildStepMonitor.java:20)
at hudson.model.AbstractBuild$AbstractBuildExecution.perform(AbstractBuild.java:741)
at hudson.model.Build$BuildExecution.build(Build.java:206)
at hudson.model.Build$BuildExecution.doRun(Build.java:163)
at hudson.model.AbstractBuild$AbstractBuildExecution.run(AbstractBuild.java:504)
at hudson.model.Run.execute(Run.java:1815)
at hudson.model.FreeStyleBuild.run(FreeStyleBuild.java:43)
at hudson.model.ResourceController.execute(ResourceController.java:97)
at hudson.model.Executor.run(Executor.java:429)
FATAL: Unable to delete script file /tmp/jenkins787651977403440752.sh
java.io.EOFException
at java.io.ObjectInputStream$PeekInputStream.readFully(ObjectInputStream.java:2681)
at java.io.ObjectInputStream$BlockDataInputStream.readShort(ObjectInputStream.java:3156)
at java.io.ObjectInputStream.readStreamHeader(ObjectInputStream.java:862)
at java.io.ObjectInputStream.<init>(ObjectInputStream.java:358)
at hudson.remoting.ObjectInputStreamEx.<init>(ObjectInputStreamEx.java:49)
at hudson.remoting.Command.readFrom(Command.java:140)
at hudson.remoting.Command.readFrom(Command.java:126)
at hudson.remoting.AbstractSynchronousByteArrayCommandTransport.read(AbstractSynchronousByteArrayCommandTransport.java:36)
at hudson.remoting.SynchronousCommandTransport$ReaderThread.run(SynchronousCommandTransport.java:63)
Caused: java.io.IOException: Unexpected termination of the channel
at hudson.remoting.SynchronousCommandTransport$ReaderThread.run(SynchronousCommandTransport.java:77)
Caused: hudson.remoting.ChannelClosedException: Channel "unknown": Remote call on H29 failed. The channel is closing down or has closed down
at hudson.remoting.Channel.call(Channel.java:950)
at hudson.FilePath.act(FilePath.java:1072)
at hudson.FilePath.act(FilePath.java:1061)
at hudson.FilePath.delete(FilePath.java:1542)
at hudson.tasks.CommandInterpreter.perform(CommandInterpreter.java:123)
at hudson.tasks.CommandInterpreter.perform(CommandInterpreter.java:66)
at hudson.tasks.BuildStepMonitor$1.perform(BuildStepMonitor.java:20)
at hudson.model.AbstractBuild$AbstractBuildExecution.perform(AbstractBuild.java:741)
at hudson.model.Build$BuildExecution.build(Build.java:206)
at hudson.model.Build$BuildExecution.doRun(Build.java:163)
at hudson.model.AbstractBuild$AbstractBuildExecution.run(AbstractBuild.java:504)
at hudson.model.Run.execute(Run.java:1815)
at hudson.model.FreeStyleBuild.run(FreeStyleBuild.java:43)
at hudson.model.ResourceController.execute(ResourceController.java:97)
at hudson.model.Executor.run(Executor.java:429)
Build step 'Execute shell' marked build as failure
ERROR: Step ?[Deprecated] Publish FindBugs analysis results? failed: no workspace for kafka-trunk-jdk8 #4552
ERROR: Step ?Publish JUnit test result report? failed: no workspace for kafka-trunk-jdk8 #4552
ERROR: H29 is offline; cannot locate JDK 1.8 (latest)
ERROR: H29 is offline; cannot locate Gradle 4.10.3
Setting GRADLE_4_10_3_HOME=/home/jenkins/tools/gradle/4.10.3
Not sending mail to unregistered user noreply@github.com
Build failed in Jenkins: kafka-trunk-jdk8 #4551
Posted by Apache Jenkins Server <je...@builds.apache.org>.
See <https://builds.apache.org/job/kafka-trunk-jdk8/4551/display/redirect?page=changes>
Changes:
[github] KAFKA-9859 / kafka-streams-application-reset tool doesn't take into
------------------------------------------
[...truncated 3.08 MB...]
org.apache.kafka.streams.test.ConsumerRecordFactoryTest > shouldRequireCustomTopicNameIfNotDefaultFactoryTopicNameWithNullKey STARTED
org.apache.kafka.streams.test.ConsumerRecordFactoryTest > shouldRequireCustomTopicNameIfNotDefaultFactoryTopicNameWithNullKey PASSED
org.apache.kafka.streams.test.ConsumerRecordFactoryTest > shouldCreateConsumerRecord STARTED
org.apache.kafka.streams.test.ConsumerRecordFactoryTest > shouldCreateConsumerRecord PASSED
org.apache.kafka.streams.test.ConsumerRecordFactoryTest > shouldCreateNullKeyConsumerRecord STARTED
org.apache.kafka.streams.test.ConsumerRecordFactoryTest > shouldCreateNullKeyConsumerRecord PASSED
org.apache.kafka.streams.test.ConsumerRecordFactoryTest > shouldCreateConsumerRecordWithOtherTopicName STARTED
org.apache.kafka.streams.test.ConsumerRecordFactoryTest > shouldCreateConsumerRecordWithOtherTopicName PASSED
org.apache.kafka.streams.test.ConsumerRecordFactoryTest > shouldAdvanceTime STARTED
org.apache.kafka.streams.test.ConsumerRecordFactoryTest > shouldAdvanceTime PASSED
org.apache.kafka.streams.test.ConsumerRecordFactoryTest > shouldNotAllowToCreateTopicWithNullTopicNameWithKeyValuePairs STARTED
org.apache.kafka.streams.test.ConsumerRecordFactoryTest > shouldNotAllowToCreateTopicWithNullTopicNameWithKeyValuePairs PASSED
org.apache.kafka.streams.test.ConsumerRecordFactoryTest > shouldRequireCustomTopicNameIfNotDefaultFactoryTopicNameWithKeyValuePairsAndCustomTimestamps STARTED
org.apache.kafka.streams.test.ConsumerRecordFactoryTest > shouldRequireCustomTopicNameIfNotDefaultFactoryTopicNameWithKeyValuePairsAndCustomTimestamps PASSED
org.apache.kafka.streams.test.ConsumerRecordFactoryTest > shouldRequireCustomTopicNameIfNotDefaultFactoryTopicNameWithKeyValuePairs STARTED
org.apache.kafka.streams.test.ConsumerRecordFactoryTest > shouldRequireCustomTopicNameIfNotDefaultFactoryTopicNameWithKeyValuePairs PASSED
org.apache.kafka.streams.test.ConsumerRecordFactoryTest > shouldCreateConsumerRecordWithOtherTopicNameAndTimestamp STARTED
org.apache.kafka.streams.test.ConsumerRecordFactoryTest > shouldCreateConsumerRecordWithOtherTopicNameAndTimestamp PASSED
org.apache.kafka.streams.test.ConsumerRecordFactoryTest > shouldNotAllowToCreateTopicWithNullTopicNameWithKeyValuePairsAndCustomTimestamps STARTED
org.apache.kafka.streams.test.ConsumerRecordFactoryTest > shouldNotAllowToCreateTopicWithNullTopicNameWithKeyValuePairsAndCustomTimestamps PASSED
org.apache.kafka.streams.test.ConsumerRecordFactoryTest > shouldNotAllowToCreateTopicWithNullTopicName STARTED
org.apache.kafka.streams.test.ConsumerRecordFactoryTest > shouldNotAllowToCreateTopicWithNullTopicName PASSED
org.apache.kafka.streams.test.ConsumerRecordFactoryTest > shouldCreateConsumerRecordsFromKeyValuePairsWithCustomTimestampAndIncrementsAndNotAdvanceTime STARTED
org.apache.kafka.streams.test.ConsumerRecordFactoryTest > shouldCreateConsumerRecordsFromKeyValuePairsWithCustomTimestampAndIncrementsAndNotAdvanceTime PASSED
org.apache.kafka.streams.test.ConsumerRecordFactoryTest > shouldCreateNullKeyConsumerRecordWithTimestampWithTimestamp STARTED
org.apache.kafka.streams.test.ConsumerRecordFactoryTest > shouldCreateNullKeyConsumerRecordWithTimestampWithTimestamp PASSED
org.apache.kafka.streams.test.ConsumerRecordFactoryTest > shouldRequireCustomTopicNameIfNotDefaultFactoryTopicNameWithNullKeyAndDefaultTimestamp STARTED
org.apache.kafka.streams.test.ConsumerRecordFactoryTest > shouldRequireCustomTopicNameIfNotDefaultFactoryTopicNameWithNullKeyAndDefaultTimestamp PASSED
org.apache.kafka.streams.test.ConsumerRecordFactoryTest > shouldCreateConsumerRecordsFromKeyValuePairsWithTimestampAndIncrements STARTED
org.apache.kafka.streams.test.ConsumerRecordFactoryTest > shouldCreateConsumerRecordsFromKeyValuePairsWithTimestampAndIncrements PASSED
org.apache.kafka.streams.test.TestRecordTest > testConsumerRecord STARTED
org.apache.kafka.streams.test.TestRecordTest > testConsumerRecord PASSED
org.apache.kafka.streams.test.TestRecordTest > testToString STARTED
org.apache.kafka.streams.test.TestRecordTest > testToString PASSED
org.apache.kafka.streams.test.TestRecordTest > testInvalidRecords STARTED
org.apache.kafka.streams.test.TestRecordTest > testInvalidRecords PASSED
org.apache.kafka.streams.test.TestRecordTest > testPartialConstructorEquals STARTED
org.apache.kafka.streams.test.TestRecordTest > testPartialConstructorEquals PASSED
org.apache.kafka.streams.test.TestRecordTest > testMultiFieldMatcher STARTED
org.apache.kafka.streams.test.TestRecordTest > testMultiFieldMatcher PASSED
org.apache.kafka.streams.test.TestRecordTest > testFields STARTED
org.apache.kafka.streams.test.TestRecordTest > testFields PASSED
org.apache.kafka.streams.test.TestRecordTest > testProducerRecord STARTED
org.apache.kafka.streams.test.TestRecordTest > testProducerRecord PASSED
org.apache.kafka.streams.test.TestRecordTest > testEqualsAndHashCode STARTED
org.apache.kafka.streams.test.TestRecordTest > testEqualsAndHashCode PASSED
> Task :streams:upgrade-system-tests-0101:processTestResources NO-SOURCE
> Task :streams:upgrade-system-tests-0101:testClasses
> Task :streams:upgrade-system-tests-0101:checkstyleTest
> Task :streams:upgrade-system-tests-0101:spotbugsMain NO-SOURCE
> Task :streams:upgrade-system-tests-0101:test
> Task :streams:upgrade-system-tests-0102:compileJava NO-SOURCE
> Task :streams:upgrade-system-tests-0102:processResources NO-SOURCE
> Task :streams:upgrade-system-tests-0102:classes UP-TO-DATE
> Task :streams:upgrade-system-tests-0102:checkstyleMain NO-SOURCE
> Task :streams:upgrade-system-tests-0102:compileTestJava
> Task :streams:upgrade-system-tests-0102:processTestResources NO-SOURCE
> Task :streams:upgrade-system-tests-0102:testClasses
> Task :streams:upgrade-system-tests-0102:checkstyleTest
> Task :streams:upgrade-system-tests-0102:spotbugsMain NO-SOURCE
> Task :streams:upgrade-system-tests-0102:test
> Task :streams:upgrade-system-tests-0110:compileJava NO-SOURCE
> Task :streams:upgrade-system-tests-0110:processResources NO-SOURCE
> Task :streams:upgrade-system-tests-0110:classes UP-TO-DATE
> Task :streams:upgrade-system-tests-0110:checkstyleMain NO-SOURCE
> Task :streams:upgrade-system-tests-0110:compileTestJava
> Task :streams:upgrade-system-tests-0110:processTestResources NO-SOURCE
> Task :streams:upgrade-system-tests-0110:testClasses
> Task :streams:upgrade-system-tests-0110:checkstyleTest
> Task :streams:upgrade-system-tests-0110:spotbugsMain NO-SOURCE
> Task :streams:upgrade-system-tests-0110:test
> Task :streams:upgrade-system-tests-10:compileJava NO-SOURCE
> Task :streams:upgrade-system-tests-10:processResources NO-SOURCE
> Task :streams:upgrade-system-tests-10:classes UP-TO-DATE
> Task :streams:upgrade-system-tests-10:checkstyleMain NO-SOURCE
> Task :streams:upgrade-system-tests-10:compileTestJava
> Task :streams:upgrade-system-tests-10:processTestResources NO-SOURCE
> Task :streams:upgrade-system-tests-10:testClasses
> Task :streams:upgrade-system-tests-10:checkstyleTest
> Task :streams:upgrade-system-tests-10:spotbugsMain NO-SOURCE
> Task :streams:upgrade-system-tests-10:test
> Task :streams:upgrade-system-tests-11:compileJava NO-SOURCE
> Task :streams:upgrade-system-tests-11:processResources NO-SOURCE
> Task :streams:upgrade-system-tests-11:classes UP-TO-DATE
> Task :streams:upgrade-system-tests-11:checkstyleMain NO-SOURCE
> Task :streams:upgrade-system-tests-11:compileTestJava
> Task :streams:upgrade-system-tests-11:processTestResources NO-SOURCE
> Task :streams:upgrade-system-tests-11:testClasses
> Task :streams:upgrade-system-tests-11:checkstyleTest
> Task :streams:upgrade-system-tests-11:spotbugsMain NO-SOURCE
> Task :streams:upgrade-system-tests-11:test
> Task :streams:upgrade-system-tests-20:compileJava NO-SOURCE
> Task :streams:upgrade-system-tests-20:processResources NO-SOURCE
> Task :streams:upgrade-system-tests-20:classes UP-TO-DATE
> Task :streams:upgrade-system-tests-20:checkstyleMain NO-SOURCE
> Task :streams:upgrade-system-tests-20:compileTestJava
> Task :streams:upgrade-system-tests-20:processTestResources NO-SOURCE
> Task :streams:upgrade-system-tests-20:testClasses
> Task :streams:upgrade-system-tests-20:checkstyleTest
> Task :streams:upgrade-system-tests-20:spotbugsMain NO-SOURCE
> Task :streams:upgrade-system-tests-20:test
> Task :streams:upgrade-system-tests-21:compileJava NO-SOURCE
> Task :streams:upgrade-system-tests-21:processResources NO-SOURCE
> Task :streams:upgrade-system-tests-21:classes UP-TO-DATE
> Task :streams:upgrade-system-tests-21:checkstyleMain NO-SOURCE
> Task :streams:upgrade-system-tests-21:compileTestJava
> Task :streams:upgrade-system-tests-21:processTestResources NO-SOURCE
> Task :streams:upgrade-system-tests-21:testClasses
> Task :streams:upgrade-system-tests-21:checkstyleTest
> Task :streams:upgrade-system-tests-21:spotbugsMain NO-SOURCE
> Task :streams:upgrade-system-tests-21:test
> Task :streams:upgrade-system-tests-22:compileJava NO-SOURCE
> Task :streams:upgrade-system-tests-22:processResources NO-SOURCE
> Task :streams:upgrade-system-tests-22:classes UP-TO-DATE
> Task :streams:upgrade-system-tests-22:checkstyleMain NO-SOURCE
> Task :streams:upgrade-system-tests-22:compileTestJava
> Task :streams:upgrade-system-tests-22:processTestResources NO-SOURCE
> Task :streams:upgrade-system-tests-22:testClasses
> Task :streams:upgrade-system-tests-22:checkstyleTest
> Task :streams:upgrade-system-tests-22:spotbugsMain NO-SOURCE
> Task :streams:upgrade-system-tests-22:test
> Task :streams:upgrade-system-tests-23:compileJava NO-SOURCE
> Task :streams:upgrade-system-tests-23:processResources NO-SOURCE
> Task :streams:upgrade-system-tests-23:classes UP-TO-DATE
> Task :streams:upgrade-system-tests-23:checkstyleMain NO-SOURCE
> Task :streams:upgrade-system-tests-23:compileTestJava
> Task :streams:upgrade-system-tests-23:processTestResources NO-SOURCE
> Task :streams:upgrade-system-tests-23:testClasses
> Task :streams:upgrade-system-tests-23:checkstyleTest
> Task :streams:upgrade-system-tests-23:spotbugsMain NO-SOURCE
> Task :streams:upgrade-system-tests-23:test
> Task :streams:upgrade-system-tests-24:compileJava NO-SOURCE
> Task :streams:upgrade-system-tests-24:processResources NO-SOURCE
> Task :streams:upgrade-system-tests-24:classes UP-TO-DATE
> Task :streams:upgrade-system-tests-24:checkstyleMain NO-SOURCE
> Task :streams:upgrade-system-tests-24:compileTestJava
> Task :streams:upgrade-system-tests-24:processTestResources NO-SOURCE
> Task :streams:upgrade-system-tests-24:testClasses
> Task :streams:upgrade-system-tests-24:checkstyleTest
> Task :streams:upgrade-system-tests-24:spotbugsMain NO-SOURCE
> Task :streams:upgrade-system-tests-24:test
> Task :streams:upgrade-system-tests-25:compileJava NO-SOURCE
> Task :streams:upgrade-system-tests-25:processResources NO-SOURCE
> Task :streams:upgrade-system-tests-25:classes UP-TO-DATE
> Task :streams:upgrade-system-tests-25:checkstyleMain NO-SOURCE
> Task :streams:upgrade-system-tests-25:compileTestJava
> Task :streams:upgrade-system-tests-25:processTestResources NO-SOURCE
> Task :streams:upgrade-system-tests-25:testClasses
> Task :streams:upgrade-system-tests-25:checkstyleTest
> Task :streams:upgrade-system-tests-25:spotbugsMain NO-SOURCE
> Task :streams:upgrade-system-tests-25:test
FAILURE: Build failed with an exception.
* What went wrong:
Execution failed for task ':streams:test'.
> There were failing tests. See the report at: file://<https://builds.apache.org/job/kafka-trunk-jdk8/ws/streams/build/reports/tests/test/index.html>
* Try:
Run with --stacktrace option to get the stack trace. Run with --info or --debug option to get more log output. Run with --scan to get full insights.
* Get more help at https://help.gradle.org
Deprecated Gradle features were used in this build, making it incompatible with Gradle 7.0.
Use '--warning-mode all' to show the individual deprecation warnings.
See https://docs.gradle.org/6.4.1/userguide/command_line_interface.html#sec:command_line_warnings
BUILD FAILED in 2h 8m 8s
215 actionable tasks: 183 executed, 32 up-to-date
Build step 'Execute shell' marked build as failure
[FINDBUGS] Collecting findbugs analysis files...
Setting GRADLE_4_10_3_HOME=/home/jenkins/tools/gradle/4.10.3
[FINDBUGS] Searching for all files in <https://builds.apache.org/job/kafka-trunk-jdk8/ws/> that match the pattern **/build/reports/*bugs/*.xml
[FINDBUGS] Parsing 19 files in <https://builds.apache.org/job/kafka-trunk-jdk8/ws/>
[FINDBUGS] Successfully parsed file <https://builds.apache.org/job/kafka-trunk-jdk8/ws/clients/build/reports/spotbugs/main.xml> with 0 unique warnings and 0 duplicates.
[FINDBUGS] Successfully parsed file <https://builds.apache.org/job/kafka-trunk-jdk8/ws/connect/api/build/reports/spotbugs/main.xml> with 0 unique warnings and 0 duplicates.
[FINDBUGS] Successfully parsed file <https://builds.apache.org/job/kafka-trunk-jdk8/ws/connect/basic-auth-extension/build/reports/spotbugs/main.xml> with 0 unique warnings and 0 duplicates.
[FINDBUGS] Successfully parsed file <https://builds.apache.org/job/kafka-trunk-jdk8/ws/connect/file/build/reports/spotbugs/main.xml> with 0 unique warnings and 0 duplicates.
[FINDBUGS] Successfully parsed file <https://builds.apache.org/job/kafka-trunk-jdk8/ws/connect/json/build/reports/spotbugs/main.xml> with 0 unique warnings and 0 duplicates.
[FINDBUGS] Successfully parsed file <https://builds.apache.org/job/kafka-trunk-jdk8/ws/connect/mirror-client/build/reports/spotbugs/main.xml> with 0 unique warnings and 0 duplicates.
[FINDBUGS] Successfully parsed file <https://builds.apache.org/job/kafka-trunk-jdk8/ws/connect/mirror/build/reports/spotbugs/main.xml> with 0 unique warnings and 0 duplicates.
[FINDBUGS] Successfully parsed file <https://builds.apache.org/job/kafka-trunk-jdk8/ws/connect/runtime/build/reports/spotbugs/main.xml> with 0 unique warnings and 0 duplicates.
[FINDBUGS] Successfully parsed file <https://builds.apache.org/job/kafka-trunk-jdk8/ws/connect/transforms/build/reports/spotbugs/main.xml> with 0 unique warnings and 0 duplicates.
[FINDBUGS] Successfully parsed file <https://builds.apache.org/job/kafka-trunk-jdk8/ws/core/build/reports/spotbugs/main.xml> with 0 unique warnings and 0 duplicates.
[FINDBUGS] Successfully parsed file <https://builds.apache.org/job/kafka-trunk-jdk8/ws/examples/build/reports/spotbugs/main.xml> with 0 unique warnings and 0 duplicates.
[FINDBUGS] Successfully parsed file <https://builds.apache.org/job/kafka-trunk-jdk8/ws/generator/build/reports/spotbugs/main.xml> with 0 unique warnings and 0 duplicates.
[FINDBUGS] Successfully parsed file <https://builds.apache.org/job/kafka-trunk-jdk8/ws/jmh-benchmarks/build/reports/spotbugs/main.xml> with 0 unique warnings and 0 duplicates.
[FINDBUGS] Successfully parsed file <https://builds.apache.org/job/kafka-trunk-jdk8/ws/log4j-appender/build/reports/spotbugs/main.xml> with 0 unique warnings and 0 duplicates.
[FINDBUGS] Successfully parsed file <https://builds.apache.org/job/kafka-trunk-jdk8/ws/streams/build/reports/spotbugs/main.xml> with 0 unique warnings and 0 duplicates.
[FINDBUGS] Successfully parsed file <https://builds.apache.org/job/kafka-trunk-jdk8/ws/streams/examples/build/reports/spotbugs/main.xml> with 0 unique warnings and 0 duplicates.
[FINDBUGS] Successfully parsed file <https://builds.apache.org/job/kafka-trunk-jdk8/ws/streams/streams-scala/build/reports/spotbugs/main.xml> with 0 unique warnings and 0 duplicates.
[FINDBUGS] Successfully parsed file <https://builds.apache.org/job/kafka-trunk-jdk8/ws/streams/test-utils/build/reports/spotbugs/main.xml> with 0 unique warnings and 0 duplicates.
[FINDBUGS] Successfully parsed file <https://builds.apache.org/job/kafka-trunk-jdk8/ws/tools/build/reports/spotbugs/main.xml> with 0 unique warnings and 0 duplicates.
Setting GRADLE_4_10_3_HOME=/home/jenkins/tools/gradle/4.10.3
No credentials specified
Setting GRADLE_4_10_3_HOME=/home/jenkins/tools/gradle/4.10.3
<Git Blamer> Using GitBlamer to create author and commit information for all warnings.
<Git Blamer> GIT_COMMIT=67770072da1bd13762af978faaa278c4039167a2, workspace=<https://builds.apache.org/job/kafka-trunk-jdk8/ws/>
[FINDBUGS] Computing warning deltas based on reference build #4543
Recording test results
Setting GRADLE_4_10_3_HOME=/home/jenkins/tools/gradle/4.10.3
Setting GRADLE_4_10_3_HOME=/home/jenkins/tools/gradle/4.10.3
Not sending mail to unregistered user noreply@github.com
Build failed in Jenkins: kafka-trunk-jdk8 #4550
Posted by Apache Jenkins Server <je...@builds.apache.org>.
See <https://builds.apache.org/job/kafka-trunk-jdk8/4550/display/redirect?page=changes>
Changes:
[github] MINOR: Fix redundant typos in comments and javadocs (#8693)
------------------------------------------
[...truncated 3.08 MB...]
org.apache.kafka.streams.test.ConsumerRecordFactoryTest > shouldRequireCustomTopicNameIfNotDefaultFactoryTopicName PASSED
org.apache.kafka.streams.test.ConsumerRecordFactoryTest > shouldRequireCustomTopicNameIfNotDefaultFactoryTopicNameWithNullKey STARTED
org.apache.kafka.streams.test.ConsumerRecordFactoryTest > shouldRequireCustomTopicNameIfNotDefaultFactoryTopicNameWithNullKey PASSED
org.apache.kafka.streams.test.ConsumerRecordFactoryTest > shouldCreateConsumerRecord STARTED
org.apache.kafka.streams.test.ConsumerRecordFactoryTest > shouldCreateConsumerRecord PASSED
org.apache.kafka.streams.test.ConsumerRecordFactoryTest > shouldCreateNullKeyConsumerRecord STARTED
org.apache.kafka.streams.test.ConsumerRecordFactoryTest > shouldCreateNullKeyConsumerRecord PASSED
org.apache.kafka.streams.test.ConsumerRecordFactoryTest > shouldCreateConsumerRecordWithOtherTopicName STARTED
org.apache.kafka.streams.test.ConsumerRecordFactoryTest > shouldCreateConsumerRecordWithOtherTopicName PASSED
org.apache.kafka.streams.test.ConsumerRecordFactoryTest > shouldAdvanceTime STARTED
org.apache.kafka.streams.test.ConsumerRecordFactoryTest > shouldAdvanceTime PASSED
org.apache.kafka.streams.test.ConsumerRecordFactoryTest > shouldNotAllowToCreateTopicWithNullTopicNameWithKeyValuePairs STARTED
org.apache.kafka.streams.test.ConsumerRecordFactoryTest > shouldNotAllowToCreateTopicWithNullTopicNameWithKeyValuePairs PASSED
org.apache.kafka.streams.test.ConsumerRecordFactoryTest > shouldRequireCustomTopicNameIfNotDefaultFactoryTopicNameWithKeyValuePairsAndCustomTimestamps STARTED
org.apache.kafka.streams.test.ConsumerRecordFactoryTest > shouldRequireCustomTopicNameIfNotDefaultFactoryTopicNameWithKeyValuePairsAndCustomTimestamps PASSED
org.apache.kafka.streams.test.ConsumerRecordFactoryTest > shouldRequireCustomTopicNameIfNotDefaultFactoryTopicNameWithKeyValuePairs STARTED
org.apache.kafka.streams.test.ConsumerRecordFactoryTest > shouldRequireCustomTopicNameIfNotDefaultFactoryTopicNameWithKeyValuePairs PASSED
org.apache.kafka.streams.test.ConsumerRecordFactoryTest > shouldCreateConsumerRecordWithOtherTopicNameAndTimestamp STARTED
org.apache.kafka.streams.test.ConsumerRecordFactoryTest > shouldCreateConsumerRecordWithOtherTopicNameAndTimestamp PASSED
org.apache.kafka.streams.test.ConsumerRecordFactoryTest > shouldNotAllowToCreateTopicWithNullTopicNameWithKeyValuePairsAndCustomTimestamps STARTED
org.apache.kafka.streams.test.ConsumerRecordFactoryTest > shouldNotAllowToCreateTopicWithNullTopicNameWithKeyValuePairsAndCustomTimestamps PASSED
org.apache.kafka.streams.test.ConsumerRecordFactoryTest > shouldNotAllowToCreateTopicWithNullTopicName STARTED
org.apache.kafka.streams.test.ConsumerRecordFactoryTest > shouldNotAllowToCreateTopicWithNullTopicName PASSED
org.apache.kafka.streams.test.ConsumerRecordFactoryTest > shouldCreateConsumerRecordsFromKeyValuePairsWithCustomTimestampAndIncrementsAndNotAdvanceTime STARTED
org.apache.kafka.streams.test.ConsumerRecordFactoryTest > shouldCreateConsumerRecordsFromKeyValuePairsWithCustomTimestampAndIncrementsAndNotAdvanceTime PASSED
org.apache.kafka.streams.test.ConsumerRecordFactoryTest > shouldCreateNullKeyConsumerRecordWithTimestampWithTimestamp STARTED
org.apache.kafka.streams.test.ConsumerRecordFactoryTest > shouldCreateNullKeyConsumerRecordWithTimestampWithTimestamp PASSED
org.apache.kafka.streams.test.ConsumerRecordFactoryTest > shouldRequireCustomTopicNameIfNotDefaultFactoryTopicNameWithNullKeyAndDefaultTimestamp STARTED
org.apache.kafka.streams.test.ConsumerRecordFactoryTest > shouldRequireCustomTopicNameIfNotDefaultFactoryTopicNameWithNullKeyAndDefaultTimestamp PASSED
org.apache.kafka.streams.test.ConsumerRecordFactoryTest > shouldCreateConsumerRecordsFromKeyValuePairsWithTimestampAndIncrements STARTED
org.apache.kafka.streams.test.ConsumerRecordFactoryTest > shouldCreateConsumerRecordsFromKeyValuePairsWithTimestampAndIncrements PASSED
org.apache.kafka.streams.test.TestRecordTest > testConsumerRecord STARTED
org.apache.kafka.streams.test.TestRecordTest > testConsumerRecord PASSED
org.apache.kafka.streams.test.TestRecordTest > testToString STARTED
org.apache.kafka.streams.test.TestRecordTest > testToString PASSED
org.apache.kafka.streams.test.TestRecordTest > testInvalidRecords STARTED
org.apache.kafka.streams.test.TestRecordTest > testInvalidRecords PASSED
org.apache.kafka.streams.test.TestRecordTest > testPartialConstructorEquals STARTED
org.apache.kafka.streams.test.TestRecordTest > testPartialConstructorEquals PASSED
org.apache.kafka.streams.test.TestRecordTest > testMultiFieldMatcher STARTED
org.apache.kafka.streams.test.TestRecordTest > testMultiFieldMatcher PASSED
org.apache.kafka.streams.test.TestRecordTest > testFields STARTED
org.apache.kafka.streams.test.TestRecordTest > testFields PASSED
org.apache.kafka.streams.test.TestRecordTest > testProducerRecord STARTED
org.apache.kafka.streams.test.TestRecordTest > testProducerRecord PASSED
org.apache.kafka.streams.test.TestRecordTest > testEqualsAndHashCode STARTED
org.apache.kafka.streams.test.TestRecordTest > testEqualsAndHashCode PASSED
> Task :streams:upgrade-system-tests-0101:spotbugsMain NO-SOURCE
> Task :streams:upgrade-system-tests-0101:test
> Task :streams:upgrade-system-tests-0102:compileJava NO-SOURCE
> Task :streams:upgrade-system-tests-0102:processResources NO-SOURCE
> Task :streams:upgrade-system-tests-0102:classes UP-TO-DATE
> Task :streams:upgrade-system-tests-0102:checkstyleMain NO-SOURCE
> Task :streams:upgrade-system-tests-0102:compileTestJava
> Task :streams:upgrade-system-tests-0102:processTestResources NO-SOURCE
> Task :streams:upgrade-system-tests-0102:testClasses
> Task :streams:upgrade-system-tests-0102:checkstyleTest
> Task :streams:upgrade-system-tests-0102:spotbugsMain NO-SOURCE
> Task :streams:upgrade-system-tests-0102:test
> Task :streams:upgrade-system-tests-0110:compileJava NO-SOURCE
> Task :streams:upgrade-system-tests-0110:processResources NO-SOURCE
> Task :streams:upgrade-system-tests-0110:classes UP-TO-DATE
> Task :streams:upgrade-system-tests-0110:checkstyleMain NO-SOURCE
> Task :streams:upgrade-system-tests-0110:compileTestJava
> Task :streams:upgrade-system-tests-0110:processTestResources NO-SOURCE
> Task :streams:upgrade-system-tests-0110:testClasses
> Task :streams:upgrade-system-tests-0110:checkstyleTest
> Task :streams:upgrade-system-tests-0110:spotbugsMain NO-SOURCE
> Task :streams:upgrade-system-tests-0110:test
> Task :streams:upgrade-system-tests-10:compileJava NO-SOURCE
> Task :streams:upgrade-system-tests-10:processResources NO-SOURCE
> Task :streams:upgrade-system-tests-10:classes UP-TO-DATE
> Task :streams:upgrade-system-tests-10:checkstyleMain NO-SOURCE
> Task :streams:upgrade-system-tests-10:compileTestJava
> Task :streams:upgrade-system-tests-10:processTestResources NO-SOURCE
> Task :streams:upgrade-system-tests-10:testClasses
> Task :streams:upgrade-system-tests-10:checkstyleTest
> Task :streams:upgrade-system-tests-10:spotbugsMain NO-SOURCE
> Task :streams:upgrade-system-tests-10:test
> Task :streams:upgrade-system-tests-11:compileJava NO-SOURCE
> Task :streams:upgrade-system-tests-11:processResources NO-SOURCE
> Task :streams:upgrade-system-tests-11:classes UP-TO-DATE
> Task :streams:upgrade-system-tests-11:checkstyleMain NO-SOURCE
> Task :streams:upgrade-system-tests-11:compileTestJava
> Task :streams:upgrade-system-tests-11:processTestResources NO-SOURCE
> Task :streams:upgrade-system-tests-11:testClasses
> Task :streams:upgrade-system-tests-11:checkstyleTest
> Task :streams:upgrade-system-tests-11:spotbugsMain NO-SOURCE
> Task :streams:upgrade-system-tests-11:test
> Task :streams:upgrade-system-tests-20:compileJava NO-SOURCE
> Task :streams:upgrade-system-tests-20:processResources NO-SOURCE
> Task :streams:upgrade-system-tests-20:classes UP-TO-DATE
> Task :streams:upgrade-system-tests-20:checkstyleMain NO-SOURCE
> Task :streams:upgrade-system-tests-20:compileTestJava
> Task :streams:upgrade-system-tests-20:processTestResources NO-SOURCE
> Task :streams:upgrade-system-tests-20:testClasses
> Task :streams:upgrade-system-tests-20:checkstyleTest
> Task :streams:upgrade-system-tests-20:spotbugsMain NO-SOURCE
> Task :streams:upgrade-system-tests-20:test
> Task :streams:upgrade-system-tests-21:compileJava NO-SOURCE
> Task :streams:upgrade-system-tests-21:processResources NO-SOURCE
> Task :streams:upgrade-system-tests-21:classes UP-TO-DATE
> Task :streams:upgrade-system-tests-21:checkstyleMain NO-SOURCE
> Task :streams:upgrade-system-tests-21:compileTestJava
> Task :streams:upgrade-system-tests-21:processTestResources NO-SOURCE
> Task :streams:upgrade-system-tests-21:testClasses
> Task :streams:upgrade-system-tests-21:checkstyleTest
> Task :streams:upgrade-system-tests-21:spotbugsMain NO-SOURCE
> Task :streams:upgrade-system-tests-21:test
> Task :streams:upgrade-system-tests-22:compileJava NO-SOURCE
> Task :streams:upgrade-system-tests-22:processResources NO-SOURCE
> Task :streams:upgrade-system-tests-22:classes UP-TO-DATE
> Task :streams:upgrade-system-tests-22:checkstyleMain NO-SOURCE
> Task :streams:upgrade-system-tests-22:compileTestJava
> Task :streams:upgrade-system-tests-22:processTestResources NO-SOURCE
> Task :streams:upgrade-system-tests-22:testClasses
> Task :streams:upgrade-system-tests-22:checkstyleTest
> Task :streams:upgrade-system-tests-22:spotbugsMain NO-SOURCE
> Task :streams:upgrade-system-tests-22:test
> Task :streams:upgrade-system-tests-23:compileJava NO-SOURCE
> Task :streams:upgrade-system-tests-23:processResources NO-SOURCE
> Task :streams:upgrade-system-tests-23:classes UP-TO-DATE
> Task :streams:upgrade-system-tests-23:checkstyleMain NO-SOURCE
> Task :streams:upgrade-system-tests-23:compileTestJava
> Task :streams:upgrade-system-tests-23:processTestResources NO-SOURCE
> Task :streams:upgrade-system-tests-23:testClasses
> Task :streams:upgrade-system-tests-23:checkstyleTest
> Task :streams:upgrade-system-tests-23:spotbugsMain NO-SOURCE
> Task :streams:upgrade-system-tests-23:test
> Task :streams:upgrade-system-tests-24:compileJava NO-SOURCE
> Task :streams:upgrade-system-tests-24:processResources NO-SOURCE
> Task :streams:upgrade-system-tests-24:classes UP-TO-DATE
> Task :streams:upgrade-system-tests-24:checkstyleMain NO-SOURCE
> Task :streams:upgrade-system-tests-24:compileTestJava
> Task :streams:upgrade-system-tests-24:processTestResources NO-SOURCE
> Task :streams:upgrade-system-tests-24:testClasses
> Task :streams:upgrade-system-tests-24:checkstyleTest
> Task :streams:upgrade-system-tests-24:spotbugsMain NO-SOURCE
> Task :streams:upgrade-system-tests-24:test
> Task :streams:upgrade-system-tests-25:compileJava NO-SOURCE
> Task :streams:upgrade-system-tests-25:processResources NO-SOURCE
> Task :streams:upgrade-system-tests-25:classes UP-TO-DATE
> Task :streams:upgrade-system-tests-25:checkstyleMain NO-SOURCE
> Task :streams:upgrade-system-tests-25:compileTestJava
> Task :streams:upgrade-system-tests-25:processTestResources NO-SOURCE
> Task :streams:upgrade-system-tests-25:testClasses
> Task :streams:upgrade-system-tests-25:checkstyleTest
> Task :streams:upgrade-system-tests-25:spotbugsMain NO-SOURCE
> Task :streams:upgrade-system-tests-25:test
FAILURE: Build failed with an exception.
* What went wrong:
Execution failed for task ':connect:mirror:test'.
> There were failing tests. See the report at: file://<https://builds.apache.org/job/kafka-trunk-jdk8/ws/connect/mirror/build/reports/tests/test/index.html>
* Try:
Run with --stacktrace option to get the stack trace. Run with --info or --debug option to get more log output. Run with --scan to get full insights.
* Get more help at https://help.gradle.org
Deprecated Gradle features were used in this build, making it incompatible with Gradle 7.0.
Use '--warning-mode all' to show the individual deprecation warnings.
See https://docs.gradle.org/6.4.1/userguide/command_line_interface.html#sec:command_line_warnings
BUILD FAILED in 1h 56m 5s
215 actionable tasks: 183 executed, 32 up-to-date
Build step 'Execute shell' marked build as failure
[FINDBUGS] Collecting findbugs analysis files...
Setting GRADLE_4_10_3_HOME=/home/jenkins/tools/gradle/4.10.3
[FINDBUGS] Searching for all files in <https://builds.apache.org/job/kafka-trunk-jdk8/ws/> that match the pattern **/build/reports/*bugs/*.xml
[FINDBUGS] Parsing 19 files in <https://builds.apache.org/job/kafka-trunk-jdk8/ws/>
[FINDBUGS] Successfully parsed file <https://builds.apache.org/job/kafka-trunk-jdk8/ws/clients/build/reports/spotbugs/main.xml> with 0 unique warnings and 0 duplicates.
[FINDBUGS] Successfully parsed file <https://builds.apache.org/job/kafka-trunk-jdk8/ws/connect/api/build/reports/spotbugs/main.xml> with 0 unique warnings and 0 duplicates.
[FINDBUGS] Successfully parsed file <https://builds.apache.org/job/kafka-trunk-jdk8/ws/connect/basic-auth-extension/build/reports/spotbugs/main.xml> with 0 unique warnings and 0 duplicates.
[FINDBUGS] Successfully parsed file <https://builds.apache.org/job/kafka-trunk-jdk8/ws/connect/file/build/reports/spotbugs/main.xml> with 0 unique warnings and 0 duplicates.
[FINDBUGS] Successfully parsed file <https://builds.apache.org/job/kafka-trunk-jdk8/ws/connect/json/build/reports/spotbugs/main.xml> with 0 unique warnings and 0 duplicates.
[FINDBUGS] Successfully parsed file <https://builds.apache.org/job/kafka-trunk-jdk8/ws/connect/mirror-client/build/reports/spotbugs/main.xml> with 0 unique warnings and 0 duplicates.
[FINDBUGS] Successfully parsed file <https://builds.apache.org/job/kafka-trunk-jdk8/ws/connect/mirror/build/reports/spotbugs/main.xml> with 0 unique warnings and 0 duplicates.
[FINDBUGS] Successfully parsed file <https://builds.apache.org/job/kafka-trunk-jdk8/ws/connect/runtime/build/reports/spotbugs/main.xml> with 0 unique warnings and 0 duplicates.
[FINDBUGS] Successfully parsed file <https://builds.apache.org/job/kafka-trunk-jdk8/ws/connect/transforms/build/reports/spotbugs/main.xml> with 0 unique warnings and 0 duplicates.
[FINDBUGS] Successfully parsed file <https://builds.apache.org/job/kafka-trunk-jdk8/ws/core/build/reports/spotbugs/main.xml> with 0 unique warnings and 0 duplicates.
[FINDBUGS] Successfully parsed file <https://builds.apache.org/job/kafka-trunk-jdk8/ws/examples/build/reports/spotbugs/main.xml> with 0 unique warnings and 0 duplicates.
[FINDBUGS] Successfully parsed file <https://builds.apache.org/job/kafka-trunk-jdk8/ws/generator/build/reports/spotbugs/main.xml> with 0 unique warnings and 0 duplicates.
[FINDBUGS] Successfully parsed file <https://builds.apache.org/job/kafka-trunk-jdk8/ws/jmh-benchmarks/build/reports/spotbugs/main.xml> with 0 unique warnings and 0 duplicates.
[FINDBUGS] Successfully parsed file <https://builds.apache.org/job/kafka-trunk-jdk8/ws/log4j-appender/build/reports/spotbugs/main.xml> with 0 unique warnings and 0 duplicates.
[FINDBUGS] Successfully parsed file <https://builds.apache.org/job/kafka-trunk-jdk8/ws/streams/build/reports/spotbugs/main.xml> with 0 unique warnings and 0 duplicates.
[FINDBUGS] Successfully parsed file <https://builds.apache.org/job/kafka-trunk-jdk8/ws/streams/examples/build/reports/spotbugs/main.xml> with 0 unique warnings and 0 duplicates.
[FINDBUGS] Successfully parsed file <https://builds.apache.org/job/kafka-trunk-jdk8/ws/streams/streams-scala/build/reports/spotbugs/main.xml> with 0 unique warnings and 0 duplicates.
[FINDBUGS] Successfully parsed file <https://builds.apache.org/job/kafka-trunk-jdk8/ws/streams/test-utils/build/reports/spotbugs/main.xml> with 0 unique warnings and 0 duplicates.
[FINDBUGS] Successfully parsed file <https://builds.apache.org/job/kafka-trunk-jdk8/ws/tools/build/reports/spotbugs/main.xml> with 0 unique warnings and 0 duplicates.
Setting GRADLE_4_10_3_HOME=/home/jenkins/tools/gradle/4.10.3
No credentials specified
Setting GRADLE_4_10_3_HOME=/home/jenkins/tools/gradle/4.10.3
<Git Blamer> Using GitBlamer to create author and commit information for all warnings.
<Git Blamer> GIT_COMMIT=affb270bbc0629822857e7558ab96bbe9f1b4582, workspace=<https://builds.apache.org/job/kafka-trunk-jdk8/ws/>
[FINDBUGS] Computing warning deltas based on reference build #4543
Recording test results
Setting GRADLE_4_10_3_HOME=/home/jenkins/tools/gradle/4.10.3
Setting GRADLE_4_10_3_HOME=/home/jenkins/tools/gradle/4.10.3
Not sending mail to unregistered user noreply@github.com
Build failed in Jenkins: kafka-trunk-jdk8 #4549
Posted by Apache Jenkins Server <je...@builds.apache.org>.
See <https://builds.apache.org/job/kafka-trunk-jdk8/4549/display/redirect>
Changes:
------------------------------------------
Started by an SCM change
Running as SYSTEM
[EnvInject] - Loading node environment variables.
Building remotely on H44 (ubuntu) in workspace <https://builds.apache.org/job/kafka-trunk-jdk8/ws/>
[WS-CLEANUP] Deleting project workspace...
[WS-CLEANUP] Deferred wipeout is used...
FATAL: java.nio.file.FileSystemException: <https://builds.apache.org/job/kafka-trunk-jdk8/ws/>: Input/output error
java.nio.file.FileSystemException: <https://builds.apache.org/job/kafka-trunk-jdk8/ws/>: Input/output error
at sun.nio.fs.UnixException.translateToIOException(UnixException.java:91)
at sun.nio.fs.UnixException.asIOException(UnixException.java:111)
at sun.nio.fs.UnixDirectoryStream$UnixDirectoryIterator.readNextEntry(UnixDirectoryStream.java:171)
Also: hudson.remoting.Channel$CallSiteStackTrace: Remote call to H44
at hudson.remoting.Channel.attachCallSiteStackTrace(Channel.java:1743)
at hudson.remoting.UserRequest$ExceptionResponse.retrieve(UserRequest.java:357)
at hudson.remoting.Channel.call(Channel.java:957)
at hudson.FilePath.act(FilePath.java:1072)
at hudson.FilePath.act(FilePath.java:1061)
at hudson.FilePath.deleteRecursive(FilePath.java:1268)
at hudson.plugins.ws_cleanup.Wipeout.performDelete(Wipeout.java:82)
at hudson.plugins.ws_cleanup.Wipeout.perform(Wipeout.java:78)
at hudson.plugins.ws_cleanup.PreBuildCleanup.preCheckout(PreBuildCleanup.java:107)
at jenkins.scm.SCMCheckoutStrategy.preCheckout(SCMCheckoutStrategy.java:76)
at hudson.model.AbstractBuild$AbstractBuildExecution.run(AbstractBuild.java:498)
at hudson.model.Run.execute(Run.java:1815)
at hudson.model.FreeStyleBuild.run(FreeStyleBuild.java:43)
at hudson.model.ResourceController.execute(ResourceController.java:97)
at hudson.model.Executor.run(Executor.java:429)
Caused: java.nio.file.DirectoryIteratorException
at sun.nio.fs.UnixDirectoryStream$UnixDirectoryIterator.readNextEntry(UnixDirectoryStream.java:172)
at sun.nio.fs.UnixDirectoryStream$UnixDirectoryIterator.hasNext(UnixDirectoryStream.java:201)
at jenkins.util.io.PathRemover.tryRemoveDirectoryContents(PathRemover.java:225)
at jenkins.util.io.PathRemover.tryRemoveRecursive(PathRemover.java:215)
at jenkins.util.io.PathRemover.forceRemoveRecursive(PathRemover.java:96)
at hudson.Util.deleteRecursive(Util.java:293)
at hudson.FilePath$DeleteRecursive.invoke(FilePath.java:1274)
at hudson.FilePath$DeleteRecursive.invoke(FilePath.java:1270)
at hudson.FilePath$FileCallableWrapper.call(FilePath.java:3052)
at hudson.remoting.UserRequest.perform(UserRequest.java:212)
at hudson.remoting.UserRequest.perform(UserRequest.java:54)
at hudson.remoting.Request$2.run(Request.java:369)
at hudson.remoting.InterceptingExecutorService$1.call(InterceptingExecutorService.java:72)
at java.util.concurrent.FutureTask.run(FutureTask.java:266)
at java.util.concurrent.ThreadPoolExecutor.runWorker(ThreadPoolExecutor.java:1149)
at java.util.concurrent.ThreadPoolExecutor$Worker.run(ThreadPoolExecutor.java:624)
at java.lang.Thread.run(Thread.java:748)
[FINDBUGS] Collecting findbugs analysis files...
ERROR: Step ?[Deprecated] Publish FindBugs analysis results? aborted due to exception:
Also: hudson.remoting.Channel$CallSiteStackTrace: Remote call to H44
at hudson.remoting.Channel.attachCallSiteStackTrace(Channel.java:1743)
at hudson.remoting.UserRequest$ExceptionResponse.retrieve(UserRequest.java:357)
at hudson.remoting.Channel.call(Channel.java:957)
at hudson.FilePath.act(FilePath.java:1072)
at hudson.FilePath.act(FilePath.java:1061)
at hudson.plugins.findbugs.FindBugsPublisher.perform(FindBugsPublisher.java:144)
at hudson.plugins.analysis.core.HealthAwarePublisher.perform(HealthAwarePublisher.java:69)
at hudson.plugins.analysis.core.HealthAwareRecorder.perform(HealthAwareRecorder.java:298)
at hudson.tasks.BuildStepCompatibilityLayer.perform(BuildStepCompatibilityLayer.java:79)
at hudson.tasks.BuildStepMonitor$1.perform(BuildStepMonitor.java:20)
at hudson.model.AbstractBuild$AbstractBuildExecution.perform(AbstractBuild.java:741)
at hudson.model.AbstractBuild$AbstractBuildExecution.performAllBuildSteps(AbstractBuild.java:690)
at hudson.model.Build$BuildExecution.post2(Build.java:186)
at hudson.model.AbstractBuild$AbstractBuildExecution.post(AbstractBuild.java:635)
at hudson.model.Run.execute(Run.java:1840)
at hudson.model.FreeStyleBuild.run(FreeStyleBuild.java:43)
at hudson.model.ResourceController.execute(ResourceController.java:97)
at hudson.model.Executor.run(Executor.java:429)
java.lang.NoClassDefFoundError: hudson/plugins/analysis/Messages
at hudson.plugins.analysis.core.FilesParser.parserCollectionOfFiles(FilesParser.java:227)
at hudson.plugins.analysis.core.FilesParser.invoke(FilesParser.java:203)
at hudson.plugins.analysis.core.FilesParser.invoke(FilesParser.java:31)
at hudson.FilePath$FileCallableWrapper.call(FilePath.java:3052)
at hudson.remoting.UserRequest.perform(UserRequest.java:212)
at hudson.remoting.UserRequest.perform(UserRequest.java:54)
at hudson.remoting.Request$2.run(Request.java:369)
at hudson.remoting.InterceptingExecutorService$1.call(InterceptingExecutorService.java:72)
at java.util.concurrent.FutureTask.run(FutureTask.java:266)
at java.util.concurrent.ThreadPoolExecutor.runWorker(ThreadPoolExecutor.java:1149)
at java.util.concurrent.ThreadPoolExecutor$Worker.run(ThreadPoolExecutor.java:624)
at java.lang.Thread.run(Thread.java:748)
Caused: java.io.IOException: Remote call on H44 failed
at hudson.remoting.Channel.call(Channel.java:963)
at hudson.FilePath.act(FilePath.java:1072)
at hudson.FilePath.act(FilePath.java:1061)
at hudson.plugins.findbugs.FindBugsPublisher.perform(FindBugsPublisher.java:144)
at hudson.plugins.analysis.core.HealthAwarePublisher.perform(HealthAwarePublisher.java:69)
at hudson.plugins.analysis.core.HealthAwareRecorder.perform(HealthAwareRecorder.java:298)
at hudson.tasks.BuildStepCompatibilityLayer.perform(BuildStepCompatibilityLayer.java:79)
at hudson.tasks.BuildStepMonitor$1.perform(BuildStepMonitor.java:20)
at hudson.model.AbstractBuild$AbstractBuildExecution.perform(AbstractBuild.java:741)
at hudson.model.AbstractBuild$AbstractBuildExecution.performAllBuildSteps(AbstractBuild.java:690)
at hudson.model.Build$BuildExecution.post2(Build.java:186)
at hudson.model.AbstractBuild$AbstractBuildExecution.post(AbstractBuild.java:635)
at hudson.model.Run.execute(Run.java:1840)
at hudson.model.FreeStyleBuild.run(FreeStyleBuild.java:43)
at hudson.model.ResourceController.execute(ResourceController.java:97)
at hudson.model.Executor.run(Executor.java:429)
Recording test results
ERROR: Step ?Publish JUnit test result report? failed: No test report files were found. Configuration error?
Not sending mail to unregistered user noreply@github.com