You are viewing a plain text version of this content. The canonical link for it is here.
Posted to commits@flex.apache.org by fl...@gmail.com on 2013/07/04 12:24:01 UTC

Build failed in Jenkins: flex-sdk_mustella-mobile #25

See <http://localhost:8080/job/flex-sdk_mustella-mobile/25/>

------------------------------------------
[...truncated 24204 lines...]
     [java] mobile/components/TextArea/Styles/TextArea_styles_tester TextArea_leading_test2 Failed CompareBitmap(body:step 3)  compare returned-3 
     [java] mobile/components/TextArea/Styles/TextArea_styles_tester TextArea_leading_test3 Failed CompareBitmap(body:step 3)  compare returned-3 
     [java] mobile/components/TextArea/Styles/TextArea_styles_tester TextArea_letterSpacing_test1 Failed CompareBitmap(body:step 3)  compare returned-3 
     [java] mobile/components/TextArea/Styles/TextArea_styles_tester TextArea_letterSpacing_test2 Failed CompareBitmap(body:step 3)  compare returned-3 
     [java] mobile/components/TextArea/Styles/TextArea_styles_tester TextArea_letterSpacing_test3 Failed CompareBitmap(body:step 4)  compare returned-3 
     [java] mobile/components/TextArea/Styles/TextArea_styles_tester TextArea_fontFamily_test1 Failed CompareBitmap(body:step 3)  compare returned-3 
     [java] mobile/components/TextInput/Methods/TextInput_Methods_tester TextInput_selectAll_test1 Failed CompareBitmap(body:step 5)  compare returned-4 
     [java] mobile/components/TextInput/Methods/TextInput_Methods_tester TextInput_selectRange_test1 Failed CompareBitmap(body:step 2)  compare returned-4 
     [java] mobile/components/TextInput/Methods/TextInput_Methods_tester TextInput_selectRange_test3 Failed CompareBitmap(body:step 5)  compare returned-4 
     [java] mobile/components/TextInput/Methods/TextInput_Methods_tester TextInput_selectRange_test4 Failed CompareBitmap(body:step 5)  compare returned-4 
     [java] mobile/components/TextInput/Methods/TextInput_Methods_tester TextInput_selectRange_test5 Failed CompareBitmap(body:step 5)  compare returned-4 
     [java] mobile/components/TextInput/Methods/TextInput_Methods_tester TextInput_selectRange_test6 Failed CompareBitmap(body:step 5)  compare returned-4 
     [java] mobile/components/TextInput/Methods/TextInput_Methods_tester TextInput_selectRange_test7 Failed CompareBitmap(body:step 5)  compare returned-4 
     [java] mobile/components/TextInput/Methods/TextInput_Methods_tester TextInput_truncateToFit_test1 Failed CompareBitmap(body:step 5)  compare returned-4 
     [java] mobile/components/TextInput/Methods/TextInput_Methods_tester TextInput_truncateToFit_test2 Failed AssertMethodValue (method cannot be shown)(body:step 4)  method returned Lorem ipsum dolor sit ..., expected Lorem ipsum d... 
     [java] mobile/components/TextInput/Methods/TextInput_Methods_tester TextInput_truncateToFit_test3 Failed AssertMethodValue (method cannot be shown)(body:step 4)  method returned Lorem ipsum dolor sit ..., expected Lorem ipsum d... 
     [java] mobile/components/TextInput/Methods/TextInput_Methods_tester TextInput_truncateToFit_test4 Failed AssertMethodValue (method cannot be shown)(body:step 4)  method returned Lorem ipsum dolor sit ..., expected Lorem ipsum d... 
     [java] mobile/components/TextInput/Methods/TextInput_Methods_tester TextInput_truncateToFit_test5 Failed AssertMethodValue (method cannot be shown)(body:step 4)  method returned Lorem ipsum dolor sit a , expected Lorem ipsum do  
     [java] mobile/components/TextInput/Methods/TextInput_Methods_tester TextInput_truncateToFit_test6 Failed AssertMethodValue (method cannot be shown)(body:step 4)  method returned Lorem ipsum dolor s§¥©, expected Lorem ipsu§¥© 
     [java] mobile/components/TextInput/Methods/TextInput_Methods_tester TextInput_truncateToFit_test7 Failed AssertMethodValue (method cannot be shown)(body:step 4)  method returned Lorem ipsum dolor sit a, expected Lorem ipsum dol 
     [java] mobile/components/TextInput/Methods/TextInput_Methods_tester TextInput_truncateToFit_test8 Failed AssertMethodValue (method cannot be shown)(body:step 4)  method returned Lorem ipsum dolor sit a, expected Lorem ipsum dol 
     [java] mobile/components/TextInput/Methods/TextInput_Methods_tester TextInput_truncateToFit_test9 Failed AssertMethodValue (method cannot be shown)(body:step 4)  method returned Lorem ipsum dolor sit a, expected Lorem ipsum dol 
     [java] mobile/components/TextInput/Properties/TextInput_properties_tester TextInput_basic_prompt Failed CompareBitmap(body:step 3)  compare returned-3 
     [java] mobile/components/TextInput/Properties/TextInput_properties_tester TextInput_prompt_disappears Failed CompareBitmap(body:step 7)  compare returned-3 
     [java] mobile/components/TextInput/Properties/TextInput_properties_tester TextInput_prompt_returns_on_text_removal Failed CompareBitmap(body:step 10)  compare returned-3 
     [java] mobile/components/TextInput/Properties/TextInput_properties_tester TextInput_displayAsPassword_test2 Failed CompareBitmap(body:step 2)  compare returned-3 
     [java] mobile/components/TextInput/Properties/TextInput_properties_tester TextInput_displayAsPassword_test3 Failed CompareBitmap(body:step 2)  compare returned-3 
     [java] mobile/components/TextInput/Properties/TextInput_properties_tester TextInput_selectionActivePosition_property_mouseDown Failed AssertPropertyValue(body:step 2)  tic1.ti1.selectionAnchorPosition 2 != 1 
     [java] mobile/components/TextInput/Properties/TextInput_properties_tester TextInput_text_property Failed CompareBitmap(body:step 3)  compare returned-3 
     [java] mobile/components/TextInput/Properties/TextInput_properties_tester TextInput_text_property_japanese Failed CompareBitmap(body:step 3)  compare returned-3 
     [java] mobile/components/TextInput/Properties/TextInput_properties_tester TextInput_alpha_property_01 Failed CompareBitmap(body:step 2)  compare returned-3 
     [java] mobile/components/TextInput/Properties/TextInput_properties_tester TextInput_alpha_property_0 Failed CompareBitmap(body:step 2)  compare returned-3 
     [java] mobile/components/TextInput/Properties/TextInput_properties_tester TextInput_height_property_40 Failed CompareBitmap(body:step 2)  compare returned-3 
     [java] mobile/components/TextInput/Properties/TextInput_properties_tester TextInput_height_property_10 Failed CompareBitmap(body:step 2)  compare returned-3 
     [java] mobile/components/TextInput/Properties/TextInput_properties_tester TextInput_percentHeight_property_50 Failed CompareBitmap(body:step 3)  compare returned-3 
     [java] mobile/components/TextInput/Properties/TextInput_properties_tester TextInput_percentHeight_property_150 Failed CompareBitmap(body:step 3)  compare returned-3 
     [java] mobile/components/TextInput/Properties/TextInput_properties_tester TextInput_percentWidth_property_50 Failed CompareBitmap(body:step 3)  compare returned[object BitmapData] 
     [java] mobile/components/TextInput/Properties/TextInput_properties_tester TextInput_percentWidth_property_150 Failed CompareBitmap(body:step 3)  compare returned[object BitmapData] 
     [java] mobile/components/TextInput/Properties/TextInput_properties_tester TextInput_rotation_property_90 Failed CompareBitmap(body:step 2)  compare returned[object BitmapData] 
     [java] mobile/components/TextInput/Properties/TextInput_properties_tester TextInput_scaleX_property_2 Failed CompareBitmap(body:step 3)  compare returned[object BitmapData] 
     [java] mobile/components/TextInput/Properties/TextInput_properties_tester TextInput_width_property_default Failed AssertPropertyValue(body:step 1)  tic1.ti1.width 440 != 600 
     [java] mobile/components/TextInput/Properties/TextInput_properties_tester TextInput_width_property_40 Failed CompareBitmap(body:step 2)  compare returned[object BitmapData] 
     [java] mobile/components/TextInput/Properties/TextInput_properties_tester TextInput_width_property_200 Failed CompareBitmap(body:step 2)  compare returned[object BitmapData] 
     [java] mobile/components/TextInput/Properties/TextInput_properties_tester TextInput_x_property_positive Failed CompareBitmap(body:step 4)  compare returned[object BitmapData] 
     [java] mobile/components/TextInput/Properties/TextInput_properties_tester TextInput_x_property_negative Failed CompareBitmap(body:step 3)  compare returned[object BitmapData] 
     [java] mobile/components/TextInput/Properties/TextInput_properties_tester TextInput_y_property_positive Failed CompareBitmap(body:step 4)  compare returned[object BitmapData] 
     [java] mobile/components/TextInput/Properties/TextInput_properties_tester TextInput_y_property_negative Failed CompareBitmap(body:step 3)  compare returned[object BitmapData] 
     [java] mobile/components/TextInput/Properties/TextInput_properties_tester TextInput_baselinePosition_property_preValidation Failed AssertPropertyValue(body:step 1)  tic2.ti1.baselinePosition 36.650000 != 43.700000 
     [java] mobile/components/TextInput/Properties/TextInput_properties_tester TextInput_baselinePosition_property_postValidation Failed AssertPropertyValue(body:step 1)  tic2.ti1.baselinePosition 36.650000 != 43.700000 
     [java] mobile/components/TextInput/Styles/TextInput_styles_tester TextInput_color_test1 Failed CompareBitmap(body:step 1)  compare returned-3 
     [java] mobile/components/TextInput/Styles/TextInput_styles_tester TextInput_color_test2 Failed CompareBitmap(body:step 2)  compare returned-3 
     [java] mobile/components/TextInput/Styles/TextInput_styles_tester TextInput_color_test3 Failed CompareBitmap(body:step 1)  compare returned-3 
     [java] mobile/components/TextInput/Styles/TextInput_styles_tester TextInput_color_test4 Failed CompareBitmap(body:step 3)  compare returned-3 
     [java] mobile/components/TextInput/Styles/TextInput_styles_tester TextInput_color_test5 Failed CompareBitmap(body:step 2)  compare returned-3 
     [java] mobile/components/TextInput/Styles/TextInput_styles_tester TextInput_focusColor_test1 Failed AssertPixelValue(body:step 3)  tic3.grp1 pixel at (10,10) 99FF99 != 0xF7FFF7 
     [java] mobile/components/TextInput/Styles/TextInput_styles_tester TextInput_focusColor_test2 Failed AssertPixelValue(body:step 4)  tic3.grp2 pixel at (10,10) 99FF99 != 0xF7FFF7 
     [java] mobile/components/TextInput/Styles/TextInput_styles_tester TextInput_focusColor_test3 Failed AssertPixelValue(body:step 3)  tic3.grp3 pixel at (10,10) 99FF99 != 0xF7FFF7 
     [java] mobile/components/TextInput/Styles/TextInput_styles_tester TextInput_contentBackgroundColor_test1 Failed CompareBitmap(body:step 2)  compare returned-3 
     [java] mobile/components/TextInput/Styles/TextInput_styles_tester TextInput_contentBackgroundColor_test2 Failed CompareBitmap(body:step 2)  compare returned-3 
     [java] mobile/components/TextInput/Styles/TextInput_styles_tester TextInput_contentBackgroundColor_test3 Failed CompareBitmap(body:step 1)  compare returned-3 
     [java] mobile/components/TextInput/Styles/TextInput_styles_tester TextInput_contentBackgroundColor_test4 Failed CompareBitmap(body:step 3)  compare returned-3 
     [java] mobile/components/TextInput/Styles/TextInput_styles_tester TextInput_textAlign_test1 Failed CompareBitmap(body:step 3)  compare returned-3 
     [java] mobile/components/TextInput/Styles/TextInput_styles_tester TextInput_textAlign_test2 Failed CompareBitmap(body:step 3)  compare returned-3 
     [java] mobile/components/TextInput/Styles/TextInput_styles_tester TextInput_textAlign_test3 Failed CompareBitmap(body:step 3)  compare returned-3 
     [java] mobile/components/TextInput/Styles/TextInput_styles_tester TextInput_textAlign_test4 Failed CompareBitmap(body:step 3)  compare returned-3 
     [java] mobile/components/TextInput/Styles/TextInput_styles_tester TextInput_textAlign_test5 Failed CompareBitmap(body:step 3)  compare returned-3 
     [java] mobile/components/TextInput/Styles/TextInput_styles_tester TextInput_textAlign_test6 Failed CompareBitmap(body:step 1)  compare returned-3 
     [java] mobile/components/TextInput/Styles/TextInput_styles_tester TextInput_fontWeight_test1 Failed CompareBitmap(body:step 3)  compare returned-3 
     [java] mobile/components/TextInput/Styles/TextInput_styles_tester TextInput_fontWeight_test2 Failed CompareBitmap(body:step 3)  compare returned-3 
     [java] mobile/components/TextInput/Styles/TextInput_styles_tester TextInput_fontSize_test1 Failed CompareBitmap(body:step 3)  compare returned-3 
     [java] mobile/components/TextInput/Styles/TextInput_styles_tester TextInput_fontSize_test2 Failed CompareBitmap(body:step 3)  compare returned-3 
     [java] mobile/components/TextInput/Styles/TextInput_styles_tester TextInput_fontSize_test3 Failed CompareBitmap(body:step 3)  compare returned-3 
     [java] mobile/components/TextInput/Styles/TextInput_styles_tester TextInput_fontSize_test4 Failed CompareBitmap(body:step 4)  compare returned-3 
     [java] mobile/components/TextInput/Styles/TextInput_styles_tester TextInput_textDecoration_test1 Failed CompareBitmap(body:step 3)  compare returned-3 
     [java] mobile/components/TextInput/Styles/TextInput_styles_tester TextInput_textDecoration_test2 Failed CompareBitmap(body:step 3)  compare returned-3 
     [java] mobile/components/TextInput/Styles/TextInput_styles_tester TextInput_textIndent_test1 Failed CompareBitmap(body:step 3)  compare returned-3 
     [java] mobile/components/TextInput/Styles/TextInput_styles_tester TextInput_textIndent_test2 Failed CompareBitmap(body:step 3)  compare returned-3 
     [java] mobile/components/TextInput/Styles/TextInput_styles_tester TextInput_textIndent_test3 Failed CompareBitmap(body:step 3)  compare returned-3 
     [java] mobile/components/TextInput/Styles/TextInput_styles_tester TextInput_textIndent_test4 Failed CompareBitmap(body:step 3)  compare returned-3 
     [java] mobile/components/TextInput/Styles/TextInput_styles_tester TextInput_letterSpacing_test1 Failed CompareBitmap(body:step 3)  compare returned-3 
     [java] mobile/components/TextInput/Styles/TextInput_styles_tester TextInput_letterSpacing_test2 Failed CompareBitmap(body:step 3)  compare returned-3 
     [java] mobile/components/TextInput/Styles/TextInput_styles_tester TextInput_letterSpacing_test3 Failed CompareBitmap(body:step 3)  compare returned-3 
     [java] mobile/components/TextInput/Styles/TextInput_styles_tester TextInput_fontFamily_test1 Failed CompareBitmap(body:step 3)  compare returned-3 
     [java] mobile/components/TextInput/Styles/TextInput_styles_tester TextInput_fontFamily_test2 Failed CompareBitmap(body:step 3)  compare returned-3 
     [java] mobile/components/TextInput/Integration/TextInput_States_tester TextInput_states_test1 Failed CompareBitmap(body:step 1)  compare returned-3 
     [java] mobile/components/TextInput/Integration/TextInput_States_tester TextInput_states_test2 Failed CompareBitmap(body:step 2)  compare returned-3 
     [java] mobile/components/TextInput/Integration/TextInput_States_tester TextInput_states_test3 Failed CompareBitmap(body:step 3)  compare returned-3 
     [java] mobile/components/ToggleSwitch/integration/ToggleSwitch_skinning custom_skin_styles Failed CompareBitmap(body:step 1)  Baseline image could not be read.  Created image file as a .bad.png. 
     [java] mobile/components/ToggleSwitch/integration/ToggleSwitch_skinning custom_skin_styles_selected Failed CompareBitmap(body:step 1)  Baseline image could not be read.  Created image file as a .bad.png. 
     [java] mobile/components/ToggleSwitch/integration/ToggleSwitch_skinning custom_skin_French_label Failed CompareBitmap(body:step 1)  Baseline image could not be read.  Created image file as a .bad.png. 
     [java] mobile/components/ToggleSwitch/integration/ToggleSwitch_skinning custom_skin_French_selected Failed CompareBitmap(body:step 1)  Baseline image could not be read.  Created image file as a .bad.png. 
     [java] mobile/components/ToggleSwitch/integration/ToggleSwitch_skinning custom_skin_Japanese_label Failed CompareBitmap(body:step 1)  Baseline image could not be read.  Created image file as a .bad.png. 
     [java] mobile/components/ToggleSwitch/integration/ToggleSwitch_skinning custom_skin_Japanese_selected Failed CompareBitmap(body:step 1)  Baseline image could not be read.  Created image file as a .bad.png. 
     [java] mobile/components/ToggleSwitch/properties/ToggleSwitch_properties width_height_default Failed AssertPropertyValue(body:step 1)  propertiesRoot.target1.width 149 != null 
     [java] mobile/components/ToggleSwitch/properties/ToggleSwitch_properties width_height_MXML Failed CompareBitmap(body:step 3)  Baseline image could not be read.  Created image file as a .bad.png. 
     [java] mobile/components/ToggleSwitch/properties/ToggleSwitch_properties width_height_AS Failed CompareBitmap(body:step 3)  Baseline image could not be read.  Created image file as a .bad.png. 
     [java] mobile/components/ToggleSwitch/properties/ToggleSwitch_properties percentWidth_percentHeight_MXML Failed CompareBitmap(body:step 3)  Baseline image could not be read.  Created image file as a .bad.png. 
     [java] mobile/components/ToggleSwitch/properties/ToggleSwitch_properties percentWidth_percentHeight_AS Failed CompareBitmap(body:step 3)  Baseline image could not be read.  Created image file as a .bad.png. 
     [java] mobile/components/ToggleSwitch/properties/ToggleSwitch_properties scaleX_scaleY_MXML Failed CompareBitmap(body:step 1)  Baseline image could not be read.  Created image file as a .bad.png. 
     [java] mobile/components/ToggleSwitch/properties/ToggleSwitch_properties scaleX_scaleY_AS Failed CompareBitmap(body:step 1)  Baseline image could not be read.  Created image file as a .bad.png. 
     [java] mobile/components/ToggleSwitch/properties/ToggleSwitch_properties enabled_false Failed CompareBitmap(body:step 1)  Baseline image could not be read.  Created image file as a .bad.png. 
     [java] mobile/components/ToggleSwitch/properties/ToggleSwitch_properties enabled_true Failed CompareBitmap(body:step 1)  Baseline image could not be read.  Created image file as a .bad.png. 
     [java] mobile/components/ToggleSwitch/styles/ToggleSwitch_styles styles_accentColor_default Failed CompareBitmap(body:step 2)  Baseline image could not be read.  Created image file as a .bad.png. 
     [java] mobile/components/ToggleSwitch/styles/ToggleSwitch_styles styles_accentColor_AS Failed CompareBitmap(body:step 2)  Baseline image could not be read.  Created image file as a .bad.png. 
     [java] mobile/components/ToggleSwitch/styles/ToggleSwitch_styles styles_chromeColor_default Failed CompareBitmap(body:step 2)  Baseline image could not be read.  Created image file as a .bad.png. 
     [java] mobile/components/ToggleSwitch/styles/ToggleSwitch_styles styles_set_in_MXML Failed CompareBitmap(body:step 1)  Baseline image could not be read.  Created image file as a .bad.png. 
     [java] mobile/components/ToggleSwitch/styles/ToggleSwitch_styles styles_chromeColor_AS Failed CompareBitmap(body:step 2)  Baseline image could not be read.  Created image file as a .bad.png. 
     [java] mobile/components/ToggleSwitch/styles/ToggleSwitch_styles styles_color_default Failed CompareBitmap(body:step 2)  Baseline image could not be read.  Created image file as a .bad.png. 
     [java] mobile/components/ToggleSwitch/styles/ToggleSwitch_styles styles_color_AS Failed CompareBitmap(body:step 2)  Baseline image could not be read.  Created image file as a .bad.png. 
     [java] mobile/components/ToggleSwitch/styles/ToggleSwitch_styles styles_baseColor_mouseOver Failed CompareBitmap(body:step 2)  Baseline image could not be read.  Created image file as a .bad.png. 
     [java] mobile/components/ToggleSwitch/styles/ToggleSwitch_styles styles_baseColor_disabled Failed CompareBitmap(body:step 2)  Baseline image could not be read.  Created image file as a .bad.png. 
     [java] mobile/components/ToggleSwitch/styles/ToggleSwitch_styles styles_color_disabled Failed CompareBitmap(body:step 3)  Baseline image could not be read.  Created image file as a .bad.png. 
     [java] mobile/components/ToggleSwitch/styles/ToggleSwitch_styles styles_fontSize_default Failed AssertStyleValue(body:step 1)  stylesRoot.target1.fontSize 27 != 36 
     [java] mobile/components/ToggleSwitch/styles/ToggleSwitch_styles styles_fontSize_AS Failed CompareBitmap(body:step 2)  Baseline image could not be read.  Created image file as a .bad.png. 
     [java] mobile/components/ToggleSwitch/styles/ToggleSwitch_styles styles_fontStyle_default Failed CompareBitmap(body:step 2)  Baseline image could not be read.  Created image file as a .bad.png. 
     [java] mobile/components/ToggleSwitch/styles/ToggleSwitch_styles styles_fontStyle_AS Failed CompareBitmap(body:step 2)  Baseline image could not be read.  Created image file as a .bad.png. 
     [java] mobile/components/ToggleSwitch/styles/ToggleSwitch_styles styles_fontWeight_default Failed CompareBitmap(body:step 2)  Baseline image could not be read.  Created image file as a .bad.png. 
     [java] mobile/components/ToggleSwitch/styles/ToggleSwitch_styles styles_fontWeight_AS Failed CompareBitmap(body:step 2)  Baseline image could not be read.  Created image file as a .bad.png. 
     [java] mobile/components/ToggleSwitch/styles/ToggleSwitch_styles styles_fontFamily_default Failed CompareBitmap(body:step 2)  Baseline image could not be read.  Created image file as a .bad.png. 
     [java] mobile/components/ToggleSwitch/styles/ToggleSwitch_styles styles_fontFamily_AS Failed CompareBitmap(body:step 2)  Baseline image could not be read.  Created image file as a .bad.png. 
     [java] mobile/components/ToggleSwitch/styles/ToggleSwitch_styles styles_textAlign_default Failed CompareBitmap(body:step 2)  Baseline image could not be read.  Created image file as a .bad.png. 
     [java] mobile/components/ToggleSwitch/styles/ToggleSwitch_styles styles_textAlign_AS Failed CompareBitmap(body:step 2)  Baseline image could not be read.  Created image file as a .bad.png. 
     [java] mobile/components/ToggleSwitch/styles/ToggleSwitch_styles styles_textAlpha_default Failed CompareBitmap(body:step 2)  Baseline image could not be read.  Created image file as a .bad.png. 
     [java] mobile/components/ToggleSwitch/styles/ToggleSwitch_styles styles_textAlpha_AS Failed CompareBitmap(body:step 2)  Baseline image could not be read.  Created image file as a .bad.png. 
     [java] mobile/components/ToggleSwitch/styles/ToggleSwitch_styles styles_textDecoration_default Failed CompareBitmap(body:step 2)  Baseline image could not be read.  Created image file as a .bad.png. 
     [java] mobile/components/ToggleSwitch/styles/ToggleSwitch_styles styles_textDecoration_AS Failed CompareBitmap(body:step 2)  Baseline image could not be read.  Created image file as a .bad.png. 
     [java] mobile/components/ToggleSwitch/styles/ToggleSwitch_styles styles_lineHeight_default Failed CompareBitmap(body:step 2)  Baseline image could not be read.  Created image file as a .bad.png. 
     [java] mobile/components/ToggleSwitch/styles/ToggleSwitch_styles styles_lineHeight_AS Failed CompareBitmap(body:step 2)  Baseline image could not be read.  Created image file as a .bad.png. 
     [java] mobile/components/ToggleSwitch/styles/ToggleSwitch_styles styles_lineThrough_default Failed CompareBitmap(body:step 2)  Baseline image could not be read.  Created image file as a .bad.png. 
     [java] mobile/components/ToggleSwitch/styles/ToggleSwitch_styles styles_lineThrough_AS Failed CompareBitmap(body:step 2)  Baseline image could not be read.  Created image file as a .bad.png. 
     [java] mobile/components/ToggleSwitch/styles/ToggleSwitch_CSS CSS_accentColor_typeselector Failed CompareBitmap(body:step 2)  Baseline image could not be read.  Created image file as a .bad.png. 
     [java] mobile/components/ToggleSwitch/styles/ToggleSwitch_CSS CSS_set_in_MXML Failed CompareBitmap(body:step 1)  Baseline image could not be read.  Created image file as a .bad.png. 
     [java] mobile/components/ToggleSwitch/styles/ToggleSwitch_CSS CSS_accentColor_AS Failed CompareBitmap(body:step 2)  Baseline image could not be read.  Created image file as a .bad.png. 
     [java] mobile/components/ToggleSwitch/styles/ToggleSwitch_CSS CSS_chromeColor_default Failed CompareBitmap(body:step 2)  Baseline image could not be read.  Created image file as a .bad.png. 
     [java] mobile/components/ToggleSwitch/styles/ToggleSwitch_CSS CSS_chromeColor_AS Failed CompareBitmap(body:step 2)  Baseline image could not be read.  Created image file as a .bad.png. 
     [java] mobile/components/ToggleSwitch/styles/ToggleSwitch_CSS CSS_color_default Failed CompareBitmap(body:step 2)  Baseline image could not be read.  Created image file as a .bad.png. 
     [java] mobile/components/ToggleSwitch/styles/ToggleSwitch_CSS CSS_color_AS Failed CompareBitmap(body:step 2)  Baseline image could not be read.  Created image file as a .bad.png. 
     [java] mobile/components/ToggleSwitch/styles/ToggleSwitch_CSS CSS_color_disabled Failed CompareBitmap(body:step 3)  Baseline image could not be read.  Created image file as a .bad.png. 
     [java] mobile/components/ToggleSwitch/styles/ToggleSwitch_CSS CSS_fontSize_default Failed AssertStyleValue(body:step 1)  stylesRoot.target1.fontSize 27 != 36 
     [java] mobile/components/ToggleSwitch/styles/ToggleSwitch_CSS CSS_fontSize_AS Failed CompareBitmap(body:step 2)  Baseline image could not be read.  Created image file as a .bad.png. 
     [java] mobile/components/ToggleSwitch/styles/ToggleSwitch_CSS CSS_fontStyle_default Failed CompareBitmap(body:step 2)  Baseline image could not be read.  Created image file as a .bad.png. 
     [java] mobile/components/ToggleSwitch/styles/ToggleSwitch_CSS CSS_fontStyle_AS Failed CompareBitmap(body:step 2)  Baseline image could not be read.  Created image file as a .bad.png. 
     [java] mobile/components/ToggleSwitch/styles/ToggleSwitch_CSS CSS_fontWeight_default Failed CompareBitmap(body:step 2)  Baseline image could not be read.  Created image file as a .bad.png. 
     [java] mobile/components/ToggleSwitch/styles/ToggleSwitch_CSS CSS_fontWeight_AS Failed CompareBitmap(body:step 2)  Baseline image could not be read.  Created image file as a .bad.png. 
     [java] mobile/components/ToggleSwitch/styles/ToggleSwitch_CSS CSS_fontFamily_default Failed CompareBitmap(body:step 2)  Baseline image could not be read.  Created image file as a .bad.png. 
     [java] mobile/components/ToggleSwitch/styles/ToggleSwitch_CSS CSS_fontFamily_AS Failed CompareBitmap(body:step 2)  Baseline image could not be read.  Created image file as a .bad.png. 
     [java] mobile/components/ToggleSwitch/styles/ToggleSwitch_CSS CSS_textAlign_default Failed CompareBitmap(body:step 2)  Baseline image could not be read.  Created image file as a .bad.png. 
     [java] mobile/components/ToggleSwitch/styles/ToggleSwitch_CSS CSS_textAlign_AS Failed CompareBitmap(body:step 2)  Baseline image could not be read.  Created image file as a .bad.png. 
     [java] mobile/components/ToggleSwitch/styles/ToggleSwitch_CSS CSS_textAlpha_default Failed CompareBitmap(body:step 2)  Baseline image could not be read.  Created image file as a .bad.png. 
     [java] mobile/components/ToggleSwitch/styles/ToggleSwitch_CSS CSS_textAlpha_AS Failed CompareBitmap(body:step 2)  Baseline image could not be read.  Created image file as a .bad.png. 
     [java] mobile/components/ToggleSwitch/styles/ToggleSwitch_CSS CSS_textDecoration_default Failed CompareBitmap(body:step 2)  Baseline image could not be read.  Created image file as a .bad.png. 
     [java] mobile/components/ToggleSwitch/styles/ToggleSwitch_CSS CSS_textDecoration_AS Failed CompareBitmap(body:step 2)  Baseline image could not be read.  Created image file as a .bad.png. 
     [java] mobile/components/ToggleSwitch/styles/ToggleSwitch_CSS CSS_lineHeight_default Failed CompareBitmap(body:step 2)  Baseline image could not be read.  Created image file as a .bad.png. 
     [java] mobile/components/ToggleSwitch/styles/ToggleSwitch_CSS CSS_lineHeight_AS Failed CompareBitmap(body:step 2)  Baseline image could not be read.  Created image file as a .bad.png. 
     [java] mobile/components/ToggleSwitch/styles/ToggleSwitch_CSS CSS_lineThrough_default Failed CompareBitmap(body:step 2)  Baseline image could not be read.  Created image file as a .bad.png. 
     [java] mobile/components/ToggleSwitch/styles/ToggleSwitch_CSS CSS_lineThrough_AS Failed CompareBitmap(body:step 2)  Baseline image could not be read.  Created image file as a .bad.png. 
     [java] mobile/components/ToggleSwitch/styles/ToggleSwitch_advancedCSS advancedCSS_typeselector_unselected Failed CompareBitmap(body:step 1)  Baseline image could not be read.  Created image file as a .bad.png. 
     [java] mobile/components/ToggleSwitch/styles/ToggleSwitch_advancedCSS advancedCSS_typeselector_selected Failed CompareBitmap(body:step 1)  Baseline image could not be read.  Created image file as a .bad.png. 
     [java] mobile/components/ToggleSwitch/styles/ToggleSwitch_advancedCSS advancedCSS_classselector_unselected Failed CompareBitmap(body:step 1)  Baseline image could not be read.  Created image file as a .bad.png. 
     [java] mobile/components/ToggleSwitch/styles/ToggleSwitch_advancedCSS advancedCSS_classselector_selected Failed CompareBitmap(body:step 1)  Baseline image could not be read.  Created image file as a .bad.png. 
     [java] mobile/components/ToggleSwitch/styles/ToggleSwitch_advancedCSS advancedCSS_advancedselector_unselected Failed CompareBitmap(body:step 1)  Baseline image could not be read.  Created image file as a .bad.png. 
     [java] mobile/components/ToggleSwitch/styles/ToggleSwitch_advancedCSS advancedCSS_advancedselector_selected Failed CompareBitmap(body:step 1)  Baseline image could not be read.  Created image file as a .bad.png. 
     [java] mobile/components/ViewMenu/integration/ViewMenu_Integration3 ThreeButtonsMenuPortrait1 Failed CompareBitmap(body:step 6)  Baseline image could not be read.  Created image file as a .bad.png. 
     [java] mobile/components/ViewMenu/integration/ViewMenu_Integration3 ThreeButtonsMenuPortrait2 Failed CompareBitmap(body:step 9)  Baseline image could not be read.  Created image file as a .bad.png. 
     [java] mobile/components/ViewMenu/integration/ViewMenu_Integration3 ThreeButtonsMenuPortrait3 Failed CompareBitmap(body:step 14)  Baseline image could not be read.  Created image file as a .bad.png. 
     [java] mobile/components/ViewMenu/integration/ViewMenu_Integration3 ThreeButtonsMenuPortrait4 Failed CompareBitmap(body:step 14)  Baseline image could not be read.  Created image file as a .bad.png. 
     [java] mobile/components/ViewMenu/integration/ViewMenu_Integration3 ThreeButtonsMenuPortrait6 Failed CompareBitmap(body:step 5)  Baseline image could not be read.  Created image file as a .bad.png. 
     [java] mobile/components/ViewMenu/integration/ViewMenu_Integration3 ThreeButtonsMenuPortrait7 Failed CompareBitmap(body:step 6)  Baseline image could not be read.  Created image file as a .bad.png. 
     [java] mobile/components/ViewMenu/integration/ViewMenu_Integration3 ThreeButtonsMenuPortrait8 Failed CompareBitmap(body:step 6)  Baseline image could not be read.  Created image file as a .bad.png. 
     [java] mobile/components/ViewMenu/integration/ViewMenu_Integration3 ThreeButtonsMenuPortrait9 Failed CompareBitmap(body:step 6)  Baseline image could not be read.  Created image file as a .bad.png. 
     [java] mobile/components/ViewMenu/integration/ViewMenu_Integration4 FourItemsMenuPortrait1 Failed CompareBitmap(body:step 6)  Baseline image could not be read.  Created image file as a .bad.png. 
     [java] mobile/components/ViewMenu/integration/ViewMenu_Integration4 FourItemsMenuPortrait2 Failed CompareBitmap(body:step 9)  Baseline image could not be read.  Created image file as a .bad.png. 
     [java] mobile/components/ViewMenu/integration/ViewMenu_Integration4 FourItemsMenuPortrait3 Failed CompareBitmap(body:step 14)  Baseline image could not be read.  Created image file as a .bad.png. 
     [java] mobile/components/ViewMenu/integration/ViewMenu_Integration4 FourItemsMenuPortrait4 Failed CompareBitmap(body:step 14)  Baseline image could not be read.  Created image file as a .bad.png. 
     [java] mobile/components/ViewMenu/integration/ViewMenu_Integration4 FourItemsMenuPortrait5 Failed CompareBitmap(body:step 7)  Baseline image could not be read.  Created image file as a .bad.png. 
     [java] mobile/components/ViewMenu/integration/ViewMenu_Integration4 FourItemsMenuPortrait6 Failed CompareBitmap(body:step 9)  Baseline image could not be read.  Created image file as a .bad.png. 
     [java] mobile/components/ViewMenu/integration/ViewMenu_Integration4 FourItemsMenuPortrait7 Failed CompareBitmap(body:step 9)  Baseline image could not be read.  Created image file as a .bad.png. 
     [java] mobile/components/ViewMenu/integration/ViewMenu_Integration4 FourItemsMenuPortrait8 Failed CompareBitmap(body:step 6)  compare returned-3 
     [java] mobile/components/ViewMenu/integration/ViewMenu_Integration4 FourItemsMenuPortrait9 Failed CompareBitmap(body:step 6)  Baseline image could not be read.  Created image file as a .bad.png. 
     [java] mobile/components/ViewMenu/integration/ViewMenu_Integration5 FiveItemsMenuPortrait1 Failed CompareBitmap(body:step 12)  Baseline image could not be read.  Created image file as a .bad.png. 
     [java] mobile/components/ViewMenu/integration/ViewMenu_Integration5 FiveItemsMenuPortrait2 Failed CompareBitmap(body:step 5)  Baseline image could not be read.  Created image file as a .bad.png. 
     [java] mobile/components/ViewMenu/integration/ViewMenu_Integration5 FiveItemsMenuPortrait3 Failed CompareBitmap(body:step 14)  Baseline image could not be read.  Created image file as a .bad.png. 
     [java] mobile/components/ViewMenu/integration/ViewMenu_Integration5 FiveItemsMenuPortrait4 Failed CompareBitmap(body:step 14)  Baseline image could not be read.  Created image file as a .bad.png. 
     [java] mobile/components/ViewMenu/integration/ViewMenu_Integration5 FiveItemsMenuPortrait5 Failed CompareBitmap(body:step 8)  Baseline image could not be read.  Created image file as a .bad.png. 
     [java] mobile/components/ViewMenu/integration/ViewMenu_Integration5 FiveItemsMenuPortrait6 Failed CompareBitmap(body:step 5)  Baseline image could not be read.  Created image file as a .bad.png. 
     [java] mobile/components/ViewMenu/integration/ViewMenu_Integration5 FiveItemsMenuPortrait7 Failed CompareBitmap(body:step 9)  Baseline image could not be read.  Created image file as a .bad.png. 
     [java] mobile/components/ViewMenu/integration/ViewMenu_Integration5 FiveItemsMenuPortrait8 Failed CompareBitmap(body:step 6)  Baseline image could not be read.  Created image file as a .bad.png. 
     [java] mobile/components/ViewMenu/integration/ViewMenu_Integration5 FiveItemsMenuPortrait9 Failed CompareBitmap(body:step 5)  Baseline image could not be read.  Created image file as a .bad.png. 
     [java] mobile/components/ViewMenu/integration/ViewMenu_Integration6 SixItemsMenuPortrait1 Failed CompareBitmap(body:step 12)  Baseline image could not be read.  Created image file as a .bad.png. 
     [java] mobile/components/ViewMenu/integration/ViewMenu_Integration6 SixItemsMenuPortrait2 Failed CompareBitmap(body:step 5)  Baseline image could not be read.  Created image file as a .bad.png. 
     [java] mobile/components/ViewMenu/integration/ViewMenu_Integration6 SixItemsMenuPortrait3 Failed CompareBitmap(body:step 14)  Baseline image could not be read.  Created image file as a .bad.png. 
     [java] mobile/components/ViewMenu/integration/ViewMenu_Integration6 SixItemsMenuPortrait4 Failed CompareBitmap(body:step 14)  Baseline image could not be read.  Created image file as a .bad.png. 
     [java] mobile/components/ViewMenu/integration/ViewMenu_Integration6 SixItemsMenuPortrait5 Failed CompareBitmap(body:step 8)  Baseline image could not be read.  Created image file as a .bad.png. 
     [java] mobile/components/ViewMenu/integration/ViewMenu_Integration6 SixItemsMenuPortrait6 Failed CompareBitmap(body:step 5)  Baseline image could not be read.  Created image file as a .bad.png. 
     [java] mobile/components/ViewMenu/integration/ViewMenu_Integration6 SixItemsMenuPortrait7 Failed CompareBitmap(body:step 9)  Baseline image could not be read.  Created image file as a .bad.png. 
     [java] mobile/components/ViewMenu/integration/ViewMenu_Integration6 SixItemsMenuPortrait8 Failed CompareBitmap(body:step 6)  Baseline image could not be read.  Created image file as a .bad.png. 
     [java] mobile/components/ViewMenu/integration/ViewMenu_Integration6 SixItemsMenuPortrait9 Failed CompareBitmap(body:step 5)  Baseline image could not be read.  Created image file as a .bad.png. 
     [java] mobile/components/ViewMenu/integration/ViewMenu_Integration6 SixItemsMenuPortrait10 Failed CompareBitmap(body:step 7)  Baseline image could not be read.  Created image file as a .bad.png. 
     [java] mobile/components/ViewMenu/integration/ViewMenu_Integration7 SevenItemsMenuPortrait1 Failed CompareBitmap(body:step 12)  Baseline image could not be read.  Created image file as a .bad.png. 
     [java] mobile/components/ViewMenu/integration/ViewMenu_Integration7 SevenItemsMenuPortrait3 Failed CompareBitmap(body:step 14)  Baseline image could not be read.  Created image file as a .bad.png. 
     [java] mobile/components/ViewMenu/properties/ViewMenu_Properties1 OneViewMenuButtonPortrait1 Failed CompareBitmap(body:step 5)  Baseline image could not be read.  Created image file as a .bad.png. 
     [java] mobile/components/ViewMenu/properties/ViewMenu_Properties1 OneViewMenuButtonPortrait2 Failed CompareBitmap(body:step 5)  Baseline image could not be read.  Created image file as a .bad.png. 
     [java] mobile/components/ViewMenu/properties/ViewMenu_Properties1 OneViewMenuButtonPortrait3 Failed CompareBitmap(body:step 5)  Baseline image could not be read.  Created image file as a .bad.png. 
     [java] mobile/components/ViewMenu/properties/ViewMenu_Properties1 OneViewMenuButtonPortrait5 Failed CompareBitmap(body:step 10)  Baseline image could not be read.  Created image file as a .bad.png. 
     [java] mobile/components/ViewMenu/properties/ViewMenu_Properties1 OneViewMenuButtonPortrait6 Failed CompareBitmap(body:step 5)  Baseline image could not be read.  Created image file as a .bad.png. 
     [java] mobile/components/ViewMenu/properties/ViewMenu_Properties2 TwoButtonsMenuPortrait1 Failed CompareBitmap(body:step 6)  Baseline image could not be read.  Created image file as a .bad.png. 
     [java] mobile/components/ViewMenu/properties/ViewMenu_Properties2 TwoButtonsMenuPortrait2 Failed CompareBitmap(body:step 5)  Baseline image could not be read.  Created image file as a .bad.png. 
     [java] mobile/components/ViewMenu/properties/ViewMenu_Properties2 TwoButtonsMenuPortrait3 Failed CompareBitmap(body:step 5)  Baseline image could not be read.  Created image file as a .bad.png. 
     [java] mobile/components/ViewMenu/properties/ViewMenu_Properties2 TwoButtonsMenuPortrait8 Failed CompareBitmap(body:step 5)  Baseline image could not be read.  Created image file as a .bad.png. 
     [java] mobile/components/ViewMenu/properties/ViewMenu_Properties2 TwoButtonsMenuPortrait9 Failed CompareBitmap(body:step 6)  Baseline image could not be read.  Created image file as a .bad.png. 
     [java] mobile/components/ViewMenu/properties/ViewMenu_Properties2 TwoButtonsMenuPortrait10 Failed CompareBitmap(body:step 8)  Baseline image could not be read.  Created image file as a .bad.png. 
     [java] mobile/components/ViewMenu/properties/ViewMenu_Properties2 TwoButtonsMenuPortrait11 Failed CompareBitmap(body:step 6)  Baseline image could not be read.  Created image file as a .bad.png. 
     [java] mobile/components/ViewMenu/properties/ViewMenu_Properties2 TwoButtonsMenuPortrait12 Failed CompareBitmap(body:step 6)  Baseline image could not be read.  Created image file as a .bad.png. 
     [java] mobile/components/ViewMenu/properties/ViewMenu_Properties2 TwoButtonsMenuPortrait13 Failed CompareBitmap(body:step 6)  Baseline image could not be read.  Created image file as a .bad.png. 
     [java] mobile/components/ViewMenu/properties/ViewMenu_Properties2 TwoButtonsMenuPortrait14 Failed CompareBitmap(body:step 5)  Baseline image could not be read.  Created image file as a .bad.png. 
     [java] mobile/components/ViewMenu/integration/ViewMenu_CustomSkinTester CustomSkinSevenItemsMenuPortrait1 Failed CompareBitmap(body:step 3)  Baseline image could not be read.  Created image file as a .bad.png. 
     [java] mobile/components/ViewMenu/integration/ViewMenu_CustomSkinTester CustomSkinSevenItemsMenuPortrait2 Failed RunCode(body:step 1)  Timeout waiting for viewMenuOpen from navigator.activeView 
     [java] mobile/components/ViewMenu/integration/ViewMenuScaleTester ViewMenu240Scale Failed CompareBitmap(body:step 5)  Baseline image could not be read.  Created image file as a .bad.png. 
     [java] mobile/components/ViewMenu/integration/ViewMenuScaleTester BusyIndicator240Scale Failed CompareBitmap(body:step 4)  Baseline image could not be read.  Created image file as a .bad.png. 
     [java] mobile/utils/MultiDPIBitmapSource/integration/MultiDPIBitmapSource_integration MultiDPIBitmapSource_integ_160_embed Failed CompareBitmap(body:step 2)  compare returned[object BitmapData] 
     [java] mobile/utils/MultiDPIBitmapSource/integration/MultiDPIBitmapSource_integration MultiDPIBitmapSource_integ_160_refer Failed CompareBitmap(body:step 2)  compare returned[object BitmapData] 
     [java] mobile/utils/MultiDPIBitmapSource/integration/MultiDPIBitmapSource_integration MultiDPIBitmapSource_integ_240_embed Failed CompareBitmap(body:step 2)  compare returned[object BitmapData] 
     [java] mobile/utils/MultiDPIBitmapSource/integration/MultiDPIBitmapSource_integration MultiDPIBitmapSource_integ_240_refer Failed CompareBitmap(body:step 2)  compare returned[object BitmapData] 
     [java] mobile/utils/MultiDPIBitmapSource/integration/MultiDPIBitmapSource_integration MultiDPIBitmapSource_integ_320_embed Failed CompareBitmap(body:step 2)  compare returned[object BitmapData] 
     [java] mobile/utils/MultiDPIBitmapSource/integration/MultiDPIBitmapSource_integration MultiDPIBitmapSource_integ_320_refer Failed CompareBitmap(body:step 2)  compare returned[object BitmapData] 
     [java] mobile/utils/MultiDPIBitmapSource/properties/MultiDPIBitmapSource_properties MultiDPIBitmapSource_nominal_embed Failed CompareBitmap(body:step 2)  compare returned-3 
     [java] mobile/utils/MultiDPIBitmapSource/properties/MultiDPIBitmapSource_properties MultiDPIBitmapSource_nominal_refer Failed CompareBitmap(body:step 2)  compare returned-3 
     [java] mobile/utils/MultiDPIBitmapSource/properties/MultiDPIBitmapSource_properties MultiDPIBitmapSource_no_160_embed Failed CompareBitmap(body:step 2)  compare returned-3 
     [java] mobile/utils/MultiDPIBitmapSource/properties/MultiDPIBitmapSource_properties MultiDPIBitmapSource_no_160_refer Failed CompareBitmap(body:step 2)  compare returned-3 
     [java] mobile/utils/MultiDPIBitmapSource/integration/MultiDPIBitmapSource_scaling MultiDPIBitmapSource_scaling_refer Failed CompareBitmap(body:step 2)  compare returned-3 
     [java] mobile/utils/MultiDPIBitmapSource/integration/MultiDPIBitmapSource_scaling MultiDPIBitmapSource_scaling_embed Failed CompareBitmap(body:step 2)  compare returned-3 
     [java] 
     [java] 
     [java] =====================================================
     [java]     Passes: 0
     [java]     Fails: 1606
     [java] =====================================================
     [java] 
     [java] 
     [java] Wrote summary to results.txt
     [java] Wrote failures to failures.txt

BUILD FAILED
C:\jenkins_slave\workspace\flex-sdk_mustella-mobile\mustella\build.xml:1538: The following error occurred while executing this line:
C:\jenkins_slave\workspace\flex-sdk_mustella-mobile\mustella\build.xml:1656: Java returned: 1

Total time: 35 minutes 34 seconds
Some of tests failed, even after running '-failures'...
Build step 'Execute shell' marked build as failure

Re: Jenkins build is back to normal : flex-sdk_mustella-mobile #30

Posted by Erik de Bruin <er...@ixsoftware.nl>.
Way to go Alex!

One suite down, two to go…

EdB



On Saturday, July 6, 2013, wrote:

> See <http://localhost:8080/job/flex-sdk_mustella-mobile/30/changes>
>
>

-- 
Ix Multimedia Software

Jan Luykenstraat 27
3521 VB Utrecht

T. 06-51952295
I. www.ixsoftware.nl

Jenkins build is back to normal : flex-sdk_mustella-mobile #30

Posted by fl...@gmail.com.
See <http://localhost:8080/job/flex-sdk_mustella-mobile/30/changes>


Build failed in Jenkins: flex-sdk_mustella-mobile #29

Posted by fl...@gmail.com.
See <http://localhost:8080/job/flex-sdk_mustella-mobile/29/changes>

Changes:

[aharui] support mxml.children-as-data mainstream SDK

[aharui] changes to try to get mobile tests to pass

------------------------------------------
[...truncated 24161 lines...]
     [java] mobile/components/TextArea/Styles/TextArea_styles_tester TextArea_letterSpacing_test1 Failed CompareBitmap(body:step 3)  compare returned-3 
     [java] mobile/components/TextArea/Styles/TextArea_styles_tester TextArea_letterSpacing_test2 Failed CompareBitmap(body:step 3)  compare returned-3 
     [java] mobile/components/TextArea/Styles/TextArea_styles_tester TextArea_letterSpacing_test3 Failed CompareBitmap(body:step 4)  compare returned-3 
     [java] mobile/components/TextArea/Styles/TextArea_styles_tester TextArea_fontFamily_test1 Failed CompareBitmap(body:step 3)  compare returned-3 
     [java] mobile/components/TextInput/Methods/TextInput_Methods_tester TextInput_selectAll_test1 Failed CompareBitmap(body:step 5)  compare returned-4 
     [java] mobile/components/TextInput/Methods/TextInput_Methods_tester TextInput_selectRange_test1 Failed CompareBitmap(body:step 2)  compare returned-4 
     [java] mobile/components/TextInput/Methods/TextInput_Methods_tester TextInput_selectRange_test3 Failed CompareBitmap(body:step 5)  compare returned-4 
     [java] mobile/components/TextInput/Methods/TextInput_Methods_tester TextInput_selectRange_test4 Failed CompareBitmap(body:step 5)  compare returned-4 
     [java] mobile/components/TextInput/Methods/TextInput_Methods_tester TextInput_selectRange_test5 Failed CompareBitmap(body:step 5)  compare returned-4 
     [java] mobile/components/TextInput/Methods/TextInput_Methods_tester TextInput_selectRange_test6 Failed CompareBitmap(body:step 5)  compare returned-4 
     [java] mobile/components/TextInput/Methods/TextInput_Methods_tester TextInput_selectRange_test7 Failed CompareBitmap(body:step 5)  compare returned-4 
     [java] mobile/components/TextInput/Methods/TextInput_Methods_tester TextInput_truncateToFit_test1 Failed CompareBitmap(body:step 5)  compare returned-4 
     [java] mobile/components/TextInput/Methods/TextInput_Methods_tester TextInput_truncateToFit_test2 Failed AssertMethodValue (method cannot be shown)(body:step 4)  method returned Lorem ipsum dolor sit ..., expected Lorem ipsum d... 
     [java] mobile/components/TextInput/Methods/TextInput_Methods_tester TextInput_truncateToFit_test3 Failed AssertMethodValue (method cannot be shown)(body:step 4)  method returned Lorem ipsum dolor sit ..., expected Lorem ipsum d... 
     [java] mobile/components/TextInput/Methods/TextInput_Methods_tester TextInput_truncateToFit_test4 Failed AssertMethodValue (method cannot be shown)(body:step 4)  method returned Lorem ipsum dolor sit ..., expected Lorem ipsum d... 
     [java] mobile/components/TextInput/Methods/TextInput_Methods_tester TextInput_truncateToFit_test5 Failed AssertMethodValue (method cannot be shown)(body:step 4)  method returned Lorem ipsum dolor sit a , expected Lorem ipsum do  
     [java] mobile/components/TextInput/Methods/TextInput_Methods_tester TextInput_truncateToFit_test6 Failed AssertMethodValue (method cannot be shown)(body:step 4)  method returned Lorem ipsum dolor s§¥©, expected Lorem ipsu§¥© 
     [java] mobile/components/TextInput/Methods/TextInput_Methods_tester TextInput_truncateToFit_test7 Failed AssertMethodValue (method cannot be shown)(body:step 4)  method returned Lorem ipsum dolor sit a, expected Lorem ipsum dol 
     [java] mobile/components/TextInput/Methods/TextInput_Methods_tester TextInput_truncateToFit_test8 Failed AssertMethodValue (method cannot be shown)(body:step 4)  method returned Lorem ipsum dolor sit a, expected Lorem ipsum dol 
     [java] mobile/components/TextInput/Methods/TextInput_Methods_tester TextInput_truncateToFit_test9 Failed AssertMethodValue (method cannot be shown)(body:step 4)  method returned Lorem ipsum dolor sit a, expected Lorem ipsum dol 
     [java] mobile/components/TextInput/Properties/TextInput_properties_tester TextInput_basic_prompt Failed CompareBitmap(body:step 3)  compare returned-3 
     [java] mobile/components/TextInput/Properties/TextInput_properties_tester TextInput_prompt_disappears Failed CompareBitmap(body:step 7)  compare returned-3 
     [java] mobile/components/TextInput/Properties/TextInput_properties_tester TextInput_prompt_returns_on_text_removal Failed CompareBitmap(body:step 10)  compare returned-3 
     [java] mobile/components/TextInput/Properties/TextInput_properties_tester TextInput_displayAsPassword_test2 Failed CompareBitmap(body:step 2)  compare returned-3 
     [java] mobile/components/TextInput/Properties/TextInput_properties_tester TextInput_displayAsPassword_test3 Failed CompareBitmap(body:step 2)  compare returned-3 
     [java] mobile/components/TextInput/Properties/TextInput_properties_tester TextInput_selectionActivePosition_property_mouseDown Failed AssertPropertyValue(body:step 2)  tic1.ti1.selectionAnchorPosition 2 != 1 
     [java] mobile/components/TextInput/Properties/TextInput_properties_tester TextInput_text_property Failed CompareBitmap(body:step 3)  compare returned-3 
     [java] mobile/components/TextInput/Properties/TextInput_properties_tester TextInput_text_property_japanese Failed CompareBitmap(body:step 3)  compare returned-3 
     [java] mobile/components/TextInput/Properties/TextInput_properties_tester TextInput_alpha_property_01 Failed CompareBitmap(body:step 2)  compare returned-3 
     [java] mobile/components/TextInput/Properties/TextInput_properties_tester TextInput_alpha_property_0 Failed CompareBitmap(body:step 2)  compare returned-3 
     [java] mobile/components/TextInput/Properties/TextInput_properties_tester TextInput_height_property_40 Failed CompareBitmap(body:step 2)  compare returned-3 
     [java] mobile/components/TextInput/Properties/TextInput_properties_tester TextInput_height_property_10 Failed CompareBitmap(body:step 2)  compare returned-3 
     [java] mobile/components/TextInput/Properties/TextInput_properties_tester TextInput_percentHeight_property_50 Failed CompareBitmap(body:step 3)  compare returned-3 
     [java] mobile/components/TextInput/Properties/TextInput_properties_tester TextInput_percentHeight_property_150 Failed CompareBitmap(body:step 3)  compare returned-3 
     [java] mobile/components/TextInput/Properties/TextInput_properties_tester TextInput_percentWidth_property_50 Failed CompareBitmap(body:step 3)  compare returned[object BitmapData] 
     [java] mobile/components/TextInput/Properties/TextInput_properties_tester TextInput_percentWidth_property_150 Failed CompareBitmap(body:step 3)  compare returned[object BitmapData] 
     [java] mobile/components/TextInput/Properties/TextInput_properties_tester TextInput_rotation_property_90 Failed CompareBitmap(body:step 2)  compare returned[object BitmapData] 
     [java] mobile/components/TextInput/Properties/TextInput_properties_tester TextInput_scaleX_property_2 Failed CompareBitmap(body:step 3)  compare returned[object BitmapData] 
     [java] mobile/components/TextInput/Properties/TextInput_properties_tester TextInput_width_property_default Failed AssertPropertyValue(body:step 1)  tic1.ti1.width 440 != 600 
     [java] mobile/components/TextInput/Properties/TextInput_properties_tester TextInput_width_property_40 Failed CompareBitmap(body:step 2)  compare returned[object BitmapData] 
     [java] mobile/components/TextInput/Properties/TextInput_properties_tester TextInput_width_property_200 Failed CompareBitmap(body:step 2)  compare returned[object BitmapData] 
     [java] mobile/components/TextInput/Properties/TextInput_properties_tester TextInput_x_property_positive Failed CompareBitmap(body:step 4)  compare returned[object BitmapData] 
     [java] mobile/components/TextInput/Properties/TextInput_properties_tester TextInput_x_property_negative Failed CompareBitmap(body:step 3)  compare returned[object BitmapData] 
     [java] mobile/components/TextInput/Properties/TextInput_properties_tester TextInput_y_property_positive Failed CompareBitmap(body:step 4)  compare returned[object BitmapData] 
     [java] mobile/components/TextInput/Properties/TextInput_properties_tester TextInput_y_property_negative Failed CompareBitmap(body:step 3)  compare returned[object BitmapData] 
     [java] mobile/components/TextInput/Properties/TextInput_properties_tester TextInput_baselinePosition_property_preValidation Failed AssertPropertyValue(body:step 1)  tic2.ti1.baselinePosition 36.650000 != 43.700000 
     [java] mobile/components/TextInput/Properties/TextInput_properties_tester TextInput_baselinePosition_property_postValidation Failed AssertPropertyValue(body:step 1)  tic2.ti1.baselinePosition 36.650000 != 43.700000 
     [java] mobile/components/TextInput/Styles/TextInput_styles_tester TextInput_color_test1 Failed CompareBitmap(body:step 1)  compare returned-3 
     [java] mobile/components/TextInput/Styles/TextInput_styles_tester TextInput_color_test2 Failed CompareBitmap(body:step 2)  compare returned-3 
     [java] mobile/components/TextInput/Styles/TextInput_styles_tester TextInput_color_test3 Failed CompareBitmap(body:step 1)  compare returned-3 
     [java] mobile/components/TextInput/Styles/TextInput_styles_tester TextInput_color_test4 Failed CompareBitmap(body:step 3)  compare returned-3 
     [java] mobile/components/TextInput/Styles/TextInput_styles_tester TextInput_color_test5 Failed CompareBitmap(body:step 2)  compare returned-3 
     [java] mobile/components/TextInput/Styles/TextInput_styles_tester TextInput_focusColor_test1 Failed AssertPixelValue(body:step 3)  tic3.grp1 pixel at (10,10) 99FF99 != 0xF7FFF7 
     [java] mobile/components/TextInput/Styles/TextInput_styles_tester TextInput_focusColor_test2 Failed AssertPixelValue(body:step 4)  tic3.grp2 pixel at (10,10) 99FF99 != 0xF7FFF7 
     [java] mobile/components/TextInput/Styles/TextInput_styles_tester TextInput_focusColor_test3 Failed AssertPixelValue(body:step 3)  tic3.grp3 pixel at (10,10) 99FF99 != 0xF7FFF7 
     [java] mobile/components/TextInput/Styles/TextInput_styles_tester TextInput_contentBackgroundColor_test1 Failed CompareBitmap(body:step 2)  compare returned-3 
     [java] mobile/components/TextInput/Styles/TextInput_styles_tester TextInput_contentBackgroundColor_test2 Failed CompareBitmap(body:step 2)  compare returned-3 
     [java] mobile/components/TextInput/Styles/TextInput_styles_tester TextInput_contentBackgroundColor_test3 Failed CompareBitmap(body:step 1)  compare returned-3 
     [java] mobile/components/TextInput/Styles/TextInput_styles_tester TextInput_contentBackgroundColor_test4 Failed CompareBitmap(body:step 3)  compare returned-3 
     [java] mobile/components/TextInput/Styles/TextInput_styles_tester TextInput_textAlign_test1 Failed CompareBitmap(body:step 3)  compare returned-3 
     [java] mobile/components/TextInput/Styles/TextInput_styles_tester TextInput_textAlign_test2 Failed CompareBitmap(body:step 3)  compare returned-3 
     [java] mobile/components/TextInput/Styles/TextInput_styles_tester TextInput_textAlign_test3 Failed CompareBitmap(body:step 3)  compare returned-3 
     [java] mobile/components/TextInput/Styles/TextInput_styles_tester TextInput_textAlign_test4 Failed CompareBitmap(body:step 3)  compare returned-3 
     [java] mobile/components/TextInput/Styles/TextInput_styles_tester TextInput_textAlign_test5 Failed CompareBitmap(body:step 3)  compare returned-3 
     [java] mobile/components/TextInput/Styles/TextInput_styles_tester TextInput_textAlign_test6 Failed CompareBitmap(body:step 1)  compare returned-3 
     [java] mobile/components/TextInput/Styles/TextInput_styles_tester TextInput_fontWeight_test1 Failed CompareBitmap(body:step 3)  compare returned-3 
     [java] mobile/components/TextInput/Styles/TextInput_styles_tester TextInput_fontWeight_test2 Failed CompareBitmap(body:step 3)  compare returned-3 
     [java] mobile/components/TextInput/Styles/TextInput_styles_tester TextInput_fontSize_test1 Failed CompareBitmap(body:step 3)  compare returned-3 
     [java] mobile/components/TextInput/Styles/TextInput_styles_tester TextInput_fontSize_test2 Failed CompareBitmap(body:step 3)  compare returned-3 
     [java] mobile/components/TextInput/Styles/TextInput_styles_tester TextInput_fontSize_test3 Failed CompareBitmap(body:step 3)  compare returned-3 
     [java] mobile/components/TextInput/Styles/TextInput_styles_tester TextInput_fontSize_test4 Failed CompareBitmap(body:step 4)  compare returned-3 
     [java] mobile/components/TextInput/Styles/TextInput_styles_tester TextInput_textDecoration_test1 Failed CompareBitmap(body:step 3)  compare returned-3 
     [java] mobile/components/TextInput/Styles/TextInput_styles_tester TextInput_textDecoration_test2 Failed CompareBitmap(body:step 3)  compare returned-3 
     [java] mobile/components/TextInput/Styles/TextInput_styles_tester TextInput_textIndent_test1 Failed CompareBitmap(body:step 3)  compare returned-3 
     [java] mobile/components/TextInput/Styles/TextInput_styles_tester TextInput_textIndent_test2 Failed CompareBitmap(body:step 3)  compare returned-3 
     [java] mobile/components/TextInput/Styles/TextInput_styles_tester TextInput_textIndent_test3 Failed CompareBitmap(body:step 3)  compare returned-3 
     [java] mobile/components/TextInput/Styles/TextInput_styles_tester TextInput_textIndent_test4 Failed CompareBitmap(body:step 3)  compare returned-3 
     [java] mobile/components/TextInput/Styles/TextInput_styles_tester TextInput_letterSpacing_test1 Failed CompareBitmap(body:step 3)  compare returned-3 
     [java] mobile/components/TextInput/Styles/TextInput_styles_tester TextInput_letterSpacing_test2 Failed CompareBitmap(body:step 3)  compare returned-3 
     [java] mobile/components/TextInput/Styles/TextInput_styles_tester TextInput_letterSpacing_test3 Failed CompareBitmap(body:step 3)  compare returned-3 
     [java] mobile/components/TextInput/Styles/TextInput_styles_tester TextInput_fontFamily_test1 Failed CompareBitmap(body:step 3)  compare returned-3 
     [java] mobile/components/TextInput/Styles/TextInput_styles_tester TextInput_fontFamily_test2 Failed CompareBitmap(body:step 3)  compare returned-3 
     [java] mobile/components/TextInput/Integration/TextInput_States_tester TextInput_states_test1 Failed CompareBitmap(body:step 1)  compare returned-3 
     [java] mobile/components/TextInput/Integration/TextInput_States_tester TextInput_states_test2 Failed CompareBitmap(body:step 2)  compare returned-3 
     [java] mobile/components/TextInput/Integration/TextInput_States_tester TextInput_states_test3 Failed CompareBitmap(body:step 3)  compare returned-3 
     [java] mobile/components/ToggleSwitch/integration/ToggleSwitch_skinning custom_skin_styles Failed CompareBitmap(body:step 1)  Baseline image could not be read.  Created image file as a .bad.png. 
     [java] mobile/components/ToggleSwitch/integration/ToggleSwitch_skinning custom_skin_styles_selected Failed CompareBitmap(body:step 1)  Baseline image could not be read.  Created image file as a .bad.png. 
     [java] mobile/components/ToggleSwitch/integration/ToggleSwitch_skinning custom_skin_French_label Failed CompareBitmap(body:step 1)  Baseline image could not be read.  Created image file as a .bad.png. 
     [java] mobile/components/ToggleSwitch/integration/ToggleSwitch_skinning custom_skin_French_selected Failed CompareBitmap(body:step 1)  Baseline image could not be read.  Created image file as a .bad.png. 
     [java] mobile/components/ToggleSwitch/integration/ToggleSwitch_skinning custom_skin_Japanese_label Failed CompareBitmap(body:step 1)  Baseline image could not be read.  Created image file as a .bad.png. 
     [java] mobile/components/ToggleSwitch/integration/ToggleSwitch_skinning custom_skin_Japanese_selected Failed CompareBitmap(body:step 1)  Baseline image could not be read.  Created image file as a .bad.png. 
     [java] mobile/components/ToggleSwitch/properties/ToggleSwitch_properties width_height_default Failed AssertPropertyValue(body:step 1)  propertiesRoot.target1.width 149 != null 
     [java] mobile/components/ToggleSwitch/properties/ToggleSwitch_properties width_height_MXML Failed CompareBitmap(body:step 3)  Baseline image could not be read.  Created image file as a .bad.png. 
     [java] mobile/components/ToggleSwitch/properties/ToggleSwitch_properties width_height_AS Failed CompareBitmap(body:step 3)  Baseline image could not be read.  Created image file as a .bad.png. 
     [java] mobile/components/ToggleSwitch/properties/ToggleSwitch_properties percentWidth_percentHeight_MXML Failed CompareBitmap(body:step 3)  Baseline image could not be read.  Created image file as a .bad.png. 
     [java] mobile/components/ToggleSwitch/properties/ToggleSwitch_properties percentWidth_percentHeight_AS Failed CompareBitmap(body:step 3)  Baseline image could not be read.  Created image file as a .bad.png. 
     [java] mobile/components/ToggleSwitch/properties/ToggleSwitch_properties scaleX_scaleY_MXML Failed CompareBitmap(body:step 1)  Baseline image could not be read.  Created image file as a .bad.png. 
     [java] mobile/components/ToggleSwitch/properties/ToggleSwitch_properties scaleX_scaleY_AS Failed CompareBitmap(body:step 1)  Baseline image could not be read.  Created image file as a .bad.png. 
     [java] mobile/components/ToggleSwitch/properties/ToggleSwitch_properties enabled_false Failed CompareBitmap(body:step 1)  Baseline image could not be read.  Created image file as a .bad.png. 
     [java] mobile/components/ToggleSwitch/properties/ToggleSwitch_properties enabled_true Failed CompareBitmap(body:step 1)  Baseline image could not be read.  Created image file as a .bad.png. 
     [java] mobile/components/ToggleSwitch/styles/ToggleSwitch_styles styles_accentColor_default Failed CompareBitmap(body:step 2)  Baseline image could not be read.  Created image file as a .bad.png. 
     [java] mobile/components/ToggleSwitch/styles/ToggleSwitch_styles styles_accentColor_AS Failed CompareBitmap(body:step 2)  Baseline image could not be read.  Created image file as a .bad.png. 
     [java] mobile/components/ToggleSwitch/styles/ToggleSwitch_styles styles_chromeColor_default Failed CompareBitmap(body:step 2)  Baseline image could not be read.  Created image file as a .bad.png. 
     [java] mobile/components/ToggleSwitch/styles/ToggleSwitch_styles styles_set_in_MXML Failed CompareBitmap(body:step 1)  Baseline image could not be read.  Created image file as a .bad.png. 
     [java] mobile/components/ToggleSwitch/styles/ToggleSwitch_styles styles_chromeColor_AS Failed CompareBitmap(body:step 2)  Baseline image could not be read.  Created image file as a .bad.png. 
     [java] mobile/components/ToggleSwitch/styles/ToggleSwitch_styles styles_color_default Failed CompareBitmap(body:step 2)  Baseline image could not be read.  Created image file as a .bad.png. 
     [java] mobile/components/ToggleSwitch/styles/ToggleSwitch_styles styles_color_AS Failed CompareBitmap(body:step 2)  Baseline image could not be read.  Created image file as a .bad.png. 
     [java] mobile/components/ToggleSwitch/styles/ToggleSwitch_styles styles_baseColor_mouseOver Failed CompareBitmap(body:step 2)  Baseline image could not be read.  Created image file as a .bad.png. 
     [java] mobile/components/ToggleSwitch/styles/ToggleSwitch_styles styles_baseColor_disabled Failed CompareBitmap(body:step 2)  Baseline image could not be read.  Created image file as a .bad.png. 
     [java] mobile/components/ToggleSwitch/styles/ToggleSwitch_styles styles_color_disabled Failed CompareBitmap(body:step 3)  Baseline image could not be read.  Created image file as a .bad.png. 
     [java] mobile/components/ToggleSwitch/styles/ToggleSwitch_styles styles_fontSize_default Failed AssertStyleValue(body:step 1)  stylesRoot.target1.fontSize 27 != 36 
     [java] mobile/components/ToggleSwitch/styles/ToggleSwitch_styles styles_fontSize_AS Failed CompareBitmap(body:step 2)  Baseline image could not be read.  Created image file as a .bad.png. 
     [java] mobile/components/ToggleSwitch/styles/ToggleSwitch_styles styles_fontStyle_default Failed CompareBitmap(body:step 2)  Baseline image could not be read.  Created image file as a .bad.png. 
     [java] mobile/components/ToggleSwitch/styles/ToggleSwitch_styles styles_fontStyle_AS Failed CompareBitmap(body:step 2)  Baseline image could not be read.  Created image file as a .bad.png. 
     [java] mobile/components/ToggleSwitch/styles/ToggleSwitch_styles styles_fontWeight_default Failed CompareBitmap(body:step 2)  Baseline image could not be read.  Created image file as a .bad.png. 
     [java] mobile/components/ToggleSwitch/styles/ToggleSwitch_styles styles_fontWeight_AS Failed CompareBitmap(body:step 2)  Baseline image could not be read.  Created image file as a .bad.png. 
     [java] mobile/components/ToggleSwitch/styles/ToggleSwitch_styles styles_fontFamily_default Failed CompareBitmap(body:step 2)  Baseline image could not be read.  Created image file as a .bad.png. 
     [java] mobile/components/ToggleSwitch/styles/ToggleSwitch_styles styles_fontFamily_AS Failed CompareBitmap(body:step 2)  Baseline image could not be read.  Created image file as a .bad.png. 
     [java] mobile/components/ToggleSwitch/styles/ToggleSwitch_styles styles_textAlign_default Failed CompareBitmap(body:step 2)  Baseline image could not be read.  Created image file as a .bad.png. 
     [java] mobile/components/ToggleSwitch/styles/ToggleSwitch_styles styles_textAlign_AS Failed CompareBitmap(body:step 2)  Baseline image could not be read.  Created image file as a .bad.png. 
     [java] mobile/components/ToggleSwitch/styles/ToggleSwitch_styles styles_textAlpha_default Failed CompareBitmap(body:step 2)  Baseline image could not be read.  Created image file as a .bad.png. 
     [java] mobile/components/ToggleSwitch/styles/ToggleSwitch_styles styles_textAlpha_AS Failed CompareBitmap(body:step 2)  Baseline image could not be read.  Created image file as a .bad.png. 
     [java] mobile/components/ToggleSwitch/styles/ToggleSwitch_styles styles_textDecoration_default Failed CompareBitmap(body:step 2)  Baseline image could not be read.  Created image file as a .bad.png. 
     [java] mobile/components/ToggleSwitch/styles/ToggleSwitch_styles styles_textDecoration_AS Failed CompareBitmap(body:step 2)  Baseline image could not be read.  Created image file as a .bad.png. 
     [java] mobile/components/ToggleSwitch/styles/ToggleSwitch_styles styles_lineHeight_default Failed CompareBitmap(body:step 2)  Baseline image could not be read.  Created image file as a .bad.png. 
     [java] mobile/components/ToggleSwitch/styles/ToggleSwitch_styles styles_lineHeight_AS Failed CompareBitmap(body:step 2)  Baseline image could not be read.  Created image file as a .bad.png. 
     [java] mobile/components/ToggleSwitch/styles/ToggleSwitch_styles styles_lineThrough_default Failed CompareBitmap(body:step 2)  Baseline image could not be read.  Created image file as a .bad.png. 
     [java] mobile/components/ToggleSwitch/styles/ToggleSwitch_styles styles_lineThrough_AS Failed CompareBitmap(body:step 2)  Baseline image could not be read.  Created image file as a .bad.png. 
     [java] mobile/components/ToggleSwitch/styles/ToggleSwitch_CSS CSS_accentColor_typeselector Failed CompareBitmap(body:step 2)  Baseline image could not be read.  Created image file as a .bad.png. 
     [java] mobile/components/ToggleSwitch/styles/ToggleSwitch_CSS CSS_set_in_MXML Failed CompareBitmap(body:step 1)  Baseline image could not be read.  Created image file as a .bad.png. 
     [java] mobile/components/ToggleSwitch/styles/ToggleSwitch_CSS CSS_accentColor_AS Failed CompareBitmap(body:step 2)  Baseline image could not be read.  Created image file as a .bad.png. 
     [java] mobile/components/ToggleSwitch/styles/ToggleSwitch_CSS CSS_chromeColor_default Failed CompareBitmap(body:step 2)  Baseline image could not be read.  Created image file as a .bad.png. 
     [java] mobile/components/ToggleSwitch/styles/ToggleSwitch_CSS CSS_chromeColor_AS Failed CompareBitmap(body:step 2)  Baseline image could not be read.  Created image file as a .bad.png. 
     [java] mobile/components/ToggleSwitch/styles/ToggleSwitch_CSS CSS_color_default Failed CompareBitmap(body:step 2)  Baseline image could not be read.  Created image file as a .bad.png. 
     [java] mobile/components/ToggleSwitch/styles/ToggleSwitch_CSS CSS_color_AS Failed CompareBitmap(body:step 2)  Baseline image could not be read.  Created image file as a .bad.png. 
     [java] mobile/components/ToggleSwitch/styles/ToggleSwitch_CSS CSS_color_disabled Failed CompareBitmap(body:step 3)  Baseline image could not be read.  Created image file as a .bad.png. 
     [java] mobile/components/ToggleSwitch/styles/ToggleSwitch_CSS CSS_fontSize_default Failed AssertStyleValue(body:step 1)  stylesRoot.target1.fontSize 27 != 36 
     [java] mobile/components/ToggleSwitch/styles/ToggleSwitch_CSS CSS_fontSize_AS Failed CompareBitmap(body:step 2)  Baseline image could not be read.  Created image file as a .bad.png. 
     [java] mobile/components/ToggleSwitch/styles/ToggleSwitch_CSS CSS_fontStyle_default Failed CompareBitmap(body:step 2)  Baseline image could not be read.  Created image file as a .bad.png. 
     [java] mobile/components/ToggleSwitch/styles/ToggleSwitch_CSS CSS_fontStyle_AS Failed CompareBitmap(body:step 2)  Baseline image could not be read.  Created image file as a .bad.png. 
     [java] mobile/components/ToggleSwitch/styles/ToggleSwitch_CSS CSS_fontWeight_default Failed CompareBitmap(body:step 2)  Baseline image could not be read.  Created image file as a .bad.png. 
     [java] mobile/components/ToggleSwitch/styles/ToggleSwitch_CSS CSS_fontWeight_AS Failed CompareBitmap(body:step 2)  Baseline image could not be read.  Created image file as a .bad.png. 
     [java] mobile/components/ToggleSwitch/styles/ToggleSwitch_CSS CSS_fontFamily_default Failed CompareBitmap(body:step 2)  Baseline image could not be read.  Created image file as a .bad.png. 
     [java] mobile/components/ToggleSwitch/styles/ToggleSwitch_CSS CSS_fontFamily_AS Failed CompareBitmap(body:step 2)  Baseline image could not be read.  Created image file as a .bad.png. 
     [java] mobile/components/ToggleSwitch/styles/ToggleSwitch_CSS CSS_textAlign_default Failed CompareBitmap(body:step 2)  Baseline image could not be read.  Created image file as a .bad.png. 
     [java] mobile/components/ToggleSwitch/styles/ToggleSwitch_CSS CSS_textAlign_AS Failed CompareBitmap(body:step 2)  Baseline image could not be read.  Created image file as a .bad.png. 
     [java] mobile/components/ToggleSwitch/styles/ToggleSwitch_CSS CSS_textAlpha_default Failed CompareBitmap(body:step 2)  Baseline image could not be read.  Created image file as a .bad.png. 
     [java] mobile/components/ToggleSwitch/styles/ToggleSwitch_CSS CSS_textAlpha_AS Failed CompareBitmap(body:step 2)  Baseline image could not be read.  Created image file as a .bad.png. 
     [java] mobile/components/ToggleSwitch/styles/ToggleSwitch_CSS CSS_textDecoration_default Failed CompareBitmap(body:step 2)  Baseline image could not be read.  Created image file as a .bad.png. 
     [java] mobile/components/ToggleSwitch/styles/ToggleSwitch_CSS CSS_textDecoration_AS Failed CompareBitmap(body:step 2)  Baseline image could not be read.  Created image file as a .bad.png. 
     [java] mobile/components/ToggleSwitch/styles/ToggleSwitch_CSS CSS_lineHeight_default Failed CompareBitmap(body:step 2)  Baseline image could not be read.  Created image file as a .bad.png. 
     [java] mobile/components/ToggleSwitch/styles/ToggleSwitch_CSS CSS_lineHeight_AS Failed CompareBitmap(body:step 2)  Baseline image could not be read.  Created image file as a .bad.png. 
     [java] mobile/components/ToggleSwitch/styles/ToggleSwitch_CSS CSS_lineThrough_default Failed CompareBitmap(body:step 2)  Baseline image could not be read.  Created image file as a .bad.png. 
     [java] mobile/components/ToggleSwitch/styles/ToggleSwitch_CSS CSS_lineThrough_AS Failed CompareBitmap(body:step 2)  Baseline image could not be read.  Created image file as a .bad.png. 
     [java] mobile/components/ToggleSwitch/styles/ToggleSwitch_advancedCSS advancedCSS_typeselector_unselected Failed CompareBitmap(body:step 1)  Baseline image could not be read.  Created image file as a .bad.png. 
     [java] mobile/components/ToggleSwitch/styles/ToggleSwitch_advancedCSS advancedCSS_typeselector_selected Failed CompareBitmap(body:step 1)  Baseline image could not be read.  Created image file as a .bad.png. 
     [java] mobile/components/ToggleSwitch/styles/ToggleSwitch_advancedCSS advancedCSS_classselector_unselected Failed CompareBitmap(body:step 1)  Baseline image could not be read.  Created image file as a .bad.png. 
     [java] mobile/components/ToggleSwitch/styles/ToggleSwitch_advancedCSS advancedCSS_classselector_selected Failed CompareBitmap(body:step 1)  Baseline image could not be read.  Created image file as a .bad.png. 
     [java] mobile/components/ToggleSwitch/styles/ToggleSwitch_advancedCSS advancedCSS_advancedselector_unselected Failed CompareBitmap(body:step 1)  Baseline image could not be read.  Created image file as a .bad.png. 
     [java] mobile/components/ToggleSwitch/styles/ToggleSwitch_advancedCSS advancedCSS_advancedselector_selected Failed CompareBitmap(body:step 1)  Baseline image could not be read.  Created image file as a .bad.png. 
     [java] mobile/components/ViewMenu/integration/ViewMenu_Integration3 ThreeButtonsMenuPortrait1 Failed CompareBitmap(body:step 6)  Baseline image could not be read.  Created image file as a .bad.png. 
     [java] mobile/components/ViewMenu/integration/ViewMenu_Integration3 ThreeButtonsMenuPortrait2 Failed CompareBitmap(body:step 9)  Baseline image could not be read.  Created image file as a .bad.png. 
     [java] mobile/components/ViewMenu/integration/ViewMenu_Integration3 ThreeButtonsMenuPortrait3 Failed CompareBitmap(body:step 14)  Baseline image could not be read.  Created image file as a .bad.png. 
     [java] mobile/components/ViewMenu/integration/ViewMenu_Integration3 ThreeButtonsMenuPortrait4 Failed CompareBitmap(body:step 14)  Baseline image could not be read.  Created image file as a .bad.png. 
     [java] mobile/components/ViewMenu/integration/ViewMenu_Integration3 ThreeButtonsMenuPortrait6 Failed CompareBitmap(body:step 5)  Baseline image could not be read.  Created image file as a .bad.png. 
     [java] mobile/components/ViewMenu/integration/ViewMenu_Integration3 ThreeButtonsMenuPortrait7 Failed CompareBitmap(body:step 6)  Baseline image could not be read.  Created image file as a .bad.png. 
     [java] mobile/components/ViewMenu/integration/ViewMenu_Integration3 ThreeButtonsMenuPortrait8 Failed CompareBitmap(body:step 6)  Baseline image could not be read.  Created image file as a .bad.png. 
     [java] mobile/components/ViewMenu/integration/ViewMenu_Integration3 ThreeButtonsMenuPortrait9 Failed CompareBitmap(body:step 6)  Baseline image could not be read.  Created image file as a .bad.png. 
     [java] mobile/components/ViewMenu/integration/ViewMenu_Integration4 FourItemsMenuPortrait1 Failed CompareBitmap(body:step 6)  Baseline image could not be read.  Created image file as a .bad.png. 
     [java] mobile/components/ViewMenu/integration/ViewMenu_Integration4 FourItemsMenuPortrait2 Failed CompareBitmap(body:step 9)  Baseline image could not be read.  Created image file as a .bad.png. 
     [java] mobile/components/ViewMenu/integration/ViewMenu_Integration4 FourItemsMenuPortrait3 Failed CompareBitmap(body:step 14)  Baseline image could not be read.  Created image file as a .bad.png. 
     [java] mobile/components/ViewMenu/integration/ViewMenu_Integration4 FourItemsMenuPortrait4 Failed CompareBitmap(body:step 14)  Baseline image could not be read.  Created image file as a .bad.png. 
     [java] mobile/components/ViewMenu/integration/ViewMenu_Integration4 FourItemsMenuPortrait5 Failed CompareBitmap(body:step 7)  Baseline image could not be read.  Created image file as a .bad.png. 
     [java] mobile/components/ViewMenu/integration/ViewMenu_Integration4 FourItemsMenuPortrait6 Failed CompareBitmap(body:step 9)  Baseline image could not be read.  Created image file as a .bad.png. 
     [java] mobile/components/ViewMenu/integration/ViewMenu_Integration4 FourItemsMenuPortrait7 Failed CompareBitmap(body:step 9)  Baseline image could not be read.  Created image file as a .bad.png. 
     [java] mobile/components/ViewMenu/integration/ViewMenu_Integration4 FourItemsMenuPortrait8 Failed CompareBitmap(body:step 6)  compare returned-3 
     [java] mobile/components/ViewMenu/integration/ViewMenu_Integration4 FourItemsMenuPortrait9 Failed CompareBitmap(body:step 6)  Baseline image could not be read.  Created image file as a .bad.png. 
     [java] mobile/components/ViewMenu/integration/ViewMenu_Integration5 FiveItemsMenuPortrait1 Failed CompareBitmap(body:step 12)  Baseline image could not be read.  Created image file as a .bad.png. 
     [java] mobile/components/ViewMenu/integration/ViewMenu_Integration5 FiveItemsMenuPortrait2 Failed CompareBitmap(body:step 5)  Baseline image could not be read.  Created image file as a .bad.png. 
     [java] mobile/components/ViewMenu/integration/ViewMenu_Integration5 FiveItemsMenuPortrait3 Failed CompareBitmap(body:step 14)  Baseline image could not be read.  Created image file as a .bad.png. 
     [java] mobile/components/ViewMenu/integration/ViewMenu_Integration5 FiveItemsMenuPortrait4 Failed CompareBitmap(body:step 14)  Baseline image could not be read.  Created image file as a .bad.png. 
     [java] mobile/components/ViewMenu/integration/ViewMenu_Integration5 FiveItemsMenuPortrait5 Failed CompareBitmap(body:step 8)  Baseline image could not be read.  Created image file as a .bad.png. 
     [java] mobile/components/ViewMenu/integration/ViewMenu_Integration5 FiveItemsMenuPortrait6 Failed CompareBitmap(body:step 5)  Baseline image could not be read.  Created image file as a .bad.png. 
     [java] mobile/components/ViewMenu/integration/ViewMenu_Integration5 FiveItemsMenuPortrait7 Failed CompareBitmap(body:step 9)  Baseline image could not be read.  Created image file as a .bad.png. 
     [java] mobile/components/ViewMenu/integration/ViewMenu_Integration5 FiveItemsMenuPortrait8 Failed CompareBitmap(body:step 6)  Baseline image could not be read.  Created image file as a .bad.png. 
     [java] mobile/components/ViewMenu/integration/ViewMenu_Integration5 FiveItemsMenuPortrait9 Failed CompareBitmap(body:step 5)  Baseline image could not be read.  Created image file as a .bad.png. 
     [java] mobile/components/ViewMenu/integration/ViewMenu_Integration6 SixItemsMenuPortrait1 Failed CompareBitmap(body:step 12)  Baseline image could not be read.  Created image file as a .bad.png. 
     [java] mobile/components/ViewMenu/integration/ViewMenu_Integration6 SixItemsMenuPortrait2 Failed CompareBitmap(body:step 5)  Baseline image could not be read.  Created image file as a .bad.png. 
     [java] mobile/components/ViewMenu/integration/ViewMenu_Integration6 SixItemsMenuPortrait3 Failed CompareBitmap(body:step 14)  Baseline image could not be read.  Created image file as a .bad.png. 
     [java] mobile/components/ViewMenu/integration/ViewMenu_Integration6 SixItemsMenuPortrait4 Failed CompareBitmap(body:step 14)  Baseline image could not be read.  Created image file as a .bad.png. 
     [java] mobile/components/ViewMenu/integration/ViewMenu_Integration6 SixItemsMenuPortrait5 Failed CompareBitmap(body:step 8)  Baseline image could not be read.  Created image file as a .bad.png. 
     [java] mobile/components/ViewMenu/integration/ViewMenu_Integration6 SixItemsMenuPortrait6 Failed CompareBitmap(body:step 5)  Baseline image could not be read.  Created image file as a .bad.png. 
     [java] mobile/components/ViewMenu/integration/ViewMenu_Integration6 SixItemsMenuPortrait7 Failed CompareBitmap(body:step 9)  Baseline image could not be read.  Created image file as a .bad.png. 
     [java] mobile/components/ViewMenu/integration/ViewMenu_Integration6 SixItemsMenuPortrait8 Failed CompareBitmap(body:step 6)  Baseline image could not be read.  Created image file as a .bad.png. 
     [java] mobile/components/ViewMenu/integration/ViewMenu_Integration6 SixItemsMenuPortrait9 Failed CompareBitmap(body:step 5)  Baseline image could not be read.  Created image file as a .bad.png. 
     [java] mobile/components/ViewMenu/integration/ViewMenu_Integration6 SixItemsMenuPortrait10 Failed CompareBitmap(body:step 7)  Baseline image could not be read.  Created image file as a .bad.png. 
     [java] mobile/components/ViewMenu/integration/ViewMenu_Integration7 SevenItemsMenuPortrait1 Failed CompareBitmap(body:step 12)  Baseline image could not be read.  Created image file as a .bad.png. 
     [java] mobile/components/ViewMenu/integration/ViewMenu_Integration7 SevenItemsMenuPortrait3 Failed CompareBitmap(body:step 14)  Baseline image could not be read.  Created image file as a .bad.png. 
     [java] mobile/components/ViewMenu/properties/ViewMenu_Properties1 OneViewMenuButtonPortrait1 Failed CompareBitmap(body:step 5)  Baseline image could not be read.  Created image file as a .bad.png. 
     [java] mobile/components/ViewMenu/properties/ViewMenu_Properties1 OneViewMenuButtonPortrait2 Failed CompareBitmap(body:step 5)  Baseline image could not be read.  Created image file as a .bad.png. 
     [java] mobile/components/ViewMenu/properties/ViewMenu_Properties1 OneViewMenuButtonPortrait3 Failed CompareBitmap(body:step 5)  Baseline image could not be read.  Created image file as a .bad.png. 
     [java] mobile/components/ViewMenu/properties/ViewMenu_Properties1 OneViewMenuButtonPortrait5 Failed CompareBitmap(body:step 10)  Baseline image could not be read.  Created image file as a .bad.png. 
     [java] mobile/components/ViewMenu/properties/ViewMenu_Properties1 OneViewMenuButtonPortrait6 Failed CompareBitmap(body:step 5)  Baseline image could not be read.  Created image file as a .bad.png. 
     [java] mobile/components/ViewMenu/properties/ViewMenu_Properties2 TwoButtonsMenuPortrait1 Failed CompareBitmap(body:step 6)  Baseline image could not be read.  Created image file as a .bad.png. 
     [java] mobile/components/ViewMenu/properties/ViewMenu_Properties2 TwoButtonsMenuPortrait2 Failed CompareBitmap(body:step 5)  Baseline image could not be read.  Created image file as a .bad.png. 
     [java] mobile/components/ViewMenu/properties/ViewMenu_Properties2 TwoButtonsMenuPortrait3 Failed CompareBitmap(body:step 5)  Baseline image could not be read.  Created image file as a .bad.png. 
     [java] mobile/components/ViewMenu/properties/ViewMenu_Properties2 TwoButtonsMenuPortrait8 Failed CompareBitmap(body:step 5)  Baseline image could not be read.  Created image file as a .bad.png. 
     [java] mobile/components/ViewMenu/properties/ViewMenu_Properties2 TwoButtonsMenuPortrait9 Failed CompareBitmap(body:step 6)  Baseline image could not be read.  Created image file as a .bad.png. 
     [java] mobile/components/ViewMenu/properties/ViewMenu_Properties2 TwoButtonsMenuPortrait10 Failed CompareBitmap(body:step 8)  Baseline image could not be read.  Created image file as a .bad.png. 
     [java] mobile/components/ViewMenu/properties/ViewMenu_Properties2 TwoButtonsMenuPortrait11 Failed CompareBitmap(body:step 6)  Baseline image could not be read.  Created image file as a .bad.png. 
     [java] mobile/components/ViewMenu/properties/ViewMenu_Properties2 TwoButtonsMenuPortrait12 Failed CompareBitmap(body:step 6)  Baseline image could not be read.  Created image file as a .bad.png. 
     [java] mobile/components/ViewMenu/properties/ViewMenu_Properties2 TwoButtonsMenuPortrait13 Failed CompareBitmap(body:step 6)  Baseline image could not be read.  Created image file as a .bad.png. 
     [java] mobile/components/ViewMenu/properties/ViewMenu_Properties2 TwoButtonsMenuPortrait14 Failed CompareBitmap(body:step 5)  Baseline image could not be read.  Created image file as a .bad.png. 
     [java] mobile/components/ViewMenu/integration/ViewMenu_CustomSkinTester CustomSkinSevenItemsMenuPortrait1 Failed CompareBitmap(body:step 3)  Baseline image could not be read.  Created image file as a .bad.png. 
     [java] mobile/components/ViewMenu/integration/ViewMenu_CustomSkinTester CustomSkinSevenItemsMenuPortrait2 Failed RunCode(body:step 1)  Timeout waiting for viewMenuOpen from navigator.activeView 
     [java] mobile/components/ViewMenu/integration/ViewMenuScaleTester ViewMenu240Scale Failed CompareBitmap(body:step 5)  Baseline image could not be read.  Created image file as a .bad.png. 
     [java] mobile/components/ViewMenu/integration/ViewMenuScaleTester BusyIndicator240Scale Failed CompareBitmap(body:step 4)  Baseline image could not be read.  Created image file as a .bad.png. 
     [java] mobile/utils/MultiDPIBitmapSource/integration/MultiDPIBitmapSource_integration MultiDPIBitmapSource_integ_160_embed Failed CompareBitmap(body:step 2)  compare returned[object BitmapData] 
     [java] mobile/utils/MultiDPIBitmapSource/integration/MultiDPIBitmapSource_integration MultiDPIBitmapSource_integ_160_refer Failed CompareBitmap(body:step 2)  compare returned[object BitmapData] 
     [java] mobile/utils/MultiDPIBitmapSource/integration/MultiDPIBitmapSource_integration MultiDPIBitmapSource_integ_240_embed Failed CompareBitmap(body:step 2)  compare returned[object BitmapData] 
     [java] mobile/utils/MultiDPIBitmapSource/integration/MultiDPIBitmapSource_integration MultiDPIBitmapSource_integ_240_refer Failed CompareBitmap(body:step 2)  compare returned[object BitmapData] 
     [java] mobile/utils/MultiDPIBitmapSource/integration/MultiDPIBitmapSource_integration MultiDPIBitmapSource_integ_320_embed Failed CompareBitmap(body:step 2)  compare returned[object BitmapData] 
     [java] mobile/utils/MultiDPIBitmapSource/integration/MultiDPIBitmapSource_integration MultiDPIBitmapSource_integ_320_refer Failed CompareBitmap(body:step 2)  compare returned[object BitmapData] 
     [java] mobile/utils/MultiDPIBitmapSource/properties/MultiDPIBitmapSource_properties MultiDPIBitmapSource_nominal_embed Failed CompareBitmap(body:step 2)  compare returned-3 
     [java] mobile/utils/MultiDPIBitmapSource/properties/MultiDPIBitmapSource_properties MultiDPIBitmapSource_nominal_refer Failed CompareBitmap(body:step 2)  compare returned-3 
     [java] mobile/utils/MultiDPIBitmapSource/properties/MultiDPIBitmapSource_properties MultiDPIBitmapSource_no_160_embed Failed CompareBitmap(body:step 2)  compare returned-3 
     [java] mobile/utils/MultiDPIBitmapSource/properties/MultiDPIBitmapSource_properties MultiDPIBitmapSource_no_160_refer Failed CompareBitmap(body:step 2)  compare returned-3 
     [java] mobile/utils/MultiDPIBitmapSource/integration/MultiDPIBitmapSource_scaling MultiDPIBitmapSource_scaling_refer Failed CompareBitmap(body:step 2)  compare returned-3 
     [java] mobile/utils/MultiDPIBitmapSource/integration/MultiDPIBitmapSource_scaling MultiDPIBitmapSource_scaling_embed Failed CompareBitmap(body:step 2)  compare returned-3 
     [java] 
     [java] 
     [java] =====================================================
     [java]     Passes: 0
     [java]     Fails: 1602
     [java] =====================================================
     [java] 
     [java] 
     [java] waited 1600
     [java] ClobberProcess, it was already null
     [java] Wrote summary to results.txt
     [java] Wrote failures to failures.txt

BUILD FAILED
C:\jenkins_slave\workspace\flex-sdk_mustella-mobile\mustella\build.xml:1538: The following error occurred while executing this line:
C:\jenkins_slave\workspace\flex-sdk_mustella-mobile\mustella\build.xml:1656: Java returned: 1

Total time: 35 minutes 2 seconds
Some of tests failed, even after running '-failures'...
Build step 'Execute shell' marked build as failure

Build failed in Jenkins: flex-sdk_mustella-mobile #28

Posted by fl...@gmail.com.
See <http://localhost:8080/job/flex-sdk_mustella-mobile/28/>

------------------------------------------
[...truncated 24203 lines...]
     [java] mobile/components/TextArea/Styles/TextArea_styles_tester TextArea_leading_test2 Failed CompareBitmap(body:step 3)  compare returned-3 
     [java] mobile/components/TextArea/Styles/TextArea_styles_tester TextArea_leading_test3 Failed CompareBitmap(body:step 3)  compare returned-3 
     [java] mobile/components/TextArea/Styles/TextArea_styles_tester TextArea_letterSpacing_test1 Failed CompareBitmap(body:step 3)  compare returned-3 
     [java] mobile/components/TextArea/Styles/TextArea_styles_tester TextArea_letterSpacing_test2 Failed CompareBitmap(body:step 3)  compare returned-3 
     [java] mobile/components/TextArea/Styles/TextArea_styles_tester TextArea_letterSpacing_test3 Failed CompareBitmap(body:step 4)  compare returned-3 
     [java] mobile/components/TextArea/Styles/TextArea_styles_tester TextArea_fontFamily_test1 Failed CompareBitmap(body:step 3)  compare returned-3 
     [java] mobile/components/TextInput/Methods/TextInput_Methods_tester TextInput_selectAll_test1 Failed CompareBitmap(body:step 5)  compare returned-4 
     [java] mobile/components/TextInput/Methods/TextInput_Methods_tester TextInput_selectRange_test1 Failed CompareBitmap(body:step 2)  compare returned-4 
     [java] mobile/components/TextInput/Methods/TextInput_Methods_tester TextInput_selectRange_test3 Failed CompareBitmap(body:step 5)  compare returned-4 
     [java] mobile/components/TextInput/Methods/TextInput_Methods_tester TextInput_selectRange_test4 Failed CompareBitmap(body:step 5)  compare returned-4 
     [java] mobile/components/TextInput/Methods/TextInput_Methods_tester TextInput_selectRange_test5 Failed CompareBitmap(body:step 5)  compare returned-4 
     [java] mobile/components/TextInput/Methods/TextInput_Methods_tester TextInput_selectRange_test6 Failed CompareBitmap(body:step 5)  compare returned-4 
     [java] mobile/components/TextInput/Methods/TextInput_Methods_tester TextInput_selectRange_test7 Failed CompareBitmap(body:step 5)  compare returned-4 
     [java] mobile/components/TextInput/Methods/TextInput_Methods_tester TextInput_truncateToFit_test1 Failed CompareBitmap(body:step 5)  compare returned-4 
     [java] mobile/components/TextInput/Methods/TextInput_Methods_tester TextInput_truncateToFit_test2 Failed AssertMethodValue (method cannot be shown)(body:step 4)  method returned Lorem ipsum dolor sit ..., expected Lorem ipsum d... 
     [java] mobile/components/TextInput/Methods/TextInput_Methods_tester TextInput_truncateToFit_test3 Failed AssertMethodValue (method cannot be shown)(body:step 4)  method returned Lorem ipsum dolor sit ..., expected Lorem ipsum d... 
     [java] mobile/components/TextInput/Methods/TextInput_Methods_tester TextInput_truncateToFit_test4 Failed AssertMethodValue (method cannot be shown)(body:step 4)  method returned Lorem ipsum dolor sit ..., expected Lorem ipsum d... 
     [java] mobile/components/TextInput/Methods/TextInput_Methods_tester TextInput_truncateToFit_test5 Failed AssertMethodValue (method cannot be shown)(body:step 4)  method returned Lorem ipsum dolor sit a , expected Lorem ipsum do  
     [java] mobile/components/TextInput/Methods/TextInput_Methods_tester TextInput_truncateToFit_test6 Failed AssertMethodValue (method cannot be shown)(body:step 4)  method returned Lorem ipsum dolor s§¥©, expected Lorem ipsu§¥© 
     [java] mobile/components/TextInput/Methods/TextInput_Methods_tester TextInput_truncateToFit_test7 Failed AssertMethodValue (method cannot be shown)(body:step 4)  method returned Lorem ipsum dolor sit a, expected Lorem ipsum dol 
     [java] mobile/components/TextInput/Methods/TextInput_Methods_tester TextInput_truncateToFit_test8 Failed AssertMethodValue (method cannot be shown)(body:step 4)  method returned Lorem ipsum dolor sit a, expected Lorem ipsum dol 
     [java] mobile/components/TextInput/Methods/TextInput_Methods_tester TextInput_truncateToFit_test9 Failed AssertMethodValue (method cannot be shown)(body:step 4)  method returned Lorem ipsum dolor sit a, expected Lorem ipsum dol 
     [java] mobile/components/TextInput/Properties/TextInput_properties_tester TextInput_basic_prompt Failed CompareBitmap(body:step 3)  compare returned-3 
     [java] mobile/components/TextInput/Properties/TextInput_properties_tester TextInput_prompt_disappears Failed CompareBitmap(body:step 7)  compare returned-3 
     [java] mobile/components/TextInput/Properties/TextInput_properties_tester TextInput_prompt_returns_on_text_removal Failed CompareBitmap(body:step 10)  compare returned-3 
     [java] mobile/components/TextInput/Properties/TextInput_properties_tester TextInput_displayAsPassword_test2 Failed CompareBitmap(body:step 2)  compare returned-3 
     [java] mobile/components/TextInput/Properties/TextInput_properties_tester TextInput_displayAsPassword_test3 Failed CompareBitmap(body:step 2)  compare returned-3 
     [java] mobile/components/TextInput/Properties/TextInput_properties_tester TextInput_selectionActivePosition_property_mouseDown Failed AssertPropertyValue(body:step 2)  tic1.ti1.selectionAnchorPosition 2 != 1 
     [java] mobile/components/TextInput/Properties/TextInput_properties_tester TextInput_text_property Failed CompareBitmap(body:step 3)  compare returned-3 
     [java] mobile/components/TextInput/Properties/TextInput_properties_tester TextInput_text_property_japanese Failed CompareBitmap(body:step 3)  compare returned-3 
     [java] mobile/components/TextInput/Properties/TextInput_properties_tester TextInput_alpha_property_01 Failed CompareBitmap(body:step 2)  compare returned-3 
     [java] mobile/components/TextInput/Properties/TextInput_properties_tester TextInput_alpha_property_0 Failed CompareBitmap(body:step 2)  compare returned-3 
     [java] mobile/components/TextInput/Properties/TextInput_properties_tester TextInput_height_property_40 Failed CompareBitmap(body:step 2)  compare returned-3 
     [java] mobile/components/TextInput/Properties/TextInput_properties_tester TextInput_height_property_10 Failed CompareBitmap(body:step 2)  compare returned-3 
     [java] mobile/components/TextInput/Properties/TextInput_properties_tester TextInput_percentHeight_property_50 Failed CompareBitmap(body:step 3)  compare returned-3 
     [java] mobile/components/TextInput/Properties/TextInput_properties_tester TextInput_percentHeight_property_150 Failed CompareBitmap(body:step 3)  compare returned-3 
     [java] mobile/components/TextInput/Properties/TextInput_properties_tester TextInput_percentWidth_property_50 Failed CompareBitmap(body:step 3)  compare returned[object BitmapData] 
     [java] mobile/components/TextInput/Properties/TextInput_properties_tester TextInput_percentWidth_property_150 Failed CompareBitmap(body:step 3)  compare returned[object BitmapData] 
     [java] mobile/components/TextInput/Properties/TextInput_properties_tester TextInput_rotation_property_90 Failed CompareBitmap(body:step 2)  compare returned[object BitmapData] 
     [java] mobile/components/TextInput/Properties/TextInput_properties_tester TextInput_scaleX_property_2 Failed CompareBitmap(body:step 3)  compare returned[object BitmapData] 
     [java] mobile/components/TextInput/Properties/TextInput_properties_tester TextInput_width_property_default Failed AssertPropertyValue(body:step 1)  tic1.ti1.width 440 != 600 
     [java] mobile/components/TextInput/Properties/TextInput_properties_tester TextInput_width_property_40 Failed CompareBitmap(body:step 2)  compare returned[object BitmapData] 
     [java] mobile/components/TextInput/Properties/TextInput_properties_tester TextInput_width_property_200 Failed CompareBitmap(body:step 2)  compare returned[object BitmapData] 
     [java] mobile/components/TextInput/Properties/TextInput_properties_tester TextInput_x_property_positive Failed CompareBitmap(body:step 4)  compare returned[object BitmapData] 
     [java] mobile/components/TextInput/Properties/TextInput_properties_tester TextInput_x_property_negative Failed CompareBitmap(body:step 3)  compare returned[object BitmapData] 
     [java] mobile/components/TextInput/Properties/TextInput_properties_tester TextInput_y_property_positive Failed CompareBitmap(body:step 4)  compare returned[object BitmapData] 
     [java] mobile/components/TextInput/Properties/TextInput_properties_tester TextInput_y_property_negative Failed CompareBitmap(body:step 3)  compare returned[object BitmapData] 
     [java] mobile/components/TextInput/Properties/TextInput_properties_tester TextInput_baselinePosition_property_preValidation Failed AssertPropertyValue(body:step 1)  tic2.ti1.baselinePosition 36.650000 != 43.700000 
     [java] mobile/components/TextInput/Properties/TextInput_properties_tester TextInput_baselinePosition_property_postValidation Failed AssertPropertyValue(body:step 1)  tic2.ti1.baselinePosition 36.650000 != 43.700000 
     [java] mobile/components/TextInput/Styles/TextInput_styles_tester TextInput_color_test1 Failed CompareBitmap(body:step 1)  compare returned-3 
     [java] mobile/components/TextInput/Styles/TextInput_styles_tester TextInput_color_test2 Failed CompareBitmap(body:step 2)  compare returned-3 
     [java] mobile/components/TextInput/Styles/TextInput_styles_tester TextInput_color_test3 Failed CompareBitmap(body:step 1)  compare returned-3 
     [java] mobile/components/TextInput/Styles/TextInput_styles_tester TextInput_color_test4 Failed CompareBitmap(body:step 3)  compare returned-3 
     [java] mobile/components/TextInput/Styles/TextInput_styles_tester TextInput_color_test5 Failed CompareBitmap(body:step 2)  compare returned-3 
     [java] mobile/components/TextInput/Styles/TextInput_styles_tester TextInput_focusColor_test1 Failed AssertPixelValue(body:step 3)  tic3.grp1 pixel at (10,10) 99FF99 != 0xF7FFF7 
     [java] mobile/components/TextInput/Styles/TextInput_styles_tester TextInput_focusColor_test2 Failed AssertPixelValue(body:step 4)  tic3.grp2 pixel at (10,10) 99FF99 != 0xF7FFF7 
     [java] mobile/components/TextInput/Styles/TextInput_styles_tester TextInput_focusColor_test3 Failed AssertPixelValue(body:step 3)  tic3.grp3 pixel at (10,10) 99FF99 != 0xF7FFF7 
     [java] mobile/components/TextInput/Styles/TextInput_styles_tester TextInput_contentBackgroundColor_test1 Failed CompareBitmap(body:step 2)  compare returned-3 
     [java] mobile/components/TextInput/Styles/TextInput_styles_tester TextInput_contentBackgroundColor_test2 Failed CompareBitmap(body:step 2)  compare returned-3 
     [java] mobile/components/TextInput/Styles/TextInput_styles_tester TextInput_contentBackgroundColor_test3 Failed CompareBitmap(body:step 1)  compare returned-3 
     [java] mobile/components/TextInput/Styles/TextInput_styles_tester TextInput_contentBackgroundColor_test4 Failed CompareBitmap(body:step 3)  compare returned-3 
     [java] mobile/components/TextInput/Styles/TextInput_styles_tester TextInput_textAlign_test1 Failed CompareBitmap(body:step 3)  compare returned-3 
     [java] mobile/components/TextInput/Styles/TextInput_styles_tester TextInput_textAlign_test2 Failed CompareBitmap(body:step 3)  compare returned-3 
     [java] mobile/components/TextInput/Styles/TextInput_styles_tester TextInput_textAlign_test3 Failed CompareBitmap(body:step 3)  compare returned-3 
     [java] mobile/components/TextInput/Styles/TextInput_styles_tester TextInput_textAlign_test4 Failed CompareBitmap(body:step 3)  compare returned-3 
     [java] mobile/components/TextInput/Styles/TextInput_styles_tester TextInput_textAlign_test5 Failed CompareBitmap(body:step 3)  compare returned-3 
     [java] mobile/components/TextInput/Styles/TextInput_styles_tester TextInput_textAlign_test6 Failed CompareBitmap(body:step 1)  compare returned-3 
     [java] mobile/components/TextInput/Styles/TextInput_styles_tester TextInput_fontWeight_test1 Failed CompareBitmap(body:step 3)  compare returned-3 
     [java] mobile/components/TextInput/Styles/TextInput_styles_tester TextInput_fontWeight_test2 Failed CompareBitmap(body:step 3)  compare returned-3 
     [java] mobile/components/TextInput/Styles/TextInput_styles_tester TextInput_fontSize_test1 Failed CompareBitmap(body:step 3)  compare returned-3 
     [java] mobile/components/TextInput/Styles/TextInput_styles_tester TextInput_fontSize_test2 Failed CompareBitmap(body:step 3)  compare returned-3 
     [java] mobile/components/TextInput/Styles/TextInput_styles_tester TextInput_fontSize_test3 Failed CompareBitmap(body:step 3)  compare returned-3 
     [java] mobile/components/TextInput/Styles/TextInput_styles_tester TextInput_fontSize_test4 Failed CompareBitmap(body:step 4)  compare returned-3 
     [java] mobile/components/TextInput/Styles/TextInput_styles_tester TextInput_textDecoration_test1 Failed CompareBitmap(body:step 3)  compare returned-3 
     [java] mobile/components/TextInput/Styles/TextInput_styles_tester TextInput_textDecoration_test2 Failed CompareBitmap(body:step 3)  compare returned-3 
     [java] mobile/components/TextInput/Styles/TextInput_styles_tester TextInput_textIndent_test1 Failed CompareBitmap(body:step 3)  compare returned-3 
     [java] mobile/components/TextInput/Styles/TextInput_styles_tester TextInput_textIndent_test2 Failed CompareBitmap(body:step 3)  compare returned-3 
     [java] mobile/components/TextInput/Styles/TextInput_styles_tester TextInput_textIndent_test3 Failed CompareBitmap(body:step 3)  compare returned-3 
     [java] mobile/components/TextInput/Styles/TextInput_styles_tester TextInput_textIndent_test4 Failed CompareBitmap(body:step 3)  compare returned-3 
     [java] mobile/components/TextInput/Styles/TextInput_styles_tester TextInput_letterSpacing_test1 Failed CompareBitmap(body:step 3)  compare returned-3 
     [java] mobile/components/TextInput/Styles/TextInput_styles_tester TextInput_letterSpacing_test2 Failed CompareBitmap(body:step 3)  compare returned-3 
     [java] mobile/components/TextInput/Styles/TextInput_styles_tester TextInput_letterSpacing_test3 Failed CompareBitmap(body:step 3)  compare returned-3 
     [java] mobile/components/TextInput/Styles/TextInput_styles_tester TextInput_fontFamily_test1 Failed CompareBitmap(body:step 3)  compare returned-3 
     [java] mobile/components/TextInput/Styles/TextInput_styles_tester TextInput_fontFamily_test2 Failed CompareBitmap(body:step 3)  compare returned-3 
     [java] mobile/components/TextInput/Integration/TextInput_States_tester TextInput_states_test1 Failed CompareBitmap(body:step 1)  compare returned-3 
     [java] mobile/components/TextInput/Integration/TextInput_States_tester TextInput_states_test2 Failed CompareBitmap(body:step 2)  compare returned-3 
     [java] mobile/components/TextInput/Integration/TextInput_States_tester TextInput_states_test3 Failed CompareBitmap(body:step 3)  compare returned-3 
     [java] mobile/components/ToggleSwitch/integration/ToggleSwitch_skinning custom_skin_styles Failed CompareBitmap(body:step 1)  Baseline image could not be read.  Created image file as a .bad.png. 
     [java] mobile/components/ToggleSwitch/integration/ToggleSwitch_skinning custom_skin_styles_selected Failed CompareBitmap(body:step 1)  Baseline image could not be read.  Created image file as a .bad.png. 
     [java] mobile/components/ToggleSwitch/integration/ToggleSwitch_skinning custom_skin_French_label Failed CompareBitmap(body:step 1)  Baseline image could not be read.  Created image file as a .bad.png. 
     [java] mobile/components/ToggleSwitch/integration/ToggleSwitch_skinning custom_skin_French_selected Failed CompareBitmap(body:step 1)  Baseline image could not be read.  Created image file as a .bad.png. 
     [java] mobile/components/ToggleSwitch/integration/ToggleSwitch_skinning custom_skin_Japanese_label Failed CompareBitmap(body:step 1)  Baseline image could not be read.  Created image file as a .bad.png. 
     [java] mobile/components/ToggleSwitch/integration/ToggleSwitch_skinning custom_skin_Japanese_selected Failed CompareBitmap(body:step 1)  Baseline image could not be read.  Created image file as a .bad.png. 
     [java] mobile/components/ToggleSwitch/properties/ToggleSwitch_properties width_height_default Failed AssertPropertyValue(body:step 1)  propertiesRoot.target1.width 149 != null 
     [java] mobile/components/ToggleSwitch/properties/ToggleSwitch_properties width_height_MXML Failed CompareBitmap(body:step 3)  Baseline image could not be read.  Created image file as a .bad.png. 
     [java] mobile/components/ToggleSwitch/properties/ToggleSwitch_properties width_height_AS Failed CompareBitmap(body:step 3)  Baseline image could not be read.  Created image file as a .bad.png. 
     [java] mobile/components/ToggleSwitch/properties/ToggleSwitch_properties percentWidth_percentHeight_MXML Failed CompareBitmap(body:step 3)  Baseline image could not be read.  Created image file as a .bad.png. 
     [java] mobile/components/ToggleSwitch/properties/ToggleSwitch_properties percentWidth_percentHeight_AS Failed CompareBitmap(body:step 3)  Baseline image could not be read.  Created image file as a .bad.png. 
     [java] mobile/components/ToggleSwitch/properties/ToggleSwitch_properties scaleX_scaleY_MXML Failed CompareBitmap(body:step 1)  Baseline image could not be read.  Created image file as a .bad.png. 
     [java] mobile/components/ToggleSwitch/properties/ToggleSwitch_properties scaleX_scaleY_AS Failed CompareBitmap(body:step 1)  Baseline image could not be read.  Created image file as a .bad.png. 
     [java] mobile/components/ToggleSwitch/properties/ToggleSwitch_properties enabled_false Failed CompareBitmap(body:step 1)  Baseline image could not be read.  Created image file as a .bad.png. 
     [java] mobile/components/ToggleSwitch/properties/ToggleSwitch_properties enabled_true Failed CompareBitmap(body:step 1)  Baseline image could not be read.  Created image file as a .bad.png. 
     [java] mobile/components/ToggleSwitch/styles/ToggleSwitch_styles styles_accentColor_default Failed CompareBitmap(body:step 2)  Baseline image could not be read.  Created image file as a .bad.png. 
     [java] mobile/components/ToggleSwitch/styles/ToggleSwitch_styles styles_accentColor_AS Failed CompareBitmap(body:step 2)  Baseline image could not be read.  Created image file as a .bad.png. 
     [java] mobile/components/ToggleSwitch/styles/ToggleSwitch_styles styles_chromeColor_default Failed CompareBitmap(body:step 2)  Baseline image could not be read.  Created image file as a .bad.png. 
     [java] mobile/components/ToggleSwitch/styles/ToggleSwitch_styles styles_set_in_MXML Failed CompareBitmap(body:step 1)  Baseline image could not be read.  Created image file as a .bad.png. 
     [java] mobile/components/ToggleSwitch/styles/ToggleSwitch_styles styles_chromeColor_AS Failed CompareBitmap(body:step 2)  Baseline image could not be read.  Created image file as a .bad.png. 
     [java] mobile/components/ToggleSwitch/styles/ToggleSwitch_styles styles_color_default Failed CompareBitmap(body:step 2)  Baseline image could not be read.  Created image file as a .bad.png. 
     [java] mobile/components/ToggleSwitch/styles/ToggleSwitch_styles styles_color_AS Failed CompareBitmap(body:step 2)  Baseline image could not be read.  Created image file as a .bad.png. 
     [java] mobile/components/ToggleSwitch/styles/ToggleSwitch_styles styles_baseColor_mouseOver Failed CompareBitmap(body:step 2)  Baseline image could not be read.  Created image file as a .bad.png. 
     [java] mobile/components/ToggleSwitch/styles/ToggleSwitch_styles styles_baseColor_disabled Failed CompareBitmap(body:step 2)  Baseline image could not be read.  Created image file as a .bad.png. 
     [java] mobile/components/ToggleSwitch/styles/ToggleSwitch_styles styles_color_disabled Failed CompareBitmap(body:step 3)  Baseline image could not be read.  Created image file as a .bad.png. 
     [java] mobile/components/ToggleSwitch/styles/ToggleSwitch_styles styles_fontSize_default Failed AssertStyleValue(body:step 1)  stylesRoot.target1.fontSize 27 != 36 
     [java] mobile/components/ToggleSwitch/styles/ToggleSwitch_styles styles_fontSize_AS Failed CompareBitmap(body:step 2)  Baseline image could not be read.  Created image file as a .bad.png. 
     [java] mobile/components/ToggleSwitch/styles/ToggleSwitch_styles styles_fontStyle_default Failed CompareBitmap(body:step 2)  Baseline image could not be read.  Created image file as a .bad.png. 
     [java] mobile/components/ToggleSwitch/styles/ToggleSwitch_styles styles_fontStyle_AS Failed CompareBitmap(body:step 2)  Baseline image could not be read.  Created image file as a .bad.png. 
     [java] mobile/components/ToggleSwitch/styles/ToggleSwitch_styles styles_fontWeight_default Failed CompareBitmap(body:step 2)  Baseline image could not be read.  Created image file as a .bad.png. 
     [java] mobile/components/ToggleSwitch/styles/ToggleSwitch_styles styles_fontWeight_AS Failed CompareBitmap(body:step 2)  Baseline image could not be read.  Created image file as a .bad.png. 
     [java] mobile/components/ToggleSwitch/styles/ToggleSwitch_styles styles_fontFamily_default Failed CompareBitmap(body:step 2)  Baseline image could not be read.  Created image file as a .bad.png. 
     [java] mobile/components/ToggleSwitch/styles/ToggleSwitch_styles styles_fontFamily_AS Failed CompareBitmap(body:step 2)  Baseline image could not be read.  Created image file as a .bad.png. 
     [java] mobile/components/ToggleSwitch/styles/ToggleSwitch_styles styles_textAlign_default Failed CompareBitmap(body:step 2)  Baseline image could not be read.  Created image file as a .bad.png. 
     [java] mobile/components/ToggleSwitch/styles/ToggleSwitch_styles styles_textAlign_AS Failed CompareBitmap(body:step 2)  Baseline image could not be read.  Created image file as a .bad.png. 
     [java] mobile/components/ToggleSwitch/styles/ToggleSwitch_styles styles_textAlpha_default Failed CompareBitmap(body:step 2)  Baseline image could not be read.  Created image file as a .bad.png. 
     [java] mobile/components/ToggleSwitch/styles/ToggleSwitch_styles styles_textAlpha_AS Failed CompareBitmap(body:step 2)  Baseline image could not be read.  Created image file as a .bad.png. 
     [java] mobile/components/ToggleSwitch/styles/ToggleSwitch_styles styles_textDecoration_default Failed CompareBitmap(body:step 2)  Baseline image could not be read.  Created image file as a .bad.png. 
     [java] mobile/components/ToggleSwitch/styles/ToggleSwitch_styles styles_textDecoration_AS Failed CompareBitmap(body:step 2)  Baseline image could not be read.  Created image file as a .bad.png. 
     [java] mobile/components/ToggleSwitch/styles/ToggleSwitch_styles styles_lineHeight_default Failed CompareBitmap(body:step 2)  Baseline image could not be read.  Created image file as a .bad.png. 
     [java] mobile/components/ToggleSwitch/styles/ToggleSwitch_styles styles_lineHeight_AS Failed CompareBitmap(body:step 2)  Baseline image could not be read.  Created image file as a .bad.png. 
     [java] mobile/components/ToggleSwitch/styles/ToggleSwitch_styles styles_lineThrough_default Failed CompareBitmap(body:step 2)  Baseline image could not be read.  Created image file as a .bad.png. 
     [java] mobile/components/ToggleSwitch/styles/ToggleSwitch_styles styles_lineThrough_AS Failed CompareBitmap(body:step 2)  Baseline image could not be read.  Created image file as a .bad.png. 
     [java] mobile/components/ToggleSwitch/styles/ToggleSwitch_CSS CSS_accentColor_typeselector Failed CompareBitmap(body:step 2)  Baseline image could not be read.  Created image file as a .bad.png. 
     [java] mobile/components/ToggleSwitch/styles/ToggleSwitch_CSS CSS_set_in_MXML Failed CompareBitmap(body:step 1)  Baseline image could not be read.  Created image file as a .bad.png. 
     [java] mobile/components/ToggleSwitch/styles/ToggleSwitch_CSS CSS_accentColor_AS Failed CompareBitmap(body:step 2)  Baseline image could not be read.  Created image file as a .bad.png. 
     [java] mobile/components/ToggleSwitch/styles/ToggleSwitch_CSS CSS_chromeColor_default Failed CompareBitmap(body:step 2)  Baseline image could not be read.  Created image file as a .bad.png. 
     [java] mobile/components/ToggleSwitch/styles/ToggleSwitch_CSS CSS_chromeColor_AS Failed CompareBitmap(body:step 2)  Baseline image could not be read.  Created image file as a .bad.png. 
     [java] mobile/components/ToggleSwitch/styles/ToggleSwitch_CSS CSS_color_default Failed CompareBitmap(body:step 2)  Baseline image could not be read.  Created image file as a .bad.png. 
     [java] mobile/components/ToggleSwitch/styles/ToggleSwitch_CSS CSS_color_AS Failed CompareBitmap(body:step 2)  Baseline image could not be read.  Created image file as a .bad.png. 
     [java] mobile/components/ToggleSwitch/styles/ToggleSwitch_CSS CSS_color_disabled Failed CompareBitmap(body:step 3)  Baseline image could not be read.  Created image file as a .bad.png. 
     [java] mobile/components/ToggleSwitch/styles/ToggleSwitch_CSS CSS_fontSize_default Failed AssertStyleValue(body:step 1)  stylesRoot.target1.fontSize 27 != 36 
     [java] mobile/components/ToggleSwitch/styles/ToggleSwitch_CSS CSS_fontSize_AS Failed CompareBitmap(body:step 2)  Baseline image could not be read.  Created image file as a .bad.png. 
     [java] mobile/components/ToggleSwitch/styles/ToggleSwitch_CSS CSS_fontStyle_default Failed CompareBitmap(body:step 2)  Baseline image could not be read.  Created image file as a .bad.png. 
     [java] mobile/components/ToggleSwitch/styles/ToggleSwitch_CSS CSS_fontStyle_AS Failed CompareBitmap(body:step 2)  Baseline image could not be read.  Created image file as a .bad.png. 
     [java] mobile/components/ToggleSwitch/styles/ToggleSwitch_CSS CSS_fontWeight_default Failed CompareBitmap(body:step 2)  Baseline image could not be read.  Created image file as a .bad.png. 
     [java] mobile/components/ToggleSwitch/styles/ToggleSwitch_CSS CSS_fontWeight_AS Failed CompareBitmap(body:step 2)  Baseline image could not be read.  Created image file as a .bad.png. 
     [java] mobile/components/ToggleSwitch/styles/ToggleSwitch_CSS CSS_fontFamily_default Failed CompareBitmap(body:step 2)  Baseline image could not be read.  Created image file as a .bad.png. 
     [java] mobile/components/ToggleSwitch/styles/ToggleSwitch_CSS CSS_fontFamily_AS Failed CompareBitmap(body:step 2)  Baseline image could not be read.  Created image file as a .bad.png. 
     [java] mobile/components/ToggleSwitch/styles/ToggleSwitch_CSS CSS_textAlign_default Failed CompareBitmap(body:step 2)  Baseline image could not be read.  Created image file as a .bad.png. 
     [java] mobile/components/ToggleSwitch/styles/ToggleSwitch_CSS CSS_textAlign_AS Failed CompareBitmap(body:step 2)  Baseline image could not be read.  Created image file as a .bad.png. 
     [java] mobile/components/ToggleSwitch/styles/ToggleSwitch_CSS CSS_textAlpha_default Failed CompareBitmap(body:step 2)  Baseline image could not be read.  Created image file as a .bad.png. 
     [java] mobile/components/ToggleSwitch/styles/ToggleSwitch_CSS CSS_textAlpha_AS Failed CompareBitmap(body:step 2)  Baseline image could not be read.  Created image file as a .bad.png. 
     [java] mobile/components/ToggleSwitch/styles/ToggleSwitch_CSS CSS_textDecoration_default Failed CompareBitmap(body:step 2)  Baseline image could not be read.  Created image file as a .bad.png. 
     [java] mobile/components/ToggleSwitch/styles/ToggleSwitch_CSS CSS_textDecoration_AS Failed CompareBitmap(body:step 2)  Baseline image could not be read.  Created image file as a .bad.png. 
     [java] mobile/components/ToggleSwitch/styles/ToggleSwitch_CSS CSS_lineHeight_default Failed CompareBitmap(body:step 2)  Baseline image could not be read.  Created image file as a .bad.png. 
     [java] mobile/components/ToggleSwitch/styles/ToggleSwitch_CSS CSS_lineHeight_AS Failed CompareBitmap(body:step 2)  Baseline image could not be read.  Created image file as a .bad.png. 
     [java] mobile/components/ToggleSwitch/styles/ToggleSwitch_CSS CSS_lineThrough_default Failed CompareBitmap(body:step 2)  Baseline image could not be read.  Created image file as a .bad.png. 
     [java] mobile/components/ToggleSwitch/styles/ToggleSwitch_CSS CSS_lineThrough_AS Failed CompareBitmap(body:step 2)  Baseline image could not be read.  Created image file as a .bad.png. 
     [java] mobile/components/ToggleSwitch/styles/ToggleSwitch_advancedCSS advancedCSS_typeselector_unselected Failed CompareBitmap(body:step 1)  Baseline image could not be read.  Created image file as a .bad.png. 
     [java] mobile/components/ToggleSwitch/styles/ToggleSwitch_advancedCSS advancedCSS_typeselector_selected Failed CompareBitmap(body:step 1)  Baseline image could not be read.  Created image file as a .bad.png. 
     [java] mobile/components/ToggleSwitch/styles/ToggleSwitch_advancedCSS advancedCSS_classselector_unselected Failed CompareBitmap(body:step 1)  Baseline image could not be read.  Created image file as a .bad.png. 
     [java] mobile/components/ToggleSwitch/styles/ToggleSwitch_advancedCSS advancedCSS_classselector_selected Failed CompareBitmap(body:step 1)  Baseline image could not be read.  Created image file as a .bad.png. 
     [java] mobile/components/ToggleSwitch/styles/ToggleSwitch_advancedCSS advancedCSS_advancedselector_unselected Failed CompareBitmap(body:step 1)  Baseline image could not be read.  Created image file as a .bad.png. 
     [java] mobile/components/ToggleSwitch/styles/ToggleSwitch_advancedCSS advancedCSS_advancedselector_selected Failed CompareBitmap(body:step 1)  Baseline image could not be read.  Created image file as a .bad.png. 
     [java] mobile/components/ViewMenu/integration/ViewMenu_Integration3 ThreeButtonsMenuPortrait1 Failed CompareBitmap(body:step 6)  Baseline image could not be read.  Created image file as a .bad.png. 
     [java] mobile/components/ViewMenu/integration/ViewMenu_Integration3 ThreeButtonsMenuPortrait2 Failed CompareBitmap(body:step 9)  Baseline image could not be read.  Created image file as a .bad.png. 
     [java] mobile/components/ViewMenu/integration/ViewMenu_Integration3 ThreeButtonsMenuPortrait3 Failed CompareBitmap(body:step 14)  Baseline image could not be read.  Created image file as a .bad.png. 
     [java] mobile/components/ViewMenu/integration/ViewMenu_Integration3 ThreeButtonsMenuPortrait4 Failed CompareBitmap(body:step 14)  Baseline image could not be read.  Created image file as a .bad.png. 
     [java] mobile/components/ViewMenu/integration/ViewMenu_Integration3 ThreeButtonsMenuPortrait6 Failed CompareBitmap(body:step 5)  Baseline image could not be read.  Created image file as a .bad.png. 
     [java] mobile/components/ViewMenu/integration/ViewMenu_Integration3 ThreeButtonsMenuPortrait7 Failed CompareBitmap(body:step 6)  Baseline image could not be read.  Created image file as a .bad.png. 
     [java] mobile/components/ViewMenu/integration/ViewMenu_Integration3 ThreeButtonsMenuPortrait8 Failed CompareBitmap(body:step 6)  Baseline image could not be read.  Created image file as a .bad.png. 
     [java] mobile/components/ViewMenu/integration/ViewMenu_Integration3 ThreeButtonsMenuPortrait9 Failed CompareBitmap(body:step 6)  Baseline image could not be read.  Created image file as a .bad.png. 
     [java] mobile/components/ViewMenu/integration/ViewMenu_Integration4 FourItemsMenuPortrait1 Failed CompareBitmap(body:step 6)  Baseline image could not be read.  Created image file as a .bad.png. 
     [java] mobile/components/ViewMenu/integration/ViewMenu_Integration4 FourItemsMenuPortrait2 Failed CompareBitmap(body:step 9)  Baseline image could not be read.  Created image file as a .bad.png. 
     [java] mobile/components/ViewMenu/integration/ViewMenu_Integration4 FourItemsMenuPortrait3 Failed CompareBitmap(body:step 14)  Baseline image could not be read.  Created image file as a .bad.png. 
     [java] mobile/components/ViewMenu/integration/ViewMenu_Integration4 FourItemsMenuPortrait4 Failed CompareBitmap(body:step 14)  Baseline image could not be read.  Created image file as a .bad.png. 
     [java] mobile/components/ViewMenu/integration/ViewMenu_Integration4 FourItemsMenuPortrait5 Failed CompareBitmap(body:step 7)  Baseline image could not be read.  Created image file as a .bad.png. 
     [java] mobile/components/ViewMenu/integration/ViewMenu_Integration4 FourItemsMenuPortrait6 Failed CompareBitmap(body:step 9)  Baseline image could not be read.  Created image file as a .bad.png. 
     [java] mobile/components/ViewMenu/integration/ViewMenu_Integration4 FourItemsMenuPortrait7 Failed CompareBitmap(body:step 9)  Baseline image could not be read.  Created image file as a .bad.png. 
     [java] mobile/components/ViewMenu/integration/ViewMenu_Integration4 FourItemsMenuPortrait8 Failed CompareBitmap(body:step 6)  compare returned-3 
     [java] mobile/components/ViewMenu/integration/ViewMenu_Integration4 FourItemsMenuPortrait9 Failed CompareBitmap(body:step 6)  Baseline image could not be read.  Created image file as a .bad.png. 
     [java] mobile/components/ViewMenu/integration/ViewMenu_Integration5 FiveItemsMenuPortrait1 Failed CompareBitmap(body:step 12)  Baseline image could not be read.  Created image file as a .bad.png. 
     [java] mobile/components/ViewMenu/integration/ViewMenu_Integration5 FiveItemsMenuPortrait2 Failed CompareBitmap(body:step 5)  Baseline image could not be read.  Created image file as a .bad.png. 
     [java] mobile/components/ViewMenu/integration/ViewMenu_Integration5 FiveItemsMenuPortrait3 Failed CompareBitmap(body:step 14)  Baseline image could not be read.  Created image file as a .bad.png. 
     [java] mobile/components/ViewMenu/integration/ViewMenu_Integration5 FiveItemsMenuPortrait4 Failed CompareBitmap(body:step 14)  Baseline image could not be read.  Created image file as a .bad.png. 
     [java] mobile/components/ViewMenu/integration/ViewMenu_Integration5 FiveItemsMenuPortrait5 Failed CompareBitmap(body:step 8)  Baseline image could not be read.  Created image file as a .bad.png. 
     [java] mobile/components/ViewMenu/integration/ViewMenu_Integration5 FiveItemsMenuPortrait6 Failed CompareBitmap(body:step 5)  Baseline image could not be read.  Created image file as a .bad.png. 
     [java] mobile/components/ViewMenu/integration/ViewMenu_Integration5 FiveItemsMenuPortrait7 Failed CompareBitmap(body:step 9)  Baseline image could not be read.  Created image file as a .bad.png. 
     [java] mobile/components/ViewMenu/integration/ViewMenu_Integration5 FiveItemsMenuPortrait8 Failed CompareBitmap(body:step 6)  Baseline image could not be read.  Created image file as a .bad.png. 
     [java] mobile/components/ViewMenu/integration/ViewMenu_Integration5 FiveItemsMenuPortrait9 Failed CompareBitmap(body:step 5)  Baseline image could not be read.  Created image file as a .bad.png. 
     [java] mobile/components/ViewMenu/integration/ViewMenu_Integration6 SixItemsMenuPortrait1 Failed CompareBitmap(body:step 12)  Baseline image could not be read.  Created image file as a .bad.png. 
     [java] mobile/components/ViewMenu/integration/ViewMenu_Integration6 SixItemsMenuPortrait2 Failed CompareBitmap(body:step 5)  Baseline image could not be read.  Created image file as a .bad.png. 
     [java] mobile/components/ViewMenu/integration/ViewMenu_Integration6 SixItemsMenuPortrait3 Failed CompareBitmap(body:step 14)  Baseline image could not be read.  Created image file as a .bad.png. 
     [java] mobile/components/ViewMenu/integration/ViewMenu_Integration6 SixItemsMenuPortrait4 Failed CompareBitmap(body:step 14)  Baseline image could not be read.  Created image file as a .bad.png. 
     [java] mobile/components/ViewMenu/integration/ViewMenu_Integration6 SixItemsMenuPortrait5 Failed CompareBitmap(body:step 8)  Baseline image could not be read.  Created image file as a .bad.png. 
     [java] mobile/components/ViewMenu/integration/ViewMenu_Integration6 SixItemsMenuPortrait6 Failed CompareBitmap(body:step 5)  Baseline image could not be read.  Created image file as a .bad.png. 
     [java] mobile/components/ViewMenu/integration/ViewMenu_Integration6 SixItemsMenuPortrait7 Failed CompareBitmap(body:step 9)  Baseline image could not be read.  Created image file as a .bad.png. 
     [java] mobile/components/ViewMenu/integration/ViewMenu_Integration6 SixItemsMenuPortrait8 Failed CompareBitmap(body:step 6)  Baseline image could not be read.  Created image file as a .bad.png. 
     [java] mobile/components/ViewMenu/integration/ViewMenu_Integration6 SixItemsMenuPortrait9 Failed CompareBitmap(body:step 5)  Baseline image could not be read.  Created image file as a .bad.png. 
     [java] mobile/components/ViewMenu/integration/ViewMenu_Integration6 SixItemsMenuPortrait10 Failed CompareBitmap(body:step 7)  Baseline image could not be read.  Created image file as a .bad.png. 
     [java] mobile/components/ViewMenu/integration/ViewMenu_Integration7 SevenItemsMenuPortrait1 Failed CompareBitmap(body:step 12)  Baseline image could not be read.  Created image file as a .bad.png. 
     [java] mobile/components/ViewMenu/integration/ViewMenu_Integration7 SevenItemsMenuPortrait3 Failed CompareBitmap(body:step 14)  Baseline image could not be read.  Created image file as a .bad.png. 
     [java] mobile/components/ViewMenu/properties/ViewMenu_Properties1 OneViewMenuButtonPortrait1 Failed CompareBitmap(body:step 5)  Baseline image could not be read.  Created image file as a .bad.png. 
     [java] mobile/components/ViewMenu/properties/ViewMenu_Properties1 OneViewMenuButtonPortrait2 Failed CompareBitmap(body:step 5)  Baseline image could not be read.  Created image file as a .bad.png. 
     [java] mobile/components/ViewMenu/properties/ViewMenu_Properties1 OneViewMenuButtonPortrait3 Failed CompareBitmap(body:step 5)  Baseline image could not be read.  Created image file as a .bad.png. 
     [java] mobile/components/ViewMenu/properties/ViewMenu_Properties1 OneViewMenuButtonPortrait5 Failed CompareBitmap(body:step 10)  Baseline image could not be read.  Created image file as a .bad.png. 
     [java] mobile/components/ViewMenu/properties/ViewMenu_Properties1 OneViewMenuButtonPortrait6 Failed CompareBitmap(body:step 5)  Baseline image could not be read.  Created image file as a .bad.png. 
     [java] mobile/components/ViewMenu/properties/ViewMenu_Properties2 TwoButtonsMenuPortrait1 Failed CompareBitmap(body:step 6)  Baseline image could not be read.  Created image file as a .bad.png. 
     [java] mobile/components/ViewMenu/properties/ViewMenu_Properties2 TwoButtonsMenuPortrait2 Failed CompareBitmap(body:step 5)  Baseline image could not be read.  Created image file as a .bad.png. 
     [java] mobile/components/ViewMenu/properties/ViewMenu_Properties2 TwoButtonsMenuPortrait3 Failed CompareBitmap(body:step 5)  Baseline image could not be read.  Created image file as a .bad.png. 
     [java] mobile/components/ViewMenu/properties/ViewMenu_Properties2 TwoButtonsMenuPortrait8 Failed CompareBitmap(body:step 5)  Baseline image could not be read.  Created image file as a .bad.png. 
     [java] mobile/components/ViewMenu/properties/ViewMenu_Properties2 TwoButtonsMenuPortrait9 Failed CompareBitmap(body:step 6)  Baseline image could not be read.  Created image file as a .bad.png. 
     [java] mobile/components/ViewMenu/properties/ViewMenu_Properties2 TwoButtonsMenuPortrait10 Failed CompareBitmap(body:step 8)  Baseline image could not be read.  Created image file as a .bad.png. 
     [java] mobile/components/ViewMenu/properties/ViewMenu_Properties2 TwoButtonsMenuPortrait11 Failed CompareBitmap(body:step 6)  Baseline image could not be read.  Created image file as a .bad.png. 
     [java] mobile/components/ViewMenu/properties/ViewMenu_Properties2 TwoButtonsMenuPortrait12 Failed CompareBitmap(body:step 6)  Baseline image could not be read.  Created image file as a .bad.png. 
     [java] mobile/components/ViewMenu/properties/ViewMenu_Properties2 TwoButtonsMenuPortrait13 Failed CompareBitmap(body:step 6)  Baseline image could not be read.  Created image file as a .bad.png. 
     [java] mobile/components/ViewMenu/properties/ViewMenu_Properties2 TwoButtonsMenuPortrait14 Failed CompareBitmap(body:step 5)  Baseline image could not be read.  Created image file as a .bad.png. 
     [java] mobile/components/ViewMenu/integration/ViewMenu_CustomSkinTester CustomSkinSevenItemsMenuPortrait1 Failed CompareBitmap(body:step 3)  Baseline image could not be read.  Created image file as a .bad.png. 
     [java] mobile/components/ViewMenu/integration/ViewMenu_CustomSkinTester CustomSkinSevenItemsMenuPortrait2 Failed RunCode(body:step 1)  Timeout waiting for viewMenuOpen from navigator.activeView 
     [java] mobile/components/ViewMenu/integration/ViewMenuScaleTester ViewMenu240Scale Failed CompareBitmap(body:step 5)  Baseline image could not be read.  Created image file as a .bad.png. 
     [java] mobile/components/ViewMenu/integration/ViewMenuScaleTester BusyIndicator240Scale Failed CompareBitmap(body:step 4)  Baseline image could not be read.  Created image file as a .bad.png. 
     [java] mobile/utils/MultiDPIBitmapSource/integration/MultiDPIBitmapSource_integration MultiDPIBitmapSource_integ_160_embed Failed CompareBitmap(body:step 2)  compare returned[object BitmapData] 
     [java] mobile/utils/MultiDPIBitmapSource/integration/MultiDPIBitmapSource_integration MultiDPIBitmapSource_integ_160_refer Failed CompareBitmap(body:step 2)  compare returned[object BitmapData] 
     [java] mobile/utils/MultiDPIBitmapSource/integration/MultiDPIBitmapSource_integration MultiDPIBitmapSource_integ_240_embed Failed CompareBitmap(body:step 2)  compare returned[object BitmapData] 
     [java] mobile/utils/MultiDPIBitmapSource/integration/MultiDPIBitmapSource_integration MultiDPIBitmapSource_integ_240_refer Failed CompareBitmap(body:step 2)  compare returned[object BitmapData] 
     [java] mobile/utils/MultiDPIBitmapSource/integration/MultiDPIBitmapSource_integration MultiDPIBitmapSource_integ_320_embed Failed CompareBitmap(body:step 2)  compare returned[object BitmapData] 
     [java] mobile/utils/MultiDPIBitmapSource/integration/MultiDPIBitmapSource_integration MultiDPIBitmapSource_integ_320_refer Failed CompareBitmap(body:step 2)  compare returned[object BitmapData] 
     [java] mobile/utils/MultiDPIBitmapSource/properties/MultiDPIBitmapSource_properties MultiDPIBitmapSource_nominal_embed Failed CompareBitmap(body:step 2)  compare returned-3 
     [java] mobile/utils/MultiDPIBitmapSource/properties/MultiDPIBitmapSource_properties MultiDPIBitmapSource_nominal_refer Failed CompareBitmap(body:step 2)  compare returned-3 
     [java] mobile/utils/MultiDPIBitmapSource/properties/MultiDPIBitmapSource_properties MultiDPIBitmapSource_no_160_embed Failed CompareBitmap(body:step 2)  compare returned-3 
     [java] mobile/utils/MultiDPIBitmapSource/properties/MultiDPIBitmapSource_properties MultiDPIBitmapSource_no_160_refer Failed CompareBitmap(body:step 2)  compare returned-3 
     [java] mobile/utils/MultiDPIBitmapSource/integration/MultiDPIBitmapSource_scaling MultiDPIBitmapSource_scaling_refer Failed CompareBitmap(body:step 2)  compare returned-3 
     [java] mobile/utils/MultiDPIBitmapSource/integration/MultiDPIBitmapSource_scaling MultiDPIBitmapSource_scaling_embed Failed CompareBitmap(body:step 2)  compare returned-3 
     [java] 
     [java] 
     [java] =====================================================
     [java]     Passes: 0
     [java]     Fails: 1606
     [java] =====================================================
     [java] 
     [java] 
     [java] Wrote summary to results.txt
     [java] Wrote failures to failures.txt

BUILD FAILED
C:\jenkins_slave\workspace\flex-sdk_mustella-mobile\mustella\build.xml:1538: The following error occurred while executing this line:
C:\jenkins_slave\workspace\flex-sdk_mustella-mobile\mustella\build.xml:1656: Java returned: 1

Total time: 35 minutes 33 seconds
Some of tests failed, even after running '-failures'...
Build step 'Execute shell' marked build as failure

Build failed in Jenkins: flex-sdk_mustella-mobile #27

Posted by fl...@gmail.com.
See <http://localhost:8080/job/flex-sdk_mustella-mobile/27/changes>

Changes:

[jmclean] FLEX-33604 Stop tooltips from showing before object is visible.

------------------------------------------
[...truncated 24203 lines...]
     [java] mobile/components/TextArea/Styles/TextArea_styles_tester TextArea_leading_test2 Failed CompareBitmap(body:step 3)  compare returned-3 
     [java] mobile/components/TextArea/Styles/TextArea_styles_tester TextArea_leading_test3 Failed CompareBitmap(body:step 3)  compare returned-3 
     [java] mobile/components/TextArea/Styles/TextArea_styles_tester TextArea_letterSpacing_test1 Failed CompareBitmap(body:step 3)  compare returned-3 
     [java] mobile/components/TextArea/Styles/TextArea_styles_tester TextArea_letterSpacing_test2 Failed CompareBitmap(body:step 3)  compare returned-3 
     [java] mobile/components/TextArea/Styles/TextArea_styles_tester TextArea_letterSpacing_test3 Failed CompareBitmap(body:step 4)  compare returned-3 
     [java] mobile/components/TextArea/Styles/TextArea_styles_tester TextArea_fontFamily_test1 Failed CompareBitmap(body:step 3)  compare returned-3 
     [java] mobile/components/TextInput/Methods/TextInput_Methods_tester TextInput_selectAll_test1 Failed CompareBitmap(body:step 5)  compare returned-4 
     [java] mobile/components/TextInput/Methods/TextInput_Methods_tester TextInput_selectRange_test1 Failed CompareBitmap(body:step 2)  compare returned-4 
     [java] mobile/components/TextInput/Methods/TextInput_Methods_tester TextInput_selectRange_test3 Failed CompareBitmap(body:step 5)  compare returned-4 
     [java] mobile/components/TextInput/Methods/TextInput_Methods_tester TextInput_selectRange_test4 Failed CompareBitmap(body:step 5)  compare returned-4 
     [java] mobile/components/TextInput/Methods/TextInput_Methods_tester TextInput_selectRange_test5 Failed CompareBitmap(body:step 5)  compare returned-4 
     [java] mobile/components/TextInput/Methods/TextInput_Methods_tester TextInput_selectRange_test6 Failed CompareBitmap(body:step 5)  compare returned-4 
     [java] mobile/components/TextInput/Methods/TextInput_Methods_tester TextInput_selectRange_test7 Failed CompareBitmap(body:step 5)  compare returned-4 
     [java] mobile/components/TextInput/Methods/TextInput_Methods_tester TextInput_truncateToFit_test1 Failed CompareBitmap(body:step 5)  compare returned-4 
     [java] mobile/components/TextInput/Methods/TextInput_Methods_tester TextInput_truncateToFit_test2 Failed AssertMethodValue (method cannot be shown)(body:step 4)  method returned Lorem ipsum dolor sit ..., expected Lorem ipsum d... 
     [java] mobile/components/TextInput/Methods/TextInput_Methods_tester TextInput_truncateToFit_test3 Failed AssertMethodValue (method cannot be shown)(body:step 4)  method returned Lorem ipsum dolor sit ..., expected Lorem ipsum d... 
     [java] mobile/components/TextInput/Methods/TextInput_Methods_tester TextInput_truncateToFit_test4 Failed AssertMethodValue (method cannot be shown)(body:step 4)  method returned Lorem ipsum dolor sit ..., expected Lorem ipsum d... 
     [java] mobile/components/TextInput/Methods/TextInput_Methods_tester TextInput_truncateToFit_test5 Failed AssertMethodValue (method cannot be shown)(body:step 4)  method returned Lorem ipsum dolor sit a , expected Lorem ipsum do  
     [java] mobile/components/TextInput/Methods/TextInput_Methods_tester TextInput_truncateToFit_test6 Failed AssertMethodValue (method cannot be shown)(body:step 4)  method returned Lorem ipsum dolor s§¥©, expected Lorem ipsu§¥© 
     [java] mobile/components/TextInput/Methods/TextInput_Methods_tester TextInput_truncateToFit_test7 Failed AssertMethodValue (method cannot be shown)(body:step 4)  method returned Lorem ipsum dolor sit a, expected Lorem ipsum dol 
     [java] mobile/components/TextInput/Methods/TextInput_Methods_tester TextInput_truncateToFit_test8 Failed AssertMethodValue (method cannot be shown)(body:step 4)  method returned Lorem ipsum dolor sit a, expected Lorem ipsum dol 
     [java] mobile/components/TextInput/Methods/TextInput_Methods_tester TextInput_truncateToFit_test9 Failed AssertMethodValue (method cannot be shown)(body:step 4)  method returned Lorem ipsum dolor sit a, expected Lorem ipsum dol 
     [java] mobile/components/TextInput/Properties/TextInput_properties_tester TextInput_basic_prompt Failed CompareBitmap(body:step 3)  compare returned-3 
     [java] mobile/components/TextInput/Properties/TextInput_properties_tester TextInput_prompt_disappears Failed CompareBitmap(body:step 7)  compare returned-3 
     [java] mobile/components/TextInput/Properties/TextInput_properties_tester TextInput_prompt_returns_on_text_removal Failed CompareBitmap(body:step 10)  compare returned-3 
     [java] mobile/components/TextInput/Properties/TextInput_properties_tester TextInput_displayAsPassword_test2 Failed CompareBitmap(body:step 2)  compare returned-3 
     [java] mobile/components/TextInput/Properties/TextInput_properties_tester TextInput_displayAsPassword_test3 Failed CompareBitmap(body:step 2)  compare returned-3 
     [java] mobile/components/TextInput/Properties/TextInput_properties_tester TextInput_selectionActivePosition_property_mouseDown Failed AssertPropertyValue(body:step 2)  tic1.ti1.selectionAnchorPosition 2 != 1 
     [java] mobile/components/TextInput/Properties/TextInput_properties_tester TextInput_text_property Failed CompareBitmap(body:step 3)  compare returned-3 
     [java] mobile/components/TextInput/Properties/TextInput_properties_tester TextInput_text_property_japanese Failed CompareBitmap(body:step 3)  compare returned-3 
     [java] mobile/components/TextInput/Properties/TextInput_properties_tester TextInput_alpha_property_01 Failed CompareBitmap(body:step 2)  compare returned-3 
     [java] mobile/components/TextInput/Properties/TextInput_properties_tester TextInput_alpha_property_0 Failed CompareBitmap(body:step 2)  compare returned-3 
     [java] mobile/components/TextInput/Properties/TextInput_properties_tester TextInput_height_property_40 Failed CompareBitmap(body:step 2)  compare returned-3 
     [java] mobile/components/TextInput/Properties/TextInput_properties_tester TextInput_height_property_10 Failed CompareBitmap(body:step 2)  compare returned-3 
     [java] mobile/components/TextInput/Properties/TextInput_properties_tester TextInput_percentHeight_property_50 Failed CompareBitmap(body:step 3)  compare returned-3 
     [java] mobile/components/TextInput/Properties/TextInput_properties_tester TextInput_percentHeight_property_150 Failed CompareBitmap(body:step 3)  compare returned-3 
     [java] mobile/components/TextInput/Properties/TextInput_properties_tester TextInput_percentWidth_property_50 Failed CompareBitmap(body:step 3)  compare returned[object BitmapData] 
     [java] mobile/components/TextInput/Properties/TextInput_properties_tester TextInput_percentWidth_property_150 Failed CompareBitmap(body:step 3)  compare returned[object BitmapData] 
     [java] mobile/components/TextInput/Properties/TextInput_properties_tester TextInput_rotation_property_90 Failed CompareBitmap(body:step 2)  compare returned[object BitmapData] 
     [java] mobile/components/TextInput/Properties/TextInput_properties_tester TextInput_scaleX_property_2 Failed CompareBitmap(body:step 3)  compare returned[object BitmapData] 
     [java] mobile/components/TextInput/Properties/TextInput_properties_tester TextInput_width_property_default Failed AssertPropertyValue(body:step 1)  tic1.ti1.width 440 != 600 
     [java] mobile/components/TextInput/Properties/TextInput_properties_tester TextInput_width_property_40 Failed CompareBitmap(body:step 2)  compare returned[object BitmapData] 
     [java] mobile/components/TextInput/Properties/TextInput_properties_tester TextInput_width_property_200 Failed CompareBitmap(body:step 2)  compare returned[object BitmapData] 
     [java] mobile/components/TextInput/Properties/TextInput_properties_tester TextInput_x_property_positive Failed CompareBitmap(body:step 4)  compare returned[object BitmapData] 
     [java] mobile/components/TextInput/Properties/TextInput_properties_tester TextInput_x_property_negative Failed CompareBitmap(body:step 3)  compare returned[object BitmapData] 
     [java] mobile/components/TextInput/Properties/TextInput_properties_tester TextInput_y_property_positive Failed CompareBitmap(body:step 4)  compare returned[object BitmapData] 
     [java] mobile/components/TextInput/Properties/TextInput_properties_tester TextInput_y_property_negative Failed CompareBitmap(body:step 3)  compare returned[object BitmapData] 
     [java] mobile/components/TextInput/Properties/TextInput_properties_tester TextInput_baselinePosition_property_preValidation Failed AssertPropertyValue(body:step 1)  tic2.ti1.baselinePosition 36.650000 != 43.700000 
     [java] mobile/components/TextInput/Properties/TextInput_properties_tester TextInput_baselinePosition_property_postValidation Failed AssertPropertyValue(body:step 1)  tic2.ti1.baselinePosition 36.650000 != 43.700000 
     [java] mobile/components/TextInput/Styles/TextInput_styles_tester TextInput_color_test1 Failed CompareBitmap(body:step 1)  compare returned-3 
     [java] mobile/components/TextInput/Styles/TextInput_styles_tester TextInput_color_test2 Failed CompareBitmap(body:step 2)  compare returned-3 
     [java] mobile/components/TextInput/Styles/TextInput_styles_tester TextInput_color_test3 Failed CompareBitmap(body:step 1)  compare returned-3 
     [java] mobile/components/TextInput/Styles/TextInput_styles_tester TextInput_color_test4 Failed CompareBitmap(body:step 3)  compare returned-3 
     [java] mobile/components/TextInput/Styles/TextInput_styles_tester TextInput_color_test5 Failed CompareBitmap(body:step 2)  compare returned-3 
     [java] mobile/components/TextInput/Styles/TextInput_styles_tester TextInput_focusColor_test1 Failed AssertPixelValue(body:step 3)  tic3.grp1 pixel at (10,10) 99FF99 != 0xF7FFF7 
     [java] mobile/components/TextInput/Styles/TextInput_styles_tester TextInput_focusColor_test2 Failed AssertPixelValue(body:step 4)  tic3.grp2 pixel at (10,10) 99FF99 != 0xF7FFF7 
     [java] mobile/components/TextInput/Styles/TextInput_styles_tester TextInput_focusColor_test3 Failed AssertPixelValue(body:step 3)  tic3.grp3 pixel at (10,10) 99FF99 != 0xF7FFF7 
     [java] mobile/components/TextInput/Styles/TextInput_styles_tester TextInput_contentBackgroundColor_test1 Failed CompareBitmap(body:step 2)  compare returned-3 
     [java] mobile/components/TextInput/Styles/TextInput_styles_tester TextInput_contentBackgroundColor_test2 Failed CompareBitmap(body:step 2)  compare returned-3 
     [java] mobile/components/TextInput/Styles/TextInput_styles_tester TextInput_contentBackgroundColor_test3 Failed CompareBitmap(body:step 1)  compare returned-3 
     [java] mobile/components/TextInput/Styles/TextInput_styles_tester TextInput_contentBackgroundColor_test4 Failed CompareBitmap(body:step 3)  compare returned-3 
     [java] mobile/components/TextInput/Styles/TextInput_styles_tester TextInput_textAlign_test1 Failed CompareBitmap(body:step 3)  compare returned-3 
     [java] mobile/components/TextInput/Styles/TextInput_styles_tester TextInput_textAlign_test2 Failed CompareBitmap(body:step 3)  compare returned-3 
     [java] mobile/components/TextInput/Styles/TextInput_styles_tester TextInput_textAlign_test3 Failed CompareBitmap(body:step 3)  compare returned-3 
     [java] mobile/components/TextInput/Styles/TextInput_styles_tester TextInput_textAlign_test4 Failed CompareBitmap(body:step 3)  compare returned-3 
     [java] mobile/components/TextInput/Styles/TextInput_styles_tester TextInput_textAlign_test5 Failed CompareBitmap(body:step 3)  compare returned-3 
     [java] mobile/components/TextInput/Styles/TextInput_styles_tester TextInput_textAlign_test6 Failed CompareBitmap(body:step 1)  compare returned-3 
     [java] mobile/components/TextInput/Styles/TextInput_styles_tester TextInput_fontWeight_test1 Failed CompareBitmap(body:step 3)  compare returned-3 
     [java] mobile/components/TextInput/Styles/TextInput_styles_tester TextInput_fontWeight_test2 Failed CompareBitmap(body:step 3)  compare returned-3 
     [java] mobile/components/TextInput/Styles/TextInput_styles_tester TextInput_fontSize_test1 Failed CompareBitmap(body:step 3)  compare returned-3 
     [java] mobile/components/TextInput/Styles/TextInput_styles_tester TextInput_fontSize_test2 Failed CompareBitmap(body:step 3)  compare returned-3 
     [java] mobile/components/TextInput/Styles/TextInput_styles_tester TextInput_fontSize_test3 Failed CompareBitmap(body:step 3)  compare returned-3 
     [java] mobile/components/TextInput/Styles/TextInput_styles_tester TextInput_fontSize_test4 Failed CompareBitmap(body:step 4)  compare returned-3 
     [java] mobile/components/TextInput/Styles/TextInput_styles_tester TextInput_textDecoration_test1 Failed CompareBitmap(body:step 3)  compare returned-3 
     [java] mobile/components/TextInput/Styles/TextInput_styles_tester TextInput_textDecoration_test2 Failed CompareBitmap(body:step 3)  compare returned-3 
     [java] mobile/components/TextInput/Styles/TextInput_styles_tester TextInput_textIndent_test1 Failed CompareBitmap(body:step 3)  compare returned-3 
     [java] mobile/components/TextInput/Styles/TextInput_styles_tester TextInput_textIndent_test2 Failed CompareBitmap(body:step 3)  compare returned-3 
     [java] mobile/components/TextInput/Styles/TextInput_styles_tester TextInput_textIndent_test3 Failed CompareBitmap(body:step 3)  compare returned-3 
     [java] mobile/components/TextInput/Styles/TextInput_styles_tester TextInput_textIndent_test4 Failed CompareBitmap(body:step 3)  compare returned-3 
     [java] mobile/components/TextInput/Styles/TextInput_styles_tester TextInput_letterSpacing_test1 Failed CompareBitmap(body:step 3)  compare returned-3 
     [java] mobile/components/TextInput/Styles/TextInput_styles_tester TextInput_letterSpacing_test2 Failed CompareBitmap(body:step 3)  compare returned-3 
     [java] mobile/components/TextInput/Styles/TextInput_styles_tester TextInput_letterSpacing_test3 Failed CompareBitmap(body:step 3)  compare returned-3 
     [java] mobile/components/TextInput/Styles/TextInput_styles_tester TextInput_fontFamily_test1 Failed CompareBitmap(body:step 3)  compare returned-3 
     [java] mobile/components/TextInput/Styles/TextInput_styles_tester TextInput_fontFamily_test2 Failed CompareBitmap(body:step 3)  compare returned-3 
     [java] mobile/components/TextInput/Integration/TextInput_States_tester TextInput_states_test1 Failed CompareBitmap(body:step 1)  compare returned-3 
     [java] mobile/components/TextInput/Integration/TextInput_States_tester TextInput_states_test2 Failed CompareBitmap(body:step 2)  compare returned-3 
     [java] mobile/components/TextInput/Integration/TextInput_States_tester TextInput_states_test3 Failed CompareBitmap(body:step 3)  compare returned-3 
     [java] mobile/components/ToggleSwitch/integration/ToggleSwitch_skinning custom_skin_styles Failed CompareBitmap(body:step 1)  Baseline image could not be read.  Created image file as a .bad.png. 
     [java] mobile/components/ToggleSwitch/integration/ToggleSwitch_skinning custom_skin_styles_selected Failed CompareBitmap(body:step 1)  Baseline image could not be read.  Created image file as a .bad.png. 
     [java] mobile/components/ToggleSwitch/integration/ToggleSwitch_skinning custom_skin_French_label Failed CompareBitmap(body:step 1)  Baseline image could not be read.  Created image file as a .bad.png. 
     [java] mobile/components/ToggleSwitch/integration/ToggleSwitch_skinning custom_skin_French_selected Failed CompareBitmap(body:step 1)  Baseline image could not be read.  Created image file as a .bad.png. 
     [java] mobile/components/ToggleSwitch/integration/ToggleSwitch_skinning custom_skin_Japanese_label Failed CompareBitmap(body:step 1)  Baseline image could not be read.  Created image file as a .bad.png. 
     [java] mobile/components/ToggleSwitch/integration/ToggleSwitch_skinning custom_skin_Japanese_selected Failed CompareBitmap(body:step 1)  Baseline image could not be read.  Created image file as a .bad.png. 
     [java] mobile/components/ToggleSwitch/properties/ToggleSwitch_properties width_height_default Failed AssertPropertyValue(body:step 1)  propertiesRoot.target1.width 149 != null 
     [java] mobile/components/ToggleSwitch/properties/ToggleSwitch_properties width_height_MXML Failed CompareBitmap(body:step 3)  Baseline image could not be read.  Created image file as a .bad.png. 
     [java] mobile/components/ToggleSwitch/properties/ToggleSwitch_properties width_height_AS Failed CompareBitmap(body:step 3)  Baseline image could not be read.  Created image file as a .bad.png. 
     [java] mobile/components/ToggleSwitch/properties/ToggleSwitch_properties percentWidth_percentHeight_MXML Failed CompareBitmap(body:step 3)  Baseline image could not be read.  Created image file as a .bad.png. 
     [java] mobile/components/ToggleSwitch/properties/ToggleSwitch_properties percentWidth_percentHeight_AS Failed CompareBitmap(body:step 3)  Baseline image could not be read.  Created image file as a .bad.png. 
     [java] mobile/components/ToggleSwitch/properties/ToggleSwitch_properties scaleX_scaleY_MXML Failed CompareBitmap(body:step 1)  Baseline image could not be read.  Created image file as a .bad.png. 
     [java] mobile/components/ToggleSwitch/properties/ToggleSwitch_properties scaleX_scaleY_AS Failed CompareBitmap(body:step 1)  Baseline image could not be read.  Created image file as a .bad.png. 
     [java] mobile/components/ToggleSwitch/properties/ToggleSwitch_properties enabled_false Failed CompareBitmap(body:step 1)  Baseline image could not be read.  Created image file as a .bad.png. 
     [java] mobile/components/ToggleSwitch/properties/ToggleSwitch_properties enabled_true Failed CompareBitmap(body:step 1)  Baseline image could not be read.  Created image file as a .bad.png. 
     [java] mobile/components/ToggleSwitch/styles/ToggleSwitch_styles styles_accentColor_default Failed CompareBitmap(body:step 2)  Baseline image could not be read.  Created image file as a .bad.png. 
     [java] mobile/components/ToggleSwitch/styles/ToggleSwitch_styles styles_accentColor_AS Failed CompareBitmap(body:step 2)  Baseline image could not be read.  Created image file as a .bad.png. 
     [java] mobile/components/ToggleSwitch/styles/ToggleSwitch_styles styles_chromeColor_default Failed CompareBitmap(body:step 2)  Baseline image could not be read.  Created image file as a .bad.png. 
     [java] mobile/components/ToggleSwitch/styles/ToggleSwitch_styles styles_set_in_MXML Failed CompareBitmap(body:step 1)  Baseline image could not be read.  Created image file as a .bad.png. 
     [java] mobile/components/ToggleSwitch/styles/ToggleSwitch_styles styles_chromeColor_AS Failed CompareBitmap(body:step 2)  Baseline image could not be read.  Created image file as a .bad.png. 
     [java] mobile/components/ToggleSwitch/styles/ToggleSwitch_styles styles_color_default Failed CompareBitmap(body:step 2)  Baseline image could not be read.  Created image file as a .bad.png. 
     [java] mobile/components/ToggleSwitch/styles/ToggleSwitch_styles styles_color_AS Failed CompareBitmap(body:step 2)  Baseline image could not be read.  Created image file as a .bad.png. 
     [java] mobile/components/ToggleSwitch/styles/ToggleSwitch_styles styles_baseColor_mouseOver Failed CompareBitmap(body:step 2)  Baseline image could not be read.  Created image file as a .bad.png. 
     [java] mobile/components/ToggleSwitch/styles/ToggleSwitch_styles styles_baseColor_disabled Failed CompareBitmap(body:step 2)  Baseline image could not be read.  Created image file as a .bad.png. 
     [java] mobile/components/ToggleSwitch/styles/ToggleSwitch_styles styles_color_disabled Failed CompareBitmap(body:step 3)  Baseline image could not be read.  Created image file as a .bad.png. 
     [java] mobile/components/ToggleSwitch/styles/ToggleSwitch_styles styles_fontSize_default Failed AssertStyleValue(body:step 1)  stylesRoot.target1.fontSize 27 != 36 
     [java] mobile/components/ToggleSwitch/styles/ToggleSwitch_styles styles_fontSize_AS Failed CompareBitmap(body:step 2)  Baseline image could not be read.  Created image file as a .bad.png. 
     [java] mobile/components/ToggleSwitch/styles/ToggleSwitch_styles styles_fontStyle_default Failed CompareBitmap(body:step 2)  Baseline image could not be read.  Created image file as a .bad.png. 
     [java] mobile/components/ToggleSwitch/styles/ToggleSwitch_styles styles_fontStyle_AS Failed CompareBitmap(body:step 2)  Baseline image could not be read.  Created image file as a .bad.png. 
     [java] mobile/components/ToggleSwitch/styles/ToggleSwitch_styles styles_fontWeight_default Failed CompareBitmap(body:step 2)  Baseline image could not be read.  Created image file as a .bad.png. 
     [java] mobile/components/ToggleSwitch/styles/ToggleSwitch_styles styles_fontWeight_AS Failed CompareBitmap(body:step 2)  Baseline image could not be read.  Created image file as a .bad.png. 
     [java] mobile/components/ToggleSwitch/styles/ToggleSwitch_styles styles_fontFamily_default Failed CompareBitmap(body:step 2)  Baseline image could not be read.  Created image file as a .bad.png. 
     [java] mobile/components/ToggleSwitch/styles/ToggleSwitch_styles styles_fontFamily_AS Failed CompareBitmap(body:step 2)  Baseline image could not be read.  Created image file as a .bad.png. 
     [java] mobile/components/ToggleSwitch/styles/ToggleSwitch_styles styles_textAlign_default Failed CompareBitmap(body:step 2)  Baseline image could not be read.  Created image file as a .bad.png. 
     [java] mobile/components/ToggleSwitch/styles/ToggleSwitch_styles styles_textAlign_AS Failed CompareBitmap(body:step 2)  Baseline image could not be read.  Created image file as a .bad.png. 
     [java] mobile/components/ToggleSwitch/styles/ToggleSwitch_styles styles_textAlpha_default Failed CompareBitmap(body:step 2)  Baseline image could not be read.  Created image file as a .bad.png. 
     [java] mobile/components/ToggleSwitch/styles/ToggleSwitch_styles styles_textAlpha_AS Failed CompareBitmap(body:step 2)  Baseline image could not be read.  Created image file as a .bad.png. 
     [java] mobile/components/ToggleSwitch/styles/ToggleSwitch_styles styles_textDecoration_default Failed CompareBitmap(body:step 2)  Baseline image could not be read.  Created image file as a .bad.png. 
     [java] mobile/components/ToggleSwitch/styles/ToggleSwitch_styles styles_textDecoration_AS Failed CompareBitmap(body:step 2)  Baseline image could not be read.  Created image file as a .bad.png. 
     [java] mobile/components/ToggleSwitch/styles/ToggleSwitch_styles styles_lineHeight_default Failed CompareBitmap(body:step 2)  Baseline image could not be read.  Created image file as a .bad.png. 
     [java] mobile/components/ToggleSwitch/styles/ToggleSwitch_styles styles_lineHeight_AS Failed CompareBitmap(body:step 2)  Baseline image could not be read.  Created image file as a .bad.png. 
     [java] mobile/components/ToggleSwitch/styles/ToggleSwitch_styles styles_lineThrough_default Failed CompareBitmap(body:step 2)  Baseline image could not be read.  Created image file as a .bad.png. 
     [java] mobile/components/ToggleSwitch/styles/ToggleSwitch_styles styles_lineThrough_AS Failed CompareBitmap(body:step 2)  Baseline image could not be read.  Created image file as a .bad.png. 
     [java] mobile/components/ToggleSwitch/styles/ToggleSwitch_CSS CSS_accentColor_typeselector Failed CompareBitmap(body:step 2)  Baseline image could not be read.  Created image file as a .bad.png. 
     [java] mobile/components/ToggleSwitch/styles/ToggleSwitch_CSS CSS_set_in_MXML Failed CompareBitmap(body:step 1)  Baseline image could not be read.  Created image file as a .bad.png. 
     [java] mobile/components/ToggleSwitch/styles/ToggleSwitch_CSS CSS_accentColor_AS Failed CompareBitmap(body:step 2)  Baseline image could not be read.  Created image file as a .bad.png. 
     [java] mobile/components/ToggleSwitch/styles/ToggleSwitch_CSS CSS_chromeColor_default Failed CompareBitmap(body:step 2)  Baseline image could not be read.  Created image file as a .bad.png. 
     [java] mobile/components/ToggleSwitch/styles/ToggleSwitch_CSS CSS_chromeColor_AS Failed CompareBitmap(body:step 2)  Baseline image could not be read.  Created image file as a .bad.png. 
     [java] mobile/components/ToggleSwitch/styles/ToggleSwitch_CSS CSS_color_default Failed CompareBitmap(body:step 2)  Baseline image could not be read.  Created image file as a .bad.png. 
     [java] mobile/components/ToggleSwitch/styles/ToggleSwitch_CSS CSS_color_AS Failed CompareBitmap(body:step 2)  Baseline image could not be read.  Created image file as a .bad.png. 
     [java] mobile/components/ToggleSwitch/styles/ToggleSwitch_CSS CSS_color_disabled Failed CompareBitmap(body:step 3)  Baseline image could not be read.  Created image file as a .bad.png. 
     [java] mobile/components/ToggleSwitch/styles/ToggleSwitch_CSS CSS_fontSize_default Failed AssertStyleValue(body:step 1)  stylesRoot.target1.fontSize 27 != 36 
     [java] mobile/components/ToggleSwitch/styles/ToggleSwitch_CSS CSS_fontSize_AS Failed CompareBitmap(body:step 2)  Baseline image could not be read.  Created image file as a .bad.png. 
     [java] mobile/components/ToggleSwitch/styles/ToggleSwitch_CSS CSS_fontStyle_default Failed CompareBitmap(body:step 2)  Baseline image could not be read.  Created image file as a .bad.png. 
     [java] mobile/components/ToggleSwitch/styles/ToggleSwitch_CSS CSS_fontStyle_AS Failed CompareBitmap(body:step 2)  Baseline image could not be read.  Created image file as a .bad.png. 
     [java] mobile/components/ToggleSwitch/styles/ToggleSwitch_CSS CSS_fontWeight_default Failed CompareBitmap(body:step 2)  Baseline image could not be read.  Created image file as a .bad.png. 
     [java] mobile/components/ToggleSwitch/styles/ToggleSwitch_CSS CSS_fontWeight_AS Failed CompareBitmap(body:step 2)  Baseline image could not be read.  Created image file as a .bad.png. 
     [java] mobile/components/ToggleSwitch/styles/ToggleSwitch_CSS CSS_fontFamily_default Failed CompareBitmap(body:step 2)  Baseline image could not be read.  Created image file as a .bad.png. 
     [java] mobile/components/ToggleSwitch/styles/ToggleSwitch_CSS CSS_fontFamily_AS Failed CompareBitmap(body:step 2)  Baseline image could not be read.  Created image file as a .bad.png. 
     [java] mobile/components/ToggleSwitch/styles/ToggleSwitch_CSS CSS_textAlign_default Failed CompareBitmap(body:step 2)  Baseline image could not be read.  Created image file as a .bad.png. 
     [java] mobile/components/ToggleSwitch/styles/ToggleSwitch_CSS CSS_textAlign_AS Failed CompareBitmap(body:step 2)  Baseline image could not be read.  Created image file as a .bad.png. 
     [java] mobile/components/ToggleSwitch/styles/ToggleSwitch_CSS CSS_textAlpha_default Failed CompareBitmap(body:step 2)  Baseline image could not be read.  Created image file as a .bad.png. 
     [java] mobile/components/ToggleSwitch/styles/ToggleSwitch_CSS CSS_textAlpha_AS Failed CompareBitmap(body:step 2)  Baseline image could not be read.  Created image file as a .bad.png. 
     [java] mobile/components/ToggleSwitch/styles/ToggleSwitch_CSS CSS_textDecoration_default Failed CompareBitmap(body:step 2)  Baseline image could not be read.  Created image file as a .bad.png. 
     [java] mobile/components/ToggleSwitch/styles/ToggleSwitch_CSS CSS_textDecoration_AS Failed CompareBitmap(body:step 2)  Baseline image could not be read.  Created image file as a .bad.png. 
     [java] mobile/components/ToggleSwitch/styles/ToggleSwitch_CSS CSS_lineHeight_default Failed CompareBitmap(body:step 2)  Baseline image could not be read.  Created image file as a .bad.png. 
     [java] mobile/components/ToggleSwitch/styles/ToggleSwitch_CSS CSS_lineHeight_AS Failed CompareBitmap(body:step 2)  Baseline image could not be read.  Created image file as a .bad.png. 
     [java] mobile/components/ToggleSwitch/styles/ToggleSwitch_CSS CSS_lineThrough_default Failed CompareBitmap(body:step 2)  Baseline image could not be read.  Created image file as a .bad.png. 
     [java] mobile/components/ToggleSwitch/styles/ToggleSwitch_CSS CSS_lineThrough_AS Failed CompareBitmap(body:step 2)  Baseline image could not be read.  Created image file as a .bad.png. 
     [java] mobile/components/ToggleSwitch/styles/ToggleSwitch_advancedCSS advancedCSS_typeselector_unselected Failed CompareBitmap(body:step 1)  Baseline image could not be read.  Created image file as a .bad.png. 
     [java] mobile/components/ToggleSwitch/styles/ToggleSwitch_advancedCSS advancedCSS_typeselector_selected Failed CompareBitmap(body:step 1)  Baseline image could not be read.  Created image file as a .bad.png. 
     [java] mobile/components/ToggleSwitch/styles/ToggleSwitch_advancedCSS advancedCSS_classselector_unselected Failed CompareBitmap(body:step 1)  Baseline image could not be read.  Created image file as a .bad.png. 
     [java] mobile/components/ToggleSwitch/styles/ToggleSwitch_advancedCSS advancedCSS_classselector_selected Failed CompareBitmap(body:step 1)  Baseline image could not be read.  Created image file as a .bad.png. 
     [java] mobile/components/ToggleSwitch/styles/ToggleSwitch_advancedCSS advancedCSS_advancedselector_unselected Failed CompareBitmap(body:step 1)  Baseline image could not be read.  Created image file as a .bad.png. 
     [java] mobile/components/ToggleSwitch/styles/ToggleSwitch_advancedCSS advancedCSS_advancedselector_selected Failed CompareBitmap(body:step 1)  Baseline image could not be read.  Created image file as a .bad.png. 
     [java] mobile/components/ViewMenu/integration/ViewMenu_Integration3 ThreeButtonsMenuPortrait1 Failed CompareBitmap(body:step 6)  Baseline image could not be read.  Created image file as a .bad.png. 
     [java] mobile/components/ViewMenu/integration/ViewMenu_Integration3 ThreeButtonsMenuPortrait2 Failed CompareBitmap(body:step 9)  Baseline image could not be read.  Created image file as a .bad.png. 
     [java] mobile/components/ViewMenu/integration/ViewMenu_Integration3 ThreeButtonsMenuPortrait3 Failed CompareBitmap(body:step 14)  Baseline image could not be read.  Created image file as a .bad.png. 
     [java] mobile/components/ViewMenu/integration/ViewMenu_Integration3 ThreeButtonsMenuPortrait4 Failed CompareBitmap(body:step 14)  Baseline image could not be read.  Created image file as a .bad.png. 
     [java] mobile/components/ViewMenu/integration/ViewMenu_Integration3 ThreeButtonsMenuPortrait6 Failed CompareBitmap(body:step 5)  Baseline image could not be read.  Created image file as a .bad.png. 
     [java] mobile/components/ViewMenu/integration/ViewMenu_Integration3 ThreeButtonsMenuPortrait7 Failed CompareBitmap(body:step 6)  Baseline image could not be read.  Created image file as a .bad.png. 
     [java] mobile/components/ViewMenu/integration/ViewMenu_Integration3 ThreeButtonsMenuPortrait8 Failed CompareBitmap(body:step 6)  Baseline image could not be read.  Created image file as a .bad.png. 
     [java] mobile/components/ViewMenu/integration/ViewMenu_Integration3 ThreeButtonsMenuPortrait9 Failed CompareBitmap(body:step 6)  Baseline image could not be read.  Created image file as a .bad.png. 
     [java] mobile/components/ViewMenu/integration/ViewMenu_Integration4 FourItemsMenuPortrait1 Failed CompareBitmap(body:step 6)  Baseline image could not be read.  Created image file as a .bad.png. 
     [java] mobile/components/ViewMenu/integration/ViewMenu_Integration4 FourItemsMenuPortrait2 Failed CompareBitmap(body:step 9)  Baseline image could not be read.  Created image file as a .bad.png. 
     [java] mobile/components/ViewMenu/integration/ViewMenu_Integration4 FourItemsMenuPortrait3 Failed CompareBitmap(body:step 14)  Baseline image could not be read.  Created image file as a .bad.png. 
     [java] mobile/components/ViewMenu/integration/ViewMenu_Integration4 FourItemsMenuPortrait4 Failed CompareBitmap(body:step 14)  Baseline image could not be read.  Created image file as a .bad.png. 
     [java] mobile/components/ViewMenu/integration/ViewMenu_Integration4 FourItemsMenuPortrait5 Failed CompareBitmap(body:step 7)  Baseline image could not be read.  Created image file as a .bad.png. 
     [java] mobile/components/ViewMenu/integration/ViewMenu_Integration4 FourItemsMenuPortrait6 Failed CompareBitmap(body:step 9)  Baseline image could not be read.  Created image file as a .bad.png. 
     [java] mobile/components/ViewMenu/integration/ViewMenu_Integration4 FourItemsMenuPortrait7 Failed CompareBitmap(body:step 9)  Baseline image could not be read.  Created image file as a .bad.png. 
     [java] mobile/components/ViewMenu/integration/ViewMenu_Integration4 FourItemsMenuPortrait8 Failed CompareBitmap(body:step 6)  compare returned-3 
     [java] mobile/components/ViewMenu/integration/ViewMenu_Integration4 FourItemsMenuPortrait9 Failed CompareBitmap(body:step 6)  Baseline image could not be read.  Created image file as a .bad.png. 
     [java] mobile/components/ViewMenu/integration/ViewMenu_Integration5 FiveItemsMenuPortrait1 Failed CompareBitmap(body:step 12)  Baseline image could not be read.  Created image file as a .bad.png. 
     [java] mobile/components/ViewMenu/integration/ViewMenu_Integration5 FiveItemsMenuPortrait2 Failed CompareBitmap(body:step 5)  Baseline image could not be read.  Created image file as a .bad.png. 
     [java] mobile/components/ViewMenu/integration/ViewMenu_Integration5 FiveItemsMenuPortrait3 Failed CompareBitmap(body:step 14)  Baseline image could not be read.  Created image file as a .bad.png. 
     [java] mobile/components/ViewMenu/integration/ViewMenu_Integration5 FiveItemsMenuPortrait4 Failed CompareBitmap(body:step 14)  Baseline image could not be read.  Created image file as a .bad.png. 
     [java] mobile/components/ViewMenu/integration/ViewMenu_Integration5 FiveItemsMenuPortrait5 Failed CompareBitmap(body:step 8)  Baseline image could not be read.  Created image file as a .bad.png. 
     [java] mobile/components/ViewMenu/integration/ViewMenu_Integration5 FiveItemsMenuPortrait6 Failed CompareBitmap(body:step 5)  Baseline image could not be read.  Created image file as a .bad.png. 
     [java] mobile/components/ViewMenu/integration/ViewMenu_Integration5 FiveItemsMenuPortrait7 Failed CompareBitmap(body:step 9)  Baseline image could not be read.  Created image file as a .bad.png. 
     [java] mobile/components/ViewMenu/integration/ViewMenu_Integration5 FiveItemsMenuPortrait8 Failed CompareBitmap(body:step 6)  Baseline image could not be read.  Created image file as a .bad.png. 
     [java] mobile/components/ViewMenu/integration/ViewMenu_Integration5 FiveItemsMenuPortrait9 Failed CompareBitmap(body:step 5)  Baseline image could not be read.  Created image file as a .bad.png. 
     [java] mobile/components/ViewMenu/integration/ViewMenu_Integration6 SixItemsMenuPortrait1 Failed CompareBitmap(body:step 12)  Baseline image could not be read.  Created image file as a .bad.png. 
     [java] mobile/components/ViewMenu/integration/ViewMenu_Integration6 SixItemsMenuPortrait2 Failed CompareBitmap(body:step 5)  Baseline image could not be read.  Created image file as a .bad.png. 
     [java] mobile/components/ViewMenu/integration/ViewMenu_Integration6 SixItemsMenuPortrait3 Failed CompareBitmap(body:step 14)  Baseline image could not be read.  Created image file as a .bad.png. 
     [java] mobile/components/ViewMenu/integration/ViewMenu_Integration6 SixItemsMenuPortrait4 Failed CompareBitmap(body:step 14)  Baseline image could not be read.  Created image file as a .bad.png. 
     [java] mobile/components/ViewMenu/integration/ViewMenu_Integration6 SixItemsMenuPortrait5 Failed CompareBitmap(body:step 8)  Baseline image could not be read.  Created image file as a .bad.png. 
     [java] mobile/components/ViewMenu/integration/ViewMenu_Integration6 SixItemsMenuPortrait6 Failed CompareBitmap(body:step 5)  Baseline image could not be read.  Created image file as a .bad.png. 
     [java] mobile/components/ViewMenu/integration/ViewMenu_Integration6 SixItemsMenuPortrait7 Failed CompareBitmap(body:step 9)  Baseline image could not be read.  Created image file as a .bad.png. 
     [java] mobile/components/ViewMenu/integration/ViewMenu_Integration6 SixItemsMenuPortrait8 Failed CompareBitmap(body:step 6)  Baseline image could not be read.  Created image file as a .bad.png. 
     [java] mobile/components/ViewMenu/integration/ViewMenu_Integration6 SixItemsMenuPortrait9 Failed CompareBitmap(body:step 5)  Baseline image could not be read.  Created image file as a .bad.png. 
     [java] mobile/components/ViewMenu/integration/ViewMenu_Integration6 SixItemsMenuPortrait10 Failed CompareBitmap(body:step 7)  Baseline image could not be read.  Created image file as a .bad.png. 
     [java] mobile/components/ViewMenu/integration/ViewMenu_Integration7 SevenItemsMenuPortrait1 Failed CompareBitmap(body:step 12)  Baseline image could not be read.  Created image file as a .bad.png. 
     [java] mobile/components/ViewMenu/integration/ViewMenu_Integration7 SevenItemsMenuPortrait3 Failed CompareBitmap(body:step 14)  Baseline image could not be read.  Created image file as a .bad.png. 
     [java] mobile/components/ViewMenu/properties/ViewMenu_Properties1 OneViewMenuButtonPortrait1 Failed CompareBitmap(body:step 5)  Baseline image could not be read.  Created image file as a .bad.png. 
     [java] mobile/components/ViewMenu/properties/ViewMenu_Properties1 OneViewMenuButtonPortrait2 Failed CompareBitmap(body:step 5)  Baseline image could not be read.  Created image file as a .bad.png. 
     [java] mobile/components/ViewMenu/properties/ViewMenu_Properties1 OneViewMenuButtonPortrait3 Failed CompareBitmap(body:step 5)  Baseline image could not be read.  Created image file as a .bad.png. 
     [java] mobile/components/ViewMenu/properties/ViewMenu_Properties1 OneViewMenuButtonPortrait5 Failed CompareBitmap(body:step 10)  Baseline image could not be read.  Created image file as a .bad.png. 
     [java] mobile/components/ViewMenu/properties/ViewMenu_Properties1 OneViewMenuButtonPortrait6 Failed CompareBitmap(body:step 5)  Baseline image could not be read.  Created image file as a .bad.png. 
     [java] mobile/components/ViewMenu/properties/ViewMenu_Properties2 TwoButtonsMenuPortrait1 Failed CompareBitmap(body:step 6)  Baseline image could not be read.  Created image file as a .bad.png. 
     [java] mobile/components/ViewMenu/properties/ViewMenu_Properties2 TwoButtonsMenuPortrait2 Failed CompareBitmap(body:step 5)  Baseline image could not be read.  Created image file as a .bad.png. 
     [java] mobile/components/ViewMenu/properties/ViewMenu_Properties2 TwoButtonsMenuPortrait3 Failed CompareBitmap(body:step 5)  Baseline image could not be read.  Created image file as a .bad.png. 
     [java] mobile/components/ViewMenu/properties/ViewMenu_Properties2 TwoButtonsMenuPortrait8 Failed CompareBitmap(body:step 5)  Baseline image could not be read.  Created image file as a .bad.png. 
     [java] mobile/components/ViewMenu/properties/ViewMenu_Properties2 TwoButtonsMenuPortrait9 Failed CompareBitmap(body:step 6)  Baseline image could not be read.  Created image file as a .bad.png. 
     [java] mobile/components/ViewMenu/properties/ViewMenu_Properties2 TwoButtonsMenuPortrait10 Failed CompareBitmap(body:step 8)  Baseline image could not be read.  Created image file as a .bad.png. 
     [java] mobile/components/ViewMenu/properties/ViewMenu_Properties2 TwoButtonsMenuPortrait11 Failed CompareBitmap(body:step 6)  Baseline image could not be read.  Created image file as a .bad.png. 
     [java] mobile/components/ViewMenu/properties/ViewMenu_Properties2 TwoButtonsMenuPortrait12 Failed CompareBitmap(body:step 6)  Baseline image could not be read.  Created image file as a .bad.png. 
     [java] mobile/components/ViewMenu/properties/ViewMenu_Properties2 TwoButtonsMenuPortrait13 Failed CompareBitmap(body:step 6)  Baseline image could not be read.  Created image file as a .bad.png. 
     [java] mobile/components/ViewMenu/properties/ViewMenu_Properties2 TwoButtonsMenuPortrait14 Failed CompareBitmap(body:step 5)  Baseline image could not be read.  Created image file as a .bad.png. 
     [java] mobile/components/ViewMenu/integration/ViewMenu_CustomSkinTester CustomSkinSevenItemsMenuPortrait1 Failed CompareBitmap(body:step 3)  Baseline image could not be read.  Created image file as a .bad.png. 
     [java] mobile/components/ViewMenu/integration/ViewMenu_CustomSkinTester CustomSkinSevenItemsMenuPortrait2 Failed RunCode(body:step 1)  Timeout waiting for viewMenuOpen from navigator.activeView 
     [java] mobile/components/ViewMenu/integration/ViewMenuScaleTester ViewMenu240Scale Failed CompareBitmap(body:step 5)  Baseline image could not be read.  Created image file as a .bad.png. 
     [java] mobile/components/ViewMenu/integration/ViewMenuScaleTester BusyIndicator240Scale Failed CompareBitmap(body:step 4)  Baseline image could not be read.  Created image file as a .bad.png. 
     [java] mobile/utils/MultiDPIBitmapSource/integration/MultiDPIBitmapSource_integration MultiDPIBitmapSource_integ_160_embed Failed CompareBitmap(body:step 2)  compare returned[object BitmapData] 
     [java] mobile/utils/MultiDPIBitmapSource/integration/MultiDPIBitmapSource_integration MultiDPIBitmapSource_integ_160_refer Failed CompareBitmap(body:step 2)  compare returned[object BitmapData] 
     [java] mobile/utils/MultiDPIBitmapSource/integration/MultiDPIBitmapSource_integration MultiDPIBitmapSource_integ_240_embed Failed CompareBitmap(body:step 2)  compare returned[object BitmapData] 
     [java] mobile/utils/MultiDPIBitmapSource/integration/MultiDPIBitmapSource_integration MultiDPIBitmapSource_integ_240_refer Failed CompareBitmap(body:step 2)  compare returned[object BitmapData] 
     [java] mobile/utils/MultiDPIBitmapSource/integration/MultiDPIBitmapSource_integration MultiDPIBitmapSource_integ_320_embed Failed CompareBitmap(body:step 2)  compare returned[object BitmapData] 
     [java] mobile/utils/MultiDPIBitmapSource/integration/MultiDPIBitmapSource_integration MultiDPIBitmapSource_integ_320_refer Failed CompareBitmap(body:step 2)  compare returned[object BitmapData] 
     [java] mobile/utils/MultiDPIBitmapSource/properties/MultiDPIBitmapSource_properties MultiDPIBitmapSource_nominal_embed Failed CompareBitmap(body:step 2)  compare returned-3 
     [java] mobile/utils/MultiDPIBitmapSource/properties/MultiDPIBitmapSource_properties MultiDPIBitmapSource_nominal_refer Failed CompareBitmap(body:step 2)  compare returned-3 
     [java] mobile/utils/MultiDPIBitmapSource/properties/MultiDPIBitmapSource_properties MultiDPIBitmapSource_no_160_embed Failed CompareBitmap(body:step 2)  compare returned-3 
     [java] mobile/utils/MultiDPIBitmapSource/properties/MultiDPIBitmapSource_properties MultiDPIBitmapSource_no_160_refer Failed CompareBitmap(body:step 2)  compare returned-3 
     [java] mobile/utils/MultiDPIBitmapSource/integration/MultiDPIBitmapSource_scaling MultiDPIBitmapSource_scaling_refer Failed CompareBitmap(body:step 2)  compare returned-3 
     [java] mobile/utils/MultiDPIBitmapSource/integration/MultiDPIBitmapSource_scaling MultiDPIBitmapSource_scaling_embed Failed CompareBitmap(body:step 2)  compare returned-3 
     [java] 
     [java] 
     [java] =====================================================
     [java]     Passes: 0
     [java]     Fails: 1606
     [java] =====================================================
     [java] 
     [java] 
     [java] Wrote summary to results.txt
     [java] Wrote failures to failures.txt

BUILD FAILED
C:\jenkins_slave\workspace\flex-sdk_mustella-mobile\mustella\build.xml:1538: The following error occurred while executing this line:
C:\jenkins_slave\workspace\flex-sdk_mustella-mobile\mustella\build.xml:1656: Java returned: 1

Total time: 35 minutes 33 seconds
Some of tests failed, even after running '-failures'...
Build step 'Execute shell' marked build as failure

Build failed in Jenkins: flex-sdk_mustella-mobile #26

Posted by fl...@gmail.com.
See <http://localhost:8080/job/flex-sdk_mustella-mobile/26/>

------------------------------------------
[...truncated 24196 lines...]
     [java] mobile/components/TextArea/Styles/TextArea_styles_tester TextArea_leading_test2 Failed CompareBitmap(body:step 3)  compare returned-3 
     [java] mobile/components/TextArea/Styles/TextArea_styles_tester TextArea_leading_test3 Failed CompareBitmap(body:step 3)  compare returned-3 
     [java] mobile/components/TextArea/Styles/TextArea_styles_tester TextArea_letterSpacing_test1 Failed CompareBitmap(body:step 3)  compare returned-3 
     [java] mobile/components/TextArea/Styles/TextArea_styles_tester TextArea_letterSpacing_test2 Failed CompareBitmap(body:step 3)  compare returned-3 
     [java] mobile/components/TextArea/Styles/TextArea_styles_tester TextArea_letterSpacing_test3 Failed CompareBitmap(body:step 4)  compare returned-3 
     [java] mobile/components/TextArea/Styles/TextArea_styles_tester TextArea_fontFamily_test1 Failed CompareBitmap(body:step 3)  compare returned-3 
     [java] mobile/components/TextInput/Methods/TextInput_Methods_tester TextInput_selectAll_test1 Failed CompareBitmap(body:step 5)  compare returned-4 
     [java] mobile/components/TextInput/Methods/TextInput_Methods_tester TextInput_selectRange_test1 Failed CompareBitmap(body:step 2)  compare returned-4 
     [java] mobile/components/TextInput/Methods/TextInput_Methods_tester TextInput_selectRange_test3 Failed CompareBitmap(body:step 5)  compare returned-4 
     [java] mobile/components/TextInput/Methods/TextInput_Methods_tester TextInput_selectRange_test4 Failed CompareBitmap(body:step 5)  compare returned-4 
     [java] mobile/components/TextInput/Methods/TextInput_Methods_tester TextInput_selectRange_test5 Failed CompareBitmap(body:step 5)  compare returned-4 
     [java] mobile/components/TextInput/Methods/TextInput_Methods_tester TextInput_selectRange_test6 Failed CompareBitmap(body:step 5)  compare returned-4 
     [java] mobile/components/TextInput/Methods/TextInput_Methods_tester TextInput_selectRange_test7 Failed CompareBitmap(body:step 5)  compare returned-4 
     [java] mobile/components/TextInput/Methods/TextInput_Methods_tester TextInput_truncateToFit_test1 Failed CompareBitmap(body:step 5)  compare returned-4 
     [java] mobile/components/TextInput/Methods/TextInput_Methods_tester TextInput_truncateToFit_test2 Failed AssertMethodValue (method cannot be shown)(body:step 4)  method returned Lorem ipsum dolor sit ..., expected Lorem ipsum d... 
     [java] mobile/components/TextInput/Methods/TextInput_Methods_tester TextInput_truncateToFit_test3 Failed AssertMethodValue (method cannot be shown)(body:step 4)  method returned Lorem ipsum dolor sit ..., expected Lorem ipsum d... 
     [java] mobile/components/TextInput/Methods/TextInput_Methods_tester TextInput_truncateToFit_test4 Failed AssertMethodValue (method cannot be shown)(body:step 4)  method returned Lorem ipsum dolor sit ..., expected Lorem ipsum d... 
     [java] mobile/components/TextInput/Methods/TextInput_Methods_tester TextInput_truncateToFit_test5 Failed AssertMethodValue (method cannot be shown)(body:step 4)  method returned Lorem ipsum dolor sit a , expected Lorem ipsum do  
     [java] mobile/components/TextInput/Methods/TextInput_Methods_tester TextInput_truncateToFit_test6 Failed AssertMethodValue (method cannot be shown)(body:step 4)  method returned Lorem ipsum dolor s§¥©, expected Lorem ipsu§¥© 
     [java] mobile/components/TextInput/Methods/TextInput_Methods_tester TextInput_truncateToFit_test7 Failed AssertMethodValue (method cannot be shown)(body:step 4)  method returned Lorem ipsum dolor sit a, expected Lorem ipsum dol 
     [java] mobile/components/TextInput/Methods/TextInput_Methods_tester TextInput_truncateToFit_test8 Failed AssertMethodValue (method cannot be shown)(body:step 4)  method returned Lorem ipsum dolor sit a, expected Lorem ipsum dol 
     [java] mobile/components/TextInput/Methods/TextInput_Methods_tester TextInput_truncateToFit_test9 Failed AssertMethodValue (method cannot be shown)(body:step 4)  method returned Lorem ipsum dolor sit a, expected Lorem ipsum dol 
     [java] mobile/components/TextInput/Properties/TextInput_properties_tester TextInput_basic_prompt Failed CompareBitmap(body:step 3)  compare returned-3 
     [java] mobile/components/TextInput/Properties/TextInput_properties_tester TextInput_prompt_disappears Failed CompareBitmap(body:step 7)  compare returned-3 
     [java] mobile/components/TextInput/Properties/TextInput_properties_tester TextInput_prompt_returns_on_text_removal Failed CompareBitmap(body:step 10)  compare returned-3 
     [java] mobile/components/TextInput/Properties/TextInput_properties_tester TextInput_displayAsPassword_test2 Failed CompareBitmap(body:step 2)  compare returned-3 
     [java] mobile/components/TextInput/Properties/TextInput_properties_tester TextInput_displayAsPassword_test3 Failed CompareBitmap(body:step 2)  compare returned-3 
     [java] mobile/components/TextInput/Properties/TextInput_properties_tester TextInput_selectionActivePosition_property_mouseDown Failed AssertPropertyValue(body:step 2)  tic1.ti1.selectionAnchorPosition 2 != 1 
     [java] mobile/components/TextInput/Properties/TextInput_properties_tester TextInput_text_property Failed CompareBitmap(body:step 3)  compare returned-3 
     [java] mobile/components/TextInput/Properties/TextInput_properties_tester TextInput_text_property_japanese Failed CompareBitmap(body:step 3)  compare returned-3 
     [java] mobile/components/TextInput/Properties/TextInput_properties_tester TextInput_alpha_property_01 Failed CompareBitmap(body:step 2)  compare returned-3 
     [java] mobile/components/TextInput/Properties/TextInput_properties_tester TextInput_alpha_property_0 Failed CompareBitmap(body:step 2)  compare returned-3 
     [java] mobile/components/TextInput/Properties/TextInput_properties_tester TextInput_height_property_40 Failed CompareBitmap(body:step 2)  compare returned-3 
     [java] mobile/components/TextInput/Properties/TextInput_properties_tester TextInput_height_property_10 Failed CompareBitmap(body:step 2)  compare returned-3 
     [java] mobile/components/TextInput/Properties/TextInput_properties_tester TextInput_percentHeight_property_50 Failed CompareBitmap(body:step 3)  compare returned-3 
     [java] mobile/components/TextInput/Properties/TextInput_properties_tester TextInput_percentHeight_property_150 Failed CompareBitmap(body:step 3)  compare returned-3 
     [java] mobile/components/TextInput/Properties/TextInput_properties_tester TextInput_percentWidth_property_50 Failed CompareBitmap(body:step 3)  compare returned[object BitmapData] 
     [java] mobile/components/TextInput/Properties/TextInput_properties_tester TextInput_percentWidth_property_150 Failed CompareBitmap(body:step 3)  compare returned[object BitmapData] 
     [java] mobile/components/TextInput/Properties/TextInput_properties_tester TextInput_rotation_property_90 Failed CompareBitmap(body:step 2)  compare returned[object BitmapData] 
     [java] mobile/components/TextInput/Properties/TextInput_properties_tester TextInput_scaleX_property_2 Failed CompareBitmap(body:step 3)  compare returned[object BitmapData] 
     [java] mobile/components/TextInput/Properties/TextInput_properties_tester TextInput_width_property_default Failed AssertPropertyValue(body:step 1)  tic1.ti1.width 440 != 600 
     [java] mobile/components/TextInput/Properties/TextInput_properties_tester TextInput_width_property_40 Failed CompareBitmap(body:step 2)  compare returned[object BitmapData] 
     [java] mobile/components/TextInput/Properties/TextInput_properties_tester TextInput_width_property_200 Failed CompareBitmap(body:step 2)  compare returned[object BitmapData] 
     [java] mobile/components/TextInput/Properties/TextInput_properties_tester TextInput_x_property_positive Failed CompareBitmap(body:step 4)  compare returned[object BitmapData] 
     [java] mobile/components/TextInput/Properties/TextInput_properties_tester TextInput_x_property_negative Failed CompareBitmap(body:step 3)  compare returned[object BitmapData] 
     [java] mobile/components/TextInput/Properties/TextInput_properties_tester TextInput_y_property_positive Failed CompareBitmap(body:step 4)  compare returned[object BitmapData] 
     [java] mobile/components/TextInput/Properties/TextInput_properties_tester TextInput_y_property_negative Failed CompareBitmap(body:step 3)  compare returned[object BitmapData] 
     [java] mobile/components/TextInput/Properties/TextInput_properties_tester TextInput_baselinePosition_property_preValidation Failed AssertPropertyValue(body:step 1)  tic2.ti1.baselinePosition 36.650000 != 43.700000 
     [java] mobile/components/TextInput/Properties/TextInput_properties_tester TextInput_baselinePosition_property_postValidation Failed AssertPropertyValue(body:step 1)  tic2.ti1.baselinePosition 36.650000 != 43.700000 
     [java] mobile/components/TextInput/Styles/TextInput_styles_tester TextInput_color_test1 Failed CompareBitmap(body:step 1)  compare returned-3 
     [java] mobile/components/TextInput/Styles/TextInput_styles_tester TextInput_color_test2 Failed CompareBitmap(body:step 2)  compare returned-3 
     [java] mobile/components/TextInput/Styles/TextInput_styles_tester TextInput_color_test3 Failed CompareBitmap(body:step 1)  compare returned-3 
     [java] mobile/components/TextInput/Styles/TextInput_styles_tester TextInput_color_test4 Failed CompareBitmap(body:step 3)  compare returned-3 
     [java] mobile/components/TextInput/Styles/TextInput_styles_tester TextInput_color_test5 Failed CompareBitmap(body:step 2)  compare returned-3 
     [java] mobile/components/TextInput/Styles/TextInput_styles_tester TextInput_focusColor_test1 Failed AssertPixelValue(body:step 3)  tic3.grp1 pixel at (10,10) 99FF99 != 0xF7FFF7 
     [java] mobile/components/TextInput/Styles/TextInput_styles_tester TextInput_focusColor_test2 Failed AssertPixelValue(body:step 4)  tic3.grp2 pixel at (10,10) 99FF99 != 0xF7FFF7 
     [java] mobile/components/TextInput/Styles/TextInput_styles_tester TextInput_focusColor_test3 Failed AssertPixelValue(body:step 3)  tic3.grp3 pixel at (10,10) 99FF99 != 0xF7FFF7 
     [java] mobile/components/TextInput/Styles/TextInput_styles_tester TextInput_contentBackgroundColor_test1 Failed CompareBitmap(body:step 2)  compare returned-3 
     [java] mobile/components/TextInput/Styles/TextInput_styles_tester TextInput_contentBackgroundColor_test2 Failed CompareBitmap(body:step 2)  compare returned-3 
     [java] mobile/components/TextInput/Styles/TextInput_styles_tester TextInput_contentBackgroundColor_test3 Failed CompareBitmap(body:step 1)  compare returned-3 
     [java] mobile/components/TextInput/Styles/TextInput_styles_tester TextInput_contentBackgroundColor_test4 Failed CompareBitmap(body:step 3)  compare returned-3 
     [java] mobile/components/TextInput/Styles/TextInput_styles_tester TextInput_textAlign_test1 Failed CompareBitmap(body:step 3)  compare returned-3 
     [java] mobile/components/TextInput/Styles/TextInput_styles_tester TextInput_textAlign_test2 Failed CompareBitmap(body:step 3)  compare returned-3 
     [java] mobile/components/TextInput/Styles/TextInput_styles_tester TextInput_textAlign_test3 Failed CompareBitmap(body:step 3)  compare returned-3 
     [java] mobile/components/TextInput/Styles/TextInput_styles_tester TextInput_textAlign_test4 Failed CompareBitmap(body:step 3)  compare returned-3 
     [java] mobile/components/TextInput/Styles/TextInput_styles_tester TextInput_textAlign_test5 Failed CompareBitmap(body:step 3)  compare returned-3 
     [java] mobile/components/TextInput/Styles/TextInput_styles_tester TextInput_textAlign_test6 Failed CompareBitmap(body:step 1)  compare returned-3 
     [java] mobile/components/TextInput/Styles/TextInput_styles_tester TextInput_fontWeight_test1 Failed CompareBitmap(body:step 3)  compare returned-3 
     [java] mobile/components/TextInput/Styles/TextInput_styles_tester TextInput_fontWeight_test2 Failed CompareBitmap(body:step 3)  compare returned-3 
     [java] mobile/components/TextInput/Styles/TextInput_styles_tester TextInput_fontSize_test1 Failed CompareBitmap(body:step 3)  compare returned-3 
     [java] mobile/components/TextInput/Styles/TextInput_styles_tester TextInput_fontSize_test2 Failed CompareBitmap(body:step 3)  compare returned-3 
     [java] mobile/components/TextInput/Styles/TextInput_styles_tester TextInput_fontSize_test3 Failed CompareBitmap(body:step 3)  compare returned-3 
     [java] mobile/components/TextInput/Styles/TextInput_styles_tester TextInput_fontSize_test4 Failed CompareBitmap(body:step 4)  compare returned-3 
     [java] mobile/components/TextInput/Styles/TextInput_styles_tester TextInput_textDecoration_test1 Failed CompareBitmap(body:step 3)  compare returned-3 
     [java] mobile/components/TextInput/Styles/TextInput_styles_tester TextInput_textDecoration_test2 Failed CompareBitmap(body:step 3)  compare returned-3 
     [java] mobile/components/TextInput/Styles/TextInput_styles_tester TextInput_textIndent_test1 Failed CompareBitmap(body:step 3)  compare returned-3 
     [java] mobile/components/TextInput/Styles/TextInput_styles_tester TextInput_textIndent_test2 Failed CompareBitmap(body:step 3)  compare returned-3 
     [java] mobile/components/TextInput/Styles/TextInput_styles_tester TextInput_textIndent_test3 Failed CompareBitmap(body:step 3)  compare returned-3 
     [java] mobile/components/TextInput/Styles/TextInput_styles_tester TextInput_textIndent_test4 Failed CompareBitmap(body:step 3)  compare returned-3 
     [java] mobile/components/TextInput/Styles/TextInput_styles_tester TextInput_letterSpacing_test1 Failed CompareBitmap(body:step 3)  compare returned-3 
     [java] mobile/components/TextInput/Styles/TextInput_styles_tester TextInput_letterSpacing_test2 Failed CompareBitmap(body:step 3)  compare returned-3 
     [java] mobile/components/TextInput/Styles/TextInput_styles_tester TextInput_letterSpacing_test3 Failed CompareBitmap(body:step 3)  compare returned-3 
     [java] mobile/components/TextInput/Styles/TextInput_styles_tester TextInput_fontFamily_test1 Failed CompareBitmap(body:step 3)  compare returned-3 
     [java] mobile/components/TextInput/Styles/TextInput_styles_tester TextInput_fontFamily_test2 Failed CompareBitmap(body:step 3)  compare returned-3 
     [java] mobile/components/TextInput/Integration/TextInput_States_tester TextInput_states_test1 Failed CompareBitmap(body:step 1)  compare returned-3 
     [java] mobile/components/TextInput/Integration/TextInput_States_tester TextInput_states_test2 Failed CompareBitmap(body:step 2)  compare returned-3 
     [java] mobile/components/TextInput/Integration/TextInput_States_tester TextInput_states_test3 Failed CompareBitmap(body:step 3)  compare returned-3 
     [java] mobile/components/ToggleSwitch/integration/ToggleSwitch_skinning custom_skin_styles Failed CompareBitmap(body:step 1)  Baseline image could not be read.  Created image file as a .bad.png. 
     [java] mobile/components/ToggleSwitch/integration/ToggleSwitch_skinning custom_skin_styles_selected Failed CompareBitmap(body:step 1)  Baseline image could not be read.  Created image file as a .bad.png. 
     [java] mobile/components/ToggleSwitch/integration/ToggleSwitch_skinning custom_skin_French_label Failed CompareBitmap(body:step 1)  Baseline image could not be read.  Created image file as a .bad.png. 
     [java] mobile/components/ToggleSwitch/integration/ToggleSwitch_skinning custom_skin_French_selected Failed CompareBitmap(body:step 1)  Baseline image could not be read.  Created image file as a .bad.png. 
     [java] mobile/components/ToggleSwitch/integration/ToggleSwitch_skinning custom_skin_Japanese_label Failed CompareBitmap(body:step 1)  Baseline image could not be read.  Created image file as a .bad.png. 
     [java] mobile/components/ToggleSwitch/integration/ToggleSwitch_skinning custom_skin_Japanese_selected Failed CompareBitmap(body:step 1)  Baseline image could not be read.  Created image file as a .bad.png. 
     [java] mobile/components/ToggleSwitch/properties/ToggleSwitch_properties width_height_default Failed AssertPropertyValue(body:step 1)  propertiesRoot.target1.width 149 != null 
     [java] mobile/components/ToggleSwitch/properties/ToggleSwitch_properties width_height_MXML Failed CompareBitmap(body:step 3)  Baseline image could not be read.  Created image file as a .bad.png. 
     [java] mobile/components/ToggleSwitch/properties/ToggleSwitch_properties width_height_AS Failed CompareBitmap(body:step 3)  Baseline image could not be read.  Created image file as a .bad.png. 
     [java] mobile/components/ToggleSwitch/properties/ToggleSwitch_properties percentWidth_percentHeight_MXML Failed CompareBitmap(body:step 3)  Baseline image could not be read.  Created image file as a .bad.png. 
     [java] mobile/components/ToggleSwitch/properties/ToggleSwitch_properties percentWidth_percentHeight_AS Failed CompareBitmap(body:step 3)  Baseline image could not be read.  Created image file as a .bad.png. 
     [java] mobile/components/ToggleSwitch/properties/ToggleSwitch_properties scaleX_scaleY_MXML Failed CompareBitmap(body:step 1)  Baseline image could not be read.  Created image file as a .bad.png. 
     [java] mobile/components/ToggleSwitch/properties/ToggleSwitch_properties scaleX_scaleY_AS Failed CompareBitmap(body:step 1)  Baseline image could not be read.  Created image file as a .bad.png. 
     [java] mobile/components/ToggleSwitch/properties/ToggleSwitch_properties enabled_false Failed CompareBitmap(body:step 1)  Baseline image could not be read.  Created image file as a .bad.png. 
     [java] mobile/components/ToggleSwitch/properties/ToggleSwitch_properties enabled_true Failed CompareBitmap(body:step 1)  Baseline image could not be read.  Created image file as a .bad.png. 
     [java] mobile/components/ToggleSwitch/styles/ToggleSwitch_styles styles_accentColor_default Failed CompareBitmap(body:step 2)  Baseline image could not be read.  Created image file as a .bad.png. 
     [java] mobile/components/ToggleSwitch/styles/ToggleSwitch_styles styles_accentColor_AS Failed CompareBitmap(body:step 2)  Baseline image could not be read.  Created image file as a .bad.png. 
     [java] mobile/components/ToggleSwitch/styles/ToggleSwitch_styles styles_chromeColor_default Failed CompareBitmap(body:step 2)  Baseline image could not be read.  Created image file as a .bad.png. 
     [java] mobile/components/ToggleSwitch/styles/ToggleSwitch_styles styles_set_in_MXML Failed CompareBitmap(body:step 1)  Baseline image could not be read.  Created image file as a .bad.png. 
     [java] mobile/components/ToggleSwitch/styles/ToggleSwitch_styles styles_chromeColor_AS Failed CompareBitmap(body:step 2)  Baseline image could not be read.  Created image file as a .bad.png. 
     [java] mobile/components/ToggleSwitch/styles/ToggleSwitch_styles styles_color_default Failed CompareBitmap(body:step 2)  Baseline image could not be read.  Created image file as a .bad.png. 
     [java] mobile/components/ToggleSwitch/styles/ToggleSwitch_styles styles_color_AS Failed CompareBitmap(body:step 2)  Baseline image could not be read.  Created image file as a .bad.png. 
     [java] mobile/components/ToggleSwitch/styles/ToggleSwitch_styles styles_baseColor_mouseOver Failed CompareBitmap(body:step 2)  Baseline image could not be read.  Created image file as a .bad.png. 
     [java] mobile/components/ToggleSwitch/styles/ToggleSwitch_styles styles_baseColor_disabled Failed CompareBitmap(body:step 2)  Baseline image could not be read.  Created image file as a .bad.png. 
     [java] mobile/components/ToggleSwitch/styles/ToggleSwitch_styles styles_color_disabled Failed CompareBitmap(body:step 3)  Baseline image could not be read.  Created image file as a .bad.png. 
     [java] mobile/components/ToggleSwitch/styles/ToggleSwitch_styles styles_fontSize_default Failed AssertStyleValue(body:step 1)  stylesRoot.target1.fontSize 27 != 36 
     [java] mobile/components/ToggleSwitch/styles/ToggleSwitch_styles styles_fontSize_AS Failed CompareBitmap(body:step 2)  Baseline image could not be read.  Created image file as a .bad.png. 
     [java] mobile/components/ToggleSwitch/styles/ToggleSwitch_styles styles_fontStyle_default Failed CompareBitmap(body:step 2)  Baseline image could not be read.  Created image file as a .bad.png. 
     [java] mobile/components/ToggleSwitch/styles/ToggleSwitch_styles styles_fontStyle_AS Failed CompareBitmap(body:step 2)  Baseline image could not be read.  Created image file as a .bad.png. 
     [java] mobile/components/ToggleSwitch/styles/ToggleSwitch_styles styles_fontWeight_default Failed CompareBitmap(body:step 2)  Baseline image could not be read.  Created image file as a .bad.png. 
     [java] mobile/components/ToggleSwitch/styles/ToggleSwitch_styles styles_fontWeight_AS Failed CompareBitmap(body:step 2)  Baseline image could not be read.  Created image file as a .bad.png. 
     [java] mobile/components/ToggleSwitch/styles/ToggleSwitch_styles styles_fontFamily_default Failed CompareBitmap(body:step 2)  Baseline image could not be read.  Created image file as a .bad.png. 
     [java] mobile/components/ToggleSwitch/styles/ToggleSwitch_styles styles_fontFamily_AS Failed CompareBitmap(body:step 2)  Baseline image could not be read.  Created image file as a .bad.png. 
     [java] mobile/components/ToggleSwitch/styles/ToggleSwitch_styles styles_textAlign_default Failed CompareBitmap(body:step 2)  Baseline image could not be read.  Created image file as a .bad.png. 
     [java] mobile/components/ToggleSwitch/styles/ToggleSwitch_styles styles_textAlign_AS Failed CompareBitmap(body:step 2)  Baseline image could not be read.  Created image file as a .bad.png. 
     [java] mobile/components/ToggleSwitch/styles/ToggleSwitch_styles styles_textAlpha_default Failed CompareBitmap(body:step 2)  Baseline image could not be read.  Created image file as a .bad.png. 
     [java] mobile/components/ToggleSwitch/styles/ToggleSwitch_styles styles_textAlpha_AS Failed CompareBitmap(body:step 2)  Baseline image could not be read.  Created image file as a .bad.png. 
     [java] mobile/components/ToggleSwitch/styles/ToggleSwitch_styles styles_textDecoration_default Failed CompareBitmap(body:step 2)  Baseline image could not be read.  Created image file as a .bad.png. 
     [java] mobile/components/ToggleSwitch/styles/ToggleSwitch_styles styles_textDecoration_AS Failed CompareBitmap(body:step 2)  Baseline image could not be read.  Created image file as a .bad.png. 
     [java] mobile/components/ToggleSwitch/styles/ToggleSwitch_styles styles_lineHeight_default Failed CompareBitmap(body:step 2)  Baseline image could not be read.  Created image file as a .bad.png. 
     [java] mobile/components/ToggleSwitch/styles/ToggleSwitch_styles styles_lineHeight_AS Failed CompareBitmap(body:step 2)  Baseline image could not be read.  Created image file as a .bad.png. 
     [java] mobile/components/ToggleSwitch/styles/ToggleSwitch_styles styles_lineThrough_default Failed CompareBitmap(body:step 2)  Baseline image could not be read.  Created image file as a .bad.png. 
     [java] mobile/components/ToggleSwitch/styles/ToggleSwitch_styles styles_lineThrough_AS Failed CompareBitmap(body:step 2)  Baseline image could not be read.  Created image file as a .bad.png. 
     [java] mobile/components/ToggleSwitch/styles/ToggleSwitch_CSS CSS_accentColor_typeselector Failed CompareBitmap(body:step 2)  Baseline image could not be read.  Created image file as a .bad.png. 
     [java] mobile/components/ToggleSwitch/styles/ToggleSwitch_CSS CSS_set_in_MXML Failed CompareBitmap(body:step 1)  Baseline image could not be read.  Created image file as a .bad.png. 
     [java] mobile/components/ToggleSwitch/styles/ToggleSwitch_CSS CSS_accentColor_AS Failed CompareBitmap(body:step 2)  Baseline image could not be read.  Created image file as a .bad.png. 
     [java] mobile/components/ToggleSwitch/styles/ToggleSwitch_CSS CSS_chromeColor_default Failed CompareBitmap(body:step 2)  Baseline image could not be read.  Created image file as a .bad.png. 
     [java] mobile/components/ToggleSwitch/styles/ToggleSwitch_CSS CSS_chromeColor_AS Failed CompareBitmap(body:step 2)  Baseline image could not be read.  Created image file as a .bad.png. 
     [java] mobile/components/ToggleSwitch/styles/ToggleSwitch_CSS CSS_color_default Failed CompareBitmap(body:step 2)  Baseline image could not be read.  Created image file as a .bad.png. 
     [java] mobile/components/ToggleSwitch/styles/ToggleSwitch_CSS CSS_color_AS Failed CompareBitmap(body:step 2)  Baseline image could not be read.  Created image file as a .bad.png. 
     [java] mobile/components/ToggleSwitch/styles/ToggleSwitch_CSS CSS_color_disabled Failed CompareBitmap(body:step 3)  Baseline image could not be read.  Created image file as a .bad.png. 
     [java] mobile/components/ToggleSwitch/styles/ToggleSwitch_CSS CSS_fontSize_default Failed AssertStyleValue(body:step 1)  stylesRoot.target1.fontSize 27 != 36 
     [java] mobile/components/ToggleSwitch/styles/ToggleSwitch_CSS CSS_fontSize_AS Failed CompareBitmap(body:step 2)  Baseline image could not be read.  Created image file as a .bad.png. 
     [java] mobile/components/ToggleSwitch/styles/ToggleSwitch_CSS CSS_fontStyle_default Failed CompareBitmap(body:step 2)  Baseline image could not be read.  Created image file as a .bad.png. 
     [java] mobile/components/ToggleSwitch/styles/ToggleSwitch_CSS CSS_fontStyle_AS Failed CompareBitmap(body:step 2)  Baseline image could not be read.  Created image file as a .bad.png. 
     [java] mobile/components/ToggleSwitch/styles/ToggleSwitch_CSS CSS_fontWeight_default Failed CompareBitmap(body:step 2)  Baseline image could not be read.  Created image file as a .bad.png. 
     [java] mobile/components/ToggleSwitch/styles/ToggleSwitch_CSS CSS_fontWeight_AS Failed CompareBitmap(body:step 2)  Baseline image could not be read.  Created image file as a .bad.png. 
     [java] mobile/components/ToggleSwitch/styles/ToggleSwitch_CSS CSS_fontFamily_default Failed CompareBitmap(body:step 2)  Baseline image could not be read.  Created image file as a .bad.png. 
     [java] mobile/components/ToggleSwitch/styles/ToggleSwitch_CSS CSS_fontFamily_AS Failed CompareBitmap(body:step 2)  Baseline image could not be read.  Created image file as a .bad.png. 
     [java] mobile/components/ToggleSwitch/styles/ToggleSwitch_CSS CSS_textAlign_default Failed CompareBitmap(body:step 2)  Baseline image could not be read.  Created image file as a .bad.png. 
     [java] mobile/components/ToggleSwitch/styles/ToggleSwitch_CSS CSS_textAlign_AS Failed CompareBitmap(body:step 2)  Baseline image could not be read.  Created image file as a .bad.png. 
     [java] mobile/components/ToggleSwitch/styles/ToggleSwitch_CSS CSS_textAlpha_default Failed CompareBitmap(body:step 2)  Baseline image could not be read.  Created image file as a .bad.png. 
     [java] mobile/components/ToggleSwitch/styles/ToggleSwitch_CSS CSS_textAlpha_AS Failed CompareBitmap(body:step 2)  Baseline image could not be read.  Created image file as a .bad.png. 
     [java] mobile/components/ToggleSwitch/styles/ToggleSwitch_CSS CSS_textDecoration_default Failed CompareBitmap(body:step 2)  Baseline image could not be read.  Created image file as a .bad.png. 
     [java] mobile/components/ToggleSwitch/styles/ToggleSwitch_CSS CSS_textDecoration_AS Failed CompareBitmap(body:step 2)  Baseline image could not be read.  Created image file as a .bad.png. 
     [java] mobile/components/ToggleSwitch/styles/ToggleSwitch_CSS CSS_lineHeight_default Failed CompareBitmap(body:step 2)  Baseline image could not be read.  Created image file as a .bad.png. 
     [java] mobile/components/ToggleSwitch/styles/ToggleSwitch_CSS CSS_lineHeight_AS Failed CompareBitmap(body:step 2)  Baseline image could not be read.  Created image file as a .bad.png. 
     [java] mobile/components/ToggleSwitch/styles/ToggleSwitch_CSS CSS_lineThrough_default Failed CompareBitmap(body:step 2)  Baseline image could not be read.  Created image file as a .bad.png. 
     [java] mobile/components/ToggleSwitch/styles/ToggleSwitch_CSS CSS_lineThrough_AS Failed CompareBitmap(body:step 2)  Baseline image could not be read.  Created image file as a .bad.png. 
     [java] mobile/components/ToggleSwitch/styles/ToggleSwitch_advancedCSS advancedCSS_typeselector_unselected Failed CompareBitmap(body:step 1)  Baseline image could not be read.  Created image file as a .bad.png. 
     [java] mobile/components/ToggleSwitch/styles/ToggleSwitch_advancedCSS advancedCSS_typeselector_selected Failed CompareBitmap(body:step 1)  Baseline image could not be read.  Created image file as a .bad.png. 
     [java] mobile/components/ToggleSwitch/styles/ToggleSwitch_advancedCSS advancedCSS_classselector_unselected Failed CompareBitmap(body:step 1)  Baseline image could not be read.  Created image file as a .bad.png. 
     [java] mobile/components/ToggleSwitch/styles/ToggleSwitch_advancedCSS advancedCSS_classselector_selected Failed CompareBitmap(body:step 1)  Baseline image could not be read.  Created image file as a .bad.png. 
     [java] mobile/components/ToggleSwitch/styles/ToggleSwitch_advancedCSS advancedCSS_advancedselector_unselected Failed CompareBitmap(body:step 1)  Baseline image could not be read.  Created image file as a .bad.png. 
     [java] mobile/components/ToggleSwitch/styles/ToggleSwitch_advancedCSS advancedCSS_advancedselector_selected Failed CompareBitmap(body:step 1)  Baseline image could not be read.  Created image file as a .bad.png. 
     [java] mobile/components/ViewMenu/integration/ViewMenu_Integration3 ThreeButtonsMenuPortrait1 Failed CompareBitmap(body:step 6)  Baseline image could not be read.  Created image file as a .bad.png. 
     [java] mobile/components/ViewMenu/integration/ViewMenu_Integration3 ThreeButtonsMenuPortrait2 Failed CompareBitmap(body:step 9)  Baseline image could not be read.  Created image file as a .bad.png. 
     [java] mobile/components/ViewMenu/integration/ViewMenu_Integration3 ThreeButtonsMenuPortrait3 Failed CompareBitmap(body:step 14)  Baseline image could not be read.  Created image file as a .bad.png. 
     [java] mobile/components/ViewMenu/integration/ViewMenu_Integration3 ThreeButtonsMenuPortrait4 Failed CompareBitmap(body:step 14)  Baseline image could not be read.  Created image file as a .bad.png. 
     [java] mobile/components/ViewMenu/integration/ViewMenu_Integration3 ThreeButtonsMenuPortrait6 Failed CompareBitmap(body:step 5)  Baseline image could not be read.  Created image file as a .bad.png. 
     [java] mobile/components/ViewMenu/integration/ViewMenu_Integration3 ThreeButtonsMenuPortrait7 Failed CompareBitmap(body:step 6)  Baseline image could not be read.  Created image file as a .bad.png. 
     [java] mobile/components/ViewMenu/integration/ViewMenu_Integration3 ThreeButtonsMenuPortrait8 Failed CompareBitmap(body:step 6)  Baseline image could not be read.  Created image file as a .bad.png. 
     [java] mobile/components/ViewMenu/integration/ViewMenu_Integration3 ThreeButtonsMenuPortrait9 Failed CompareBitmap(body:step 6)  Baseline image could not be read.  Created image file as a .bad.png. 
     [java] mobile/components/ViewMenu/integration/ViewMenu_Integration4 FourItemsMenuPortrait1 Failed CompareBitmap(body:step 6)  Baseline image could not be read.  Created image file as a .bad.png. 
     [java] mobile/components/ViewMenu/integration/ViewMenu_Integration4 FourItemsMenuPortrait2 Failed CompareBitmap(body:step 9)  Baseline image could not be read.  Created image file as a .bad.png. 
     [java] mobile/components/ViewMenu/integration/ViewMenu_Integration4 FourItemsMenuPortrait3 Failed CompareBitmap(body:step 14)  Baseline image could not be read.  Created image file as a .bad.png. 
     [java] mobile/components/ViewMenu/integration/ViewMenu_Integration4 FourItemsMenuPortrait4 Failed CompareBitmap(body:step 14)  Baseline image could not be read.  Created image file as a .bad.png. 
     [java] mobile/components/ViewMenu/integration/ViewMenu_Integration4 FourItemsMenuPortrait5 Failed CompareBitmap(body:step 7)  Baseline image could not be read.  Created image file as a .bad.png. 
     [java] mobile/components/ViewMenu/integration/ViewMenu_Integration4 FourItemsMenuPortrait6 Failed CompareBitmap(body:step 9)  Baseline image could not be read.  Created image file as a .bad.png. 
     [java] mobile/components/ViewMenu/integration/ViewMenu_Integration4 FourItemsMenuPortrait7 Failed CompareBitmap(body:step 9)  Baseline image could not be read.  Created image file as a .bad.png. 
     [java] mobile/components/ViewMenu/integration/ViewMenu_Integration4 FourItemsMenuPortrait8 Failed CompareBitmap(body:step 6)  compare returned-3 
     [java] mobile/components/ViewMenu/integration/ViewMenu_Integration4 FourItemsMenuPortrait9 Failed CompareBitmap(body:step 6)  Baseline image could not be read.  Created image file as a .bad.png. 
     [java] mobile/components/ViewMenu/integration/ViewMenu_Integration5 FiveItemsMenuPortrait1 Failed CompareBitmap(body:step 12)  Baseline image could not be read.  Created image file as a .bad.png. 
     [java] mobile/components/ViewMenu/integration/ViewMenu_Integration5 FiveItemsMenuPortrait2 Failed CompareBitmap(body:step 5)  Baseline image could not be read.  Created image file as a .bad.png. 
     [java] mobile/components/ViewMenu/integration/ViewMenu_Integration5 FiveItemsMenuPortrait3 Failed CompareBitmap(body:step 14)  Baseline image could not be read.  Created image file as a .bad.png. 
     [java] mobile/components/ViewMenu/integration/ViewMenu_Integration5 FiveItemsMenuPortrait4 Failed CompareBitmap(body:step 14)  Baseline image could not be read.  Created image file as a .bad.png. 
     [java] mobile/components/ViewMenu/integration/ViewMenu_Integration5 FiveItemsMenuPortrait5 Failed CompareBitmap(body:step 8)  Baseline image could not be read.  Created image file as a .bad.png. 
     [java] mobile/components/ViewMenu/integration/ViewMenu_Integration5 FiveItemsMenuPortrait6 Failed CompareBitmap(body:step 5)  Baseline image could not be read.  Created image file as a .bad.png. 
     [java] mobile/components/ViewMenu/integration/ViewMenu_Integration5 FiveItemsMenuPortrait7 Failed CompareBitmap(body:step 9)  Baseline image could not be read.  Created image file as a .bad.png. 
     [java] mobile/components/ViewMenu/integration/ViewMenu_Integration5 FiveItemsMenuPortrait8 Failed CompareBitmap(body:step 6)  Baseline image could not be read.  Created image file as a .bad.png. 
     [java] mobile/components/ViewMenu/integration/ViewMenu_Integration5 FiveItemsMenuPortrait9 Failed CompareBitmap(body:step 5)  Baseline image could not be read.  Created image file as a .bad.png. 
     [java] mobile/components/ViewMenu/integration/ViewMenu_Integration6 SixItemsMenuPortrait1 Failed CompareBitmap(body:step 12)  Baseline image could not be read.  Created image file as a .bad.png. 
     [java] mobile/components/ViewMenu/integration/ViewMenu_Integration6 SixItemsMenuPortrait2 Failed CompareBitmap(body:step 5)  Baseline image could not be read.  Created image file as a .bad.png. 
     [java] mobile/components/ViewMenu/integration/ViewMenu_Integration6 SixItemsMenuPortrait3 Failed CompareBitmap(body:step 14)  Baseline image could not be read.  Created image file as a .bad.png. 
     [java] mobile/components/ViewMenu/integration/ViewMenu_Integration6 SixItemsMenuPortrait4 Failed CompareBitmap(body:step 14)  Baseline image could not be read.  Created image file as a .bad.png. 
     [java] mobile/components/ViewMenu/integration/ViewMenu_Integration6 SixItemsMenuPortrait5 Failed CompareBitmap(body:step 8)  Baseline image could not be read.  Created image file as a .bad.png. 
     [java] mobile/components/ViewMenu/integration/ViewMenu_Integration6 SixItemsMenuPortrait6 Failed CompareBitmap(body:step 5)  Baseline image could not be read.  Created image file as a .bad.png. 
     [java] mobile/components/ViewMenu/integration/ViewMenu_Integration6 SixItemsMenuPortrait7 Failed CompareBitmap(body:step 9)  Baseline image could not be read.  Created image file as a .bad.png. 
     [java] mobile/components/ViewMenu/integration/ViewMenu_Integration6 SixItemsMenuPortrait8 Failed CompareBitmap(body:step 6)  Baseline image could not be read.  Created image file as a .bad.png. 
     [java] mobile/components/ViewMenu/integration/ViewMenu_Integration6 SixItemsMenuPortrait9 Failed CompareBitmap(body:step 5)  Baseline image could not be read.  Created image file as a .bad.png. 
     [java] mobile/components/ViewMenu/integration/ViewMenu_Integration6 SixItemsMenuPortrait10 Failed CompareBitmap(body:step 7)  Baseline image could not be read.  Created image file as a .bad.png. 
     [java] mobile/components/ViewMenu/integration/ViewMenu_Integration7 SevenItemsMenuPortrait1 Failed CompareBitmap(body:step 12)  Baseline image could not be read.  Created image file as a .bad.png. 
     [java] mobile/components/ViewMenu/integration/ViewMenu_Integration7 SevenItemsMenuPortrait3 Failed CompareBitmap(body:step 14)  Baseline image could not be read.  Created image file as a .bad.png. 
     [java] mobile/components/ViewMenu/properties/ViewMenu_Properties1 OneViewMenuButtonPortrait1 Failed CompareBitmap(body:step 5)  Baseline image could not be read.  Created image file as a .bad.png. 
     [java] mobile/components/ViewMenu/properties/ViewMenu_Properties1 OneViewMenuButtonPortrait2 Failed CompareBitmap(body:step 5)  Baseline image could not be read.  Created image file as a .bad.png. 
     [java] mobile/components/ViewMenu/properties/ViewMenu_Properties1 OneViewMenuButtonPortrait3 Failed CompareBitmap(body:step 5)  Baseline image could not be read.  Created image file as a .bad.png. 
     [java] mobile/components/ViewMenu/properties/ViewMenu_Properties1 OneViewMenuButtonPortrait5 Failed CompareBitmap(body:step 10)  Baseline image could not be read.  Created image file as a .bad.png. 
     [java] mobile/components/ViewMenu/properties/ViewMenu_Properties1 OneViewMenuButtonPortrait6 Failed CompareBitmap(body:step 5)  Baseline image could not be read.  Created image file as a .bad.png. 
     [java] mobile/components/ViewMenu/properties/ViewMenu_Properties2 TwoButtonsMenuPortrait1 Failed CompareBitmap(body:step 6)  Baseline image could not be read.  Created image file as a .bad.png. 
     [java] mobile/components/ViewMenu/properties/ViewMenu_Properties2 TwoButtonsMenuPortrait2 Failed CompareBitmap(body:step 5)  Baseline image could not be read.  Created image file as a .bad.png. 
     [java] mobile/components/ViewMenu/properties/ViewMenu_Properties2 TwoButtonsMenuPortrait3 Failed CompareBitmap(body:step 5)  Baseline image could not be read.  Created image file as a .bad.png. 
     [java] mobile/components/ViewMenu/properties/ViewMenu_Properties2 TwoButtonsMenuPortrait8 Failed CompareBitmap(body:step 5)  Baseline image could not be read.  Created image file as a .bad.png. 
     [java] mobile/components/ViewMenu/properties/ViewMenu_Properties2 TwoButtonsMenuPortrait9 Failed CompareBitmap(body:step 6)  Baseline image could not be read.  Created image file as a .bad.png. 
     [java] mobile/components/ViewMenu/properties/ViewMenu_Properties2 TwoButtonsMenuPortrait10 Failed CompareBitmap(body:step 8)  Baseline image could not be read.  Created image file as a .bad.png. 
     [java] mobile/components/ViewMenu/properties/ViewMenu_Properties2 TwoButtonsMenuPortrait11 Failed CompareBitmap(body:step 6)  Baseline image could not be read.  Created image file as a .bad.png. 
     [java] mobile/components/ViewMenu/properties/ViewMenu_Properties2 TwoButtonsMenuPortrait12 Failed CompareBitmap(body:step 6)  Baseline image could not be read.  Created image file as a .bad.png. 
     [java] mobile/components/ViewMenu/properties/ViewMenu_Properties2 TwoButtonsMenuPortrait13 Failed CompareBitmap(body:step 6)  Baseline image could not be read.  Created image file as a .bad.png. 
     [java] mobile/components/ViewMenu/properties/ViewMenu_Properties2 TwoButtonsMenuPortrait14 Failed CompareBitmap(body:step 5)  Baseline image could not be read.  Created image file as a .bad.png. 
     [java] mobile/components/ViewMenu/integration/ViewMenu_CustomSkinTester CustomSkinSevenItemsMenuPortrait1 Failed CompareBitmap(body:step 3)  Baseline image could not be read.  Created image file as a .bad.png. 
     [java] mobile/components/ViewMenu/integration/ViewMenu_CustomSkinTester CustomSkinSevenItemsMenuPortrait2 Failed RunCode(body:step 1)  Timeout waiting for viewMenuOpen from navigator.activeView 
     [java] mobile/components/ViewMenu/integration/ViewMenuScaleTester ViewMenu240Scale Failed CompareBitmap(body:step 5)  Baseline image could not be read.  Created image file as a .bad.png. 
     [java] mobile/components/ViewMenu/integration/ViewMenuScaleTester BusyIndicator240Scale Failed CompareBitmap(body:step 4)  Baseline image could not be read.  Created image file as a .bad.png. 
     [java] mobile/utils/MultiDPIBitmapSource/integration/MultiDPIBitmapSource_integration MultiDPIBitmapSource_integ_160_embed Failed CompareBitmap(body:step 2)  compare returned[object BitmapData] 
     [java] mobile/utils/MultiDPIBitmapSource/integration/MultiDPIBitmapSource_integration MultiDPIBitmapSource_integ_160_refer Failed CompareBitmap(body:step 2)  compare returned[object BitmapData] 
     [java] mobile/utils/MultiDPIBitmapSource/integration/MultiDPIBitmapSource_integration MultiDPIBitmapSource_integ_240_embed Failed CompareBitmap(body:step 2)  compare returned[object BitmapData] 
     [java] mobile/utils/MultiDPIBitmapSource/integration/MultiDPIBitmapSource_integration MultiDPIBitmapSource_integ_240_refer Failed CompareBitmap(body:step 2)  compare returned[object BitmapData] 
     [java] mobile/utils/MultiDPIBitmapSource/integration/MultiDPIBitmapSource_integration MultiDPIBitmapSource_integ_320_embed Failed CompareBitmap(body:step 2)  compare returned[object BitmapData] 
     [java] mobile/utils/MultiDPIBitmapSource/integration/MultiDPIBitmapSource_integration MultiDPIBitmapSource_integ_320_refer Failed CompareBitmap(body:step 2)  compare returned[object BitmapData] 
     [java] mobile/utils/MultiDPIBitmapSource/properties/MultiDPIBitmapSource_properties MultiDPIBitmapSource_nominal_embed Failed CompareBitmap(body:step 2)  compare returned-3 
     [java] mobile/utils/MultiDPIBitmapSource/properties/MultiDPIBitmapSource_properties MultiDPIBitmapSource_nominal_refer Failed CompareBitmap(body:step 2)  compare returned-3 
     [java] mobile/utils/MultiDPIBitmapSource/properties/MultiDPIBitmapSource_properties MultiDPIBitmapSource_no_160_embed Failed CompareBitmap(body:step 2)  compare returned-3 
     [java] mobile/utils/MultiDPIBitmapSource/properties/MultiDPIBitmapSource_properties MultiDPIBitmapSource_no_160_refer Failed CompareBitmap(body:step 2)  compare returned-3 
     [java] mobile/utils/MultiDPIBitmapSource/integration/MultiDPIBitmapSource_scaling MultiDPIBitmapSource_scaling_refer Failed CompareBitmap(body:step 2)  compare returned-3 
     [java] mobile/utils/MultiDPIBitmapSource/integration/MultiDPIBitmapSource_scaling MultiDPIBitmapSource_scaling_embed Failed CompareBitmap(body:step 2)  compare returned-3 
     [java] 
     [java] 
     [java] =====================================================
     [java]     Passes: 0
     [java]     Fails: 1606
     [java] =====================================================
     [java] 
     [java] 
     [java] Wrote summary to results.txt
     [java] Wrote failures to failures.txt

BUILD FAILED
C:\jenkins_slave\workspace\flex-sdk_mustella-mobile\mustella\build.xml:1538: The following error occurred while executing this line:
C:\jenkins_slave\workspace\flex-sdk_mustella-mobile\mustella\build.xml:1656: Java returned: 1

Total time: 35 minutes 37 seconds
Some of tests failed, even after running '-failures'...
Build step 'Execute shell' marked build as failure