You are viewing a plain text version of this content. The canonical link for it is here.
Posted to builds@solr.apache.org by Apache Jenkins Server <je...@builds.apache.org> on 2025/11/02 07:03:19 UTC

[JENKINS] Solr » Solr-Test-10.0 - Build # 162 - Failure!

Build: https://ci-builds.apache.org/job/Solr/job/Solr-Test-10.0/162/

No tests ran.

Build Log:
[...truncated 55 lines...]
BUILD FAILED in 19s
4 actionable tasks: 4 executed

Publishing build scan...
https://develocity.apache.org/s/escodolcxpc7g

Build step 'Invoke Gradle script' changed build result to FAILURE
Build step 'Invoke Gradle script' marked build as failure
Archiving artifacts
Recording test results
ERROR: Step ‘Publish JUnit test result report’ failed: No test report files were found. Configuration error?
Email was triggered for: Failure - Any
Sending email for trigger: Failure - Any

[JENKINS] Solr » Solr-Test-10.0 - Build # 166 - Still Failing!

Posted by Apache Jenkins Server <je...@builds.apache.org>.
Build: https://ci-builds.apache.org/job/Solr/job/Solr-Test-10.0/166/

No tests ran.

Build Log:
[...truncated 55 lines...]
BUILD FAILED in 24s
4 actionable tasks: 4 executed

Publishing build scan...
https://develocity.apache.org/s/jpwkkcbpw5ts6

Build step 'Invoke Gradle script' changed build result to FAILURE
Build step 'Invoke Gradle script' marked build as failure
Archiving artifacts
Recording test results
ERROR: Step ‘Publish JUnit test result report’ failed: No test report files were found. Configuration error?
Email was triggered for: Failure - Any
Sending email for trigger: Failure - Any

[JENKINS] Solr » Solr-Test-10.0 - Build # 165 - Still Failing!

Posted by Apache Jenkins Server <je...@builds.apache.org>.
Build: https://ci-builds.apache.org/job/Solr/job/Solr-Test-10.0/165/

No tests ran.

Build Log:
[...truncated 54 lines...]
BUILD FAILED in 19s
4 actionable tasks: 4 executed

Publishing build scan...
https://develocity.apache.org/s/l4v3ysst62xtq

Build step 'Invoke Gradle script' changed build result to FAILURE
Build step 'Invoke Gradle script' marked build as failure
Archiving artifacts
Recording test results
ERROR: Step ‘Publish JUnit test result report’ failed: No test report files were found. Configuration error?
Email was triggered for: Failure - Any
Sending email for trigger: Failure - Any

[JENKINS] Solr » Solr-Test-10.0 - Build # 164 - Still Failing!

Posted by Apache Jenkins Server <je...@builds.apache.org>.
Build: https://ci-builds.apache.org/job/Solr/job/Solr-Test-10.0/164/

No tests ran.

Build Log:
[...truncated 54 lines...]
BUILD FAILED in 18s
4 actionable tasks: 4 executed

Publishing build scan...
https://develocity.apache.org/s/2ik4coklfgxzc

Build step 'Invoke Gradle script' changed build result to FAILURE
Build step 'Invoke Gradle script' marked build as failure
Archiving artifacts
Recording test results
ERROR: Step ‘Publish JUnit test result report’ failed: No test report files were found. Configuration error?
Email was triggered for: Failure - Any
Sending email for trigger: Failure - Any

[JENKINS] Solr » Solr-Test-10.0 - Build # 163 - Still Failing!

Posted by Apache Jenkins Server <je...@builds.apache.org>.
Build: https://ci-builds.apache.org/job/Solr/job/Solr-Test-10.0/163/

No tests ran.

Build Log:
[...truncated 55 lines...]
BUILD FAILED in 20s
4 actionable tasks: 4 executed

Publishing build scan...
https://develocity.apache.org/s/d5hrfdtrxpp26

Build step 'Invoke Gradle script' changed build result to FAILURE
Build step 'Invoke Gradle script' marked build as failure
Archiving artifacts
Recording test results
ERROR: Step ‘Publish JUnit test result report’ failed: No test report files were found. Configuration error?
Email was triggered for: Failure - Any
Sending email for trigger: Failure - Any