You are viewing a plain text version of this content. The canonical link for it is here.
Posted to commits@phoenix.apache.org by Apache Jenkins Server <je...@builds.apache.org> on 2020/02/23 10:02:11 UTC
Build failed in Jenkins: Phoenix-4.x-HBase-1.3 #692
See <https://builds.apache.org/job/Phoenix-4.x-HBase-1.3/692/display/redirect?page=changes>
Changes:
[kadir] PHOENIX-5743 addendum for multi-column family indexes
------------------------------------------
[...truncated 143.50 KB...]
[INFO] Excluding org.apache.omid:omid-hbase-common-hbase1.x:jar:1.0.1 from the shaded jar.
[INFO] Excluding org.apache.omid:omid-timestamp-storage-hbase1.x:jar:1.0.1 from the shaded jar.
[INFO] Excluding org.apache.omid:omid-metrics:jar:1.0.1 from the shaded jar.
[INFO] Excluding org.apache.omid:omid-codahale-metrics:jar:1.0.1 from the shaded jar.
[INFO] Excluding org.jboss.netty:netty:jar:3.2.6.Final from the shaded jar.
[INFO] Excluding org.apache.commons:commons-pool2:jar:2.4.2 from the shaded jar.
[INFO] Excluding commons-daemon:commons-daemon:jar:1.0.10 from the shaded jar.
[INFO] Excluding org.apache.omid:omid-tso-server-hbase1.x:test-jar:tests:1.0.1 from the shaded jar.
[INFO] Excluding org.apache.tephra:tephra-api:jar:0.15.0-incubating from the shaded jar.
[INFO] Excluding org.apache.tephra:tephra-core:jar:0.15.0-incubating from the shaded jar.
[INFO] Excluding org.apache.tephra:tephra-hbase-compat-1.3:jar:0.15.0-incubating from the shaded jar.
[INFO] Excluding org.antlr:antlr-runtime:jar:3.5.2 from the shaded jar.
[INFO] Excluding jline:jline:jar:2.11 from the shaded jar.
[INFO] Excluding sqlline:sqlline:jar:1.5.0 from the shaded jar.
[INFO] Excluding net.sourceforge.argparse4j:argparse4j:jar:0.8.1 from the shaded jar.
[INFO] Excluding com.google.guava:guava:jar:13.0.1 from the shaded jar.
[INFO] Including joda-time:joda-time:jar:1.6 in the shaded jar.
[INFO] Excluding com.github.stephenc.findbugs:findbugs-annotations:jar:1.3.9-1 from the shaded jar.
[INFO] Excluding com.github.stephenc.jcip:jcip-annotations:jar:1.0-1 from the shaded jar.
[INFO] Excluding org.codehaus.jackson:jackson-core-asl:jar:1.9.2 from the shaded jar.
[INFO] Excluding org.codehaus.jackson:jackson-mapper-asl:jar:1.9.2 from the shaded jar.
[INFO] Excluding com.google.protobuf:protobuf-java:jar:2.5.0 from the shaded jar.
[INFO] Excluding log4j:log4j:jar:1.2.17 from the shaded jar.
[INFO] Excluding org.slf4j:slf4j-api:jar:1.6.4 from the shaded jar.
[INFO] Excluding org.iq80.snappy:snappy:jar:0.3 from the shaded jar.
[INFO] Excluding org.apache.htrace:htrace-core:jar:3.1.0-incubating from the shaded jar.
[INFO] Excluding commons-codec:commons-codec:jar:1.7 from the shaded jar.
[INFO] Excluding commons-collections:commons-collections:jar:3.2.2 from the shaded jar.
[INFO] Including org.apache.commons:commons-csv:jar:1.0 in the shaded jar.
[INFO] Excluding com.google.code.findbugs:jsr305:jar:2.0.1 from the shaded jar.
[INFO] Excluding org.apache.hbase:hbase-annotations:jar:1.3.5 from the shaded jar.
[INFO] Excluding org.apache.hbase:hbase-common:jar:1.3.5 from the shaded jar.
[INFO] Excluding org.mortbay.jetty:jetty-util:jar:6.1.26 from the shaded jar.
[INFO] Excluding org.apache.hbase:hbase-protocol:jar:1.3.5 from the shaded jar.
[INFO] Excluding org.apache.hbase:hbase-client:jar:1.3.5 from the shaded jar.
[INFO] Excluding io.netty:netty-all:jar:4.0.50.Final from the shaded jar.
[INFO] Excluding org.apache.zookeeper:zookeeper:jar:3.4.6 from the shaded jar.
[INFO] Excluding org.jruby.jcodings:jcodings:jar:1.0.8 from the shaded jar.
[INFO] Excluding org.apache.hbase:hbase-server:jar:1.3.5 from the shaded jar.
[INFO] Excluding org.apache.hbase:hbase-procedure:jar:1.3.5 from the shaded jar.
[INFO] Excluding org.apache.hbase:hbase-prefix-tree:jar:1.3.5 from the shaded jar.
[INFO] Excluding commons-httpclient:commons-httpclient:jar:3.1 from the shaded jar.
[INFO] Excluding com.sun.jersey:jersey-core:jar:1.9 from the shaded jar.
[INFO] Excluding com.sun.jersey:jersey-server:jar:1.9 from the shaded jar.
[INFO] Excluding asm:asm:jar:3.1 from the shaded jar.
[INFO] Excluding org.mortbay.jetty:jetty:jar:6.1.26 from the shaded jar.
[INFO] Excluding org.mortbay.jetty:jetty-sslengine:jar:6.1.26 from the shaded jar.
[INFO] Excluding org.mortbay.jetty:jsp-2.1:jar:6.1.14 from the shaded jar.
[INFO] Excluding org.mortbay.jetty:jsp-api-2.1:jar:6.1.14 from the shaded jar.
[INFO] Excluding org.mortbay.jetty:servlet-api-2.5:jar:6.1.14 from the shaded jar.
[INFO] Excluding tomcat:jasper-compiler:jar:5.5.23 from the shaded jar.
[INFO] Excluding tomcat:jasper-runtime:jar:5.5.23 from the shaded jar.
[INFO] Excluding commons-el:commons-el:jar:1.0 from the shaded jar.
[INFO] Excluding org.jamon:jamon-runtime:jar:2.4.1 from the shaded jar.
[INFO] Excluding org.apache.hbase:hbase-hadoop-compat:jar:1.3.5 from the shaded jar.
[INFO] Excluding org.apache.hbase:hbase-hadoop2-compat:jar:1.3.5 from the shaded jar.
[INFO] Excluding org.apache.hadoop:hadoop-common:jar:2.7.1 from the shaded jar.
[INFO] Excluding xmlenc:xmlenc:jar:0.52 from the shaded jar.
[INFO] Excluding commons-net:commons-net:jar:3.1 from the shaded jar.
[INFO] Excluding javax.servlet:servlet-api:jar:2.5 from the shaded jar.
[INFO] Excluding javax.servlet.jsp:jsp-api:jar:2.1 from the shaded jar.
[INFO] Excluding com.sun.jersey:jersey-json:jar:1.9 from the shaded jar.
[INFO] Excluding org.codehaus.jettison:jettison:jar:1.1 from the shaded jar.
[INFO] Excluding com.sun.xml.bind:jaxb-impl:jar:2.2.3-1 from the shaded jar.
[INFO] Excluding net.java.dev.jets3t:jets3t:jar:0.9.0 from the shaded jar.
[INFO] Excluding com.jamesmurty.utils:java-xmlbuilder:jar:0.4 from the shaded jar.
[INFO] Excluding commons-configuration:commons-configuration:jar:1.6 from the shaded jar.
[INFO] Excluding commons-digester:commons-digester:jar:1.8 from the shaded jar.
[INFO] Excluding commons-beanutils:commons-beanutils-core:jar:1.8.0 from the shaded jar.
[INFO] Excluding org.apache.avro:avro:jar:1.7.4 from the shaded jar.
[INFO] Excluding com.thoughtworks.paranamer:paranamer:jar:2.3 from the shaded jar.
[INFO] Excluding com.jcraft:jsch:jar:0.1.42 from the shaded jar.
[INFO] Excluding org.apache.curator:curator-client:jar:2.12.0 from the shaded jar.
[INFO] Excluding org.apache.curator:curator-recipes:jar:2.7.1 from the shaded jar.
[INFO] Excluding org.apache.commons:commons-compress:jar:1.4.1 from the shaded jar.
[INFO] Excluding org.tukaani:xz:jar:1.0 from the shaded jar.
[INFO] Excluding org.apache.hadoop:hadoop-annotations:jar:2.7.1 from the shaded jar.
[INFO] Excluding org.apache.hadoop:hadoop-mapreduce-client-core:jar:2.7.1 from the shaded jar.
[INFO] Excluding org.apache.hadoop:hadoop-yarn-common:jar:2.7.1 from the shaded jar.
[INFO] Excluding javax.xml.bind:jaxb-api:jar:2.2.2 from the shaded jar.
[INFO] Excluding javax.xml.stream:stax-api:jar:1.0-2 from the shaded jar.
[INFO] Excluding javax.activation:activation:jar:1.1 from the shaded jar.
[INFO] Excluding com.sun.jersey.contribs:jersey-guice:jar:1.9 from the shaded jar.
[INFO] Excluding com.google.inject.extensions:guice-servlet:jar:3.0 from the shaded jar.
[INFO] Excluding io.netty:netty:jar:3.6.2.Final from the shaded jar.
[INFO] Excluding org.jruby.joni:joni:jar:2.1.2 from the shaded jar.
[INFO] Excluding com.clearspring.analytics:stream:jar:2.9.5 from the shaded jar.
[INFO] Excluding com.salesforce.i18n:i18n-util:jar:1.0.4 from the shaded jar.
[INFO] Excluding com.ibm.icu:icu4j:jar:60.2 from the shaded jar.
[INFO] Excluding com.ibm.icu:icu4j-localespi:jar:60.2 from the shaded jar.
[INFO] Excluding com.ibm.icu:icu4j-charset:jar:60.2 from the shaded jar.
[INFO] Excluding com.lmax:disruptor:jar:3.3.6 from the shaded jar.
[INFO] Excluding org.apache.curator:curator-framework:jar:2.12.0 from the shaded jar.
[INFO] Including com.googlecode.java-diff-utils:diffutils:jar:1.2.1 in the shaded jar.
[INFO] Including org.apache.commons:commons-lang3:jar:3.3.2 in the shaded jar.
[INFO] Including org.apache.commons:commons-math3:jar:3.3 in the shaded jar.
[INFO] Including commons-cli:commons-cli:jar:1.2 in the shaded jar.
[INFO] Excluding com.jcabi:jcabi-jdbc:jar:0.15 from the shaded jar.
[INFO] Excluding com.jcabi:jcabi-aspects:jar:0.20.1 from the shaded jar.
[INFO] Excluding com.jcabi:jcabi-log:jar:0.15 from the shaded jar.
[INFO] Excluding javax.validation:validation-api:jar:1.1.0.Final from the shaded jar.
[INFO] Excluding org.aspectj:aspectjrt:jar:1.8.4 from the shaded jar.
[INFO] Excluding com.github.stefanbirkner:system-rules:jar:1.8.0 from the shaded jar.
[INFO] Excluding commons-io:commons-io:jar:2.7-SNAPSHOT from the shaded jar.
[INFO] Excluding org.slf4j:slf4j-log4j12:jar:1.7.7 from the shaded jar.
[INFO] Excluding org.apache.hadoop:hadoop-auth:jar:2.7.1 from the shaded jar.
[INFO] Excluding org.apache.httpcomponents:httpclient:jar:4.2.5 from the shaded jar.
[INFO] Excluding org.apache.directory.server:apacheds-kerberos-codec:jar:2.0.0-M15 from the shaded jar.
[INFO] Excluding org.apache.directory.server:apacheds-i18n:jar:2.0.0-M15 from the shaded jar.
[INFO] Excluding org.apache.directory.api:api-asn1-api:jar:1.0.0-M20 from the shaded jar.
[INFO] Excluding org.apache.directory.api:api-util:jar:1.0.0-M20 from the shaded jar.
[INFO] Excluding org.apache.hadoop:hadoop-client:jar:2.7.1 from the shaded jar.
[INFO] Excluding org.apache.hadoop:hadoop-mapreduce-client-jobclient:jar:2.7.1 from the shaded jar.
[INFO] Excluding org.apache.hadoop:hadoop-mapreduce-client-common:jar:2.7.1 from the shaded jar.
[INFO] Excluding org.apache.hadoop:hadoop-yarn-client:jar:2.7.1 from the shaded jar.
[INFO] Excluding org.apache.hadoop:hadoop-mapreduce-client-shuffle:jar:2.7.1 from the shaded jar.
[INFO] Excluding com.sun.jersey:jersey-client:jar:1.9 from the shaded jar.
[INFO] Excluding com.yammer.metrics:metrics-core:jar:2.2.0 from the shaded jar.
[INFO] Excluding commons-logging:commons-logging:jar:1.2 from the shaded jar.
[INFO] Excluding org.apache.commons:commons-math:jar:2.2 from the shaded jar.
[INFO] Including commons-lang:commons-lang:jar:2.6 in the shaded jar.
[INFO] Excluding com.google.code.gson:gson:jar:2.2.4 from the shaded jar.
[INFO] Excluding com.google.inject:guice:jar:3.0 from the shaded jar.
[INFO] Excluding javax.inject:javax.inject:jar:1 from the shaded jar.
[INFO] Excluding aopalliance:aopalliance:jar:1.0 from the shaded jar.
[INFO] Excluding com.google.inject.extensions:guice-assistedinject:jar:3.0 from the shaded jar.
[INFO] Excluding org.apache.thrift:libthrift:jar:0.9.0 from the shaded jar.
[INFO] Excluding org.apache.httpcomponents:httpcore:jar:4.1.3 from the shaded jar.
[INFO] Excluding it.unimi.dsi:fastutil:jar:6.5.6 from the shaded jar.
[INFO] Excluding org.apache.twill:twill-common:jar:0.8.0 from the shaded jar.
[INFO] Excluding org.apache.twill:twill-core:jar:0.8.0 from the shaded jar.
[INFO] Excluding org.apache.twill:twill-api:jar:0.8.0 from the shaded jar.
[INFO] Excluding org.ow2.asm:asm-all:jar:5.0.2 from the shaded jar.
[INFO] Excluding org.apache.twill:twill-discovery-api:jar:0.8.0 from the shaded jar.
[INFO] Excluding org.apache.twill:twill-discovery-core:jar:0.8.0 from the shaded jar.
[INFO] Excluding org.apache.twill:twill-zookeeper:jar:0.8.0 from the shaded jar.
[INFO] Excluding io.dropwizard.metrics:metrics-core:jar:3.1.0 from the shaded jar.
[INFO] Excluding xerces:xercesImpl:jar:2.9.1 from the shaded jar.
[INFO] Excluding xml-apis:xml-apis:jar:1.3.04 from the shaded jar.
[INFO] Excluding org.fusesource.leveldbjni:leveldbjni-all:jar:1.8 from the shaded jar.
[INFO] Excluding org.apache.hadoop:hadoop-yarn-server-common:jar:2.7.1 from the shaded jar.
[INFO] Excluding org.apache.hadoop:hadoop-yarn-server-nodemanager:jar:2.7.1 from the shaded jar.
[INFO] Excluding org.apache.hadoop:hadoop-hdfs:jar:2.7.1 from the shaded jar.
[INFO] Excluding org.apache.hadoop:hadoop-mapreduce-client-app:jar:2.7.1 from the shaded jar.
[INFO] Excluding org.apache.hadoop:hadoop-yarn-server-web-proxy:jar:2.7.1 from the shaded jar.
[INFO] Excluding org.apache.hadoop:hadoop-yarn-api:jar:2.7.1 from the shaded jar.
[INFO] Replacing <https://builds.apache.org/job/Phoenix-4.x-HBase-1.3/ws/phoenix-pherf/target/phoenix-pherf-4.16.0-HBase-1.3-SNAPSHOT-minimal.jar> with <https://builds.apache.org/job/Phoenix-4.x-HBase-1.3/ws/phoenix-pherf/target/phoenix-pherf-4.16.0-HBase-1.3-SNAPSHOT-shaded.jar>
[INFO]
[INFO] --- maven-failsafe-plugin:2.22.0:integration-test (ParallelStatsEnabledTest) @ phoenix-pherf ---
[INFO]
[INFO] -------------------------------------------------------
[INFO] T E S T S
[INFO] -------------------------------------------------------
[INFO]
[INFO] Results:
[INFO]
[INFO] Tests run: 0, Failures: 0, Errors: 0, Skipped: 0
[INFO]
[INFO]
[INFO] --- maven-failsafe-plugin:2.22.0:integration-test (ParallelStatsDisabledTest) @ phoenix-pherf ---
[INFO]
[INFO] -------------------------------------------------------
[INFO] T E S T S
[INFO] -------------------------------------------------------
[INFO]
[INFO] Results:
[INFO]
[INFO] Tests run: 0, Failures: 0, Errors: 0, Skipped: 0
[INFO]
[INFO]
[INFO] --- maven-failsafe-plugin:2.22.0:integration-test (HBaseManagedTimeTests) @ phoenix-pherf ---
[INFO]
[INFO] -------------------------------------------------------
[INFO] T E S T S
[INFO] -------------------------------------------------------
[INFO] Running org.apache.phoenix.pherf.SchemaReaderIT
[INFO] Running org.apache.phoenix.pherf.DataIngestIT
[INFO] Running org.apache.phoenix.pherf.PherfMainIT
[INFO] Tests run: 1, Failures: 0, Errors: 0, Skipped: 0, Time elapsed: 56.155 s - in org.apache.phoenix.pherf.SchemaReaderIT
[ERROR] Tests run: 2, Failures: 0, Errors: 1, Skipped: 0, Time elapsed: 66.232 s <<< FAILURE! - in org.apache.phoenix.pherf.PherfMainIT
[ERROR] org.apache.phoenix.pherf.PherfMainIT Time elapsed: 66.232 s <<< ERROR!
java.io.IOException: Unable to delete directory RESULTS.
[INFO] Tests run: 5, Failures: 0, Errors: 0, Skipped: 0, Time elapsed: 102.006 s - in org.apache.phoenix.pherf.DataIngestIT
[INFO]
[INFO] Results:
[INFO]
[ERROR] Errors:
[ERROR] PherfMainIT>ResultBaseTestIT.tearDown:57 » IO Unable to delete directory RESUL...
[INFO]
[ERROR] Tests run: 8, Failures: 0, Errors: 1, Skipped: 0
[INFO]
[INFO]
[INFO] --- maven-failsafe-plugin:2.22.0:integration-test (NeedTheirOwnClusterTests) @ phoenix-pherf ---
[INFO]
[INFO] -------------------------------------------------------
[INFO] T E S T S
[INFO] -------------------------------------------------------
[INFO]
[INFO] Results:
[INFO]
[INFO] Tests run: 0, Failures: 0, Errors: 0, Skipped: 0
[INFO]
[INFO]
[INFO] --- maven-failsafe-plugin:2.22.0:integration-test (SplitSystemCatalogTests) @ phoenix-pherf ---
[INFO]
[INFO] -------------------------------------------------------
[INFO] T E S T S
[INFO] -------------------------------------------------------
[INFO]
[INFO] Results:
[INFO]
[INFO] Tests run: 0, Failures: 0, Errors: 0, Skipped: 0
[INFO]
[INFO]
[INFO] --- maven-failsafe-plugin:2.22.0:verify (ParallelStatsEnabledTest) @ phoenix-pherf ---
[INFO] ------------------------------------------------------------------------
[INFO] Reactor Summary for Apache Phoenix 4.16.0-HBase-1.3-SNAPSHOT:
[INFO]
[INFO] Apache Phoenix ..................................... SUCCESS [ 2.727 s]
[INFO] Phoenix Core ....................................... SUCCESS [ 02:48 h]
[INFO] Phoenix - Pherf .................................... FAILURE [03:15 min]
[INFO] Phoenix Client ..................................... SKIPPED
[INFO] Phoenix Server ..................................... SKIPPED
[INFO] Phoenix Assembly ................................... SKIPPED
[INFO] Phoenix - Tracing Web Application .................. SKIPPED
[INFO] ------------------------------------------------------------------------
[INFO] BUILD FAILURE
[INFO] ------------------------------------------------------------------------
[INFO] Total time: 02:51 h
[INFO] Finished at: 2020-02-23T10:14:01Z
[INFO] ------------------------------------------------------------------------
[ERROR] Failed to execute goal org.apache.maven.plugins:maven-failsafe-plugin:2.22.0:verify (ParallelStatsEnabledTest) on project phoenix-pherf: There are test failures.
[ERROR]
[ERROR] Please refer to <https://builds.apache.org/job/Phoenix-4.x-HBase-1.3/ws/phoenix-pherf/target/failsafe-reports> for the individual test results.
[ERROR] Please refer to dump files (if any exist) [date]-jvmRun[N].dump, [date].dumpstream and [date]-jvmRun[N].dumpstream.
[ERROR] -> [Help 1]
[ERROR]
[ERROR] To see the full stack trace of the errors, re-run Maven with the -e switch.
[ERROR] Re-run Maven using the -X switch to enable full debug logging.
[ERROR]
[ERROR] For more information about the errors and possible solutions, please read the following articles:
[ERROR] [Help 1] http://cwiki.apache.org/confluence/display/MAVEN/MojoFailureException
[ERROR]
[ERROR] After correcting the problems, you can resume the build with the command
[ERROR] mvn <args> -rf :phoenix-pherf
Build step 'Invoke top-level Maven targets' marked build as failure
[JIRA] Updating issue PHOENIX-5743
Recording test results
Build failed in Jenkins: Phoenix-4.x-HBase-1.3 #693
Posted by Apache Jenkins Server <je...@builds.apache.org>.
See <https://builds.apache.org/job/Phoenix-4.x-HBase-1.3/693/display/redirect?page=changes>
Changes:
[achouhan] PHOENIX-5737 Hadoop QA run says no tests even though there are added IT
------------------------------------------
[...truncated 106.05 KB...]
[INFO]
[INFO] Tests run: 0, Failures: 0, Errors: 0, Skipped: 0
[INFO]
[INFO]
[INFO] --- maven-failsafe-plugin:2.22.0:integration-test (NeedTheirOwnClusterTests) @ phoenix-core ---
[INFO]
[INFO] -------------------------------------------------------
[INFO] T E S T S
[INFO] -------------------------------------------------------
[INFO] Running org.apache.hadoop.hbase.regionserver.wal.WALReplayWithIndexWritesAndCompressedWALIT
[WARNING] Tests run: 1, Failures: 0, Errors: 0, Skipped: 1, Time elapsed: 0.004 s - in org.apache.hadoop.hbase.regionserver.wal.WALReplayWithIndexWritesAndCompressedWALIT
[INFO] Running org.apache.phoenix.end2end.ConnectionUtilIT
[INFO] Running org.apache.hadoop.hbase.regionserver.wal.WALRecoveryRegionPostOpenIT
[INFO] Tests run: 1, Failures: 0, Errors: 0, Skipped: 0, Time elapsed: 10.927 s - in org.apache.hadoop.hbase.regionserver.wal.WALRecoveryRegionPostOpenIT
[INFO] Running org.apache.phoenix.end2end.ConcurrentMutationsExtendedIT
[INFO] Running org.apache.phoenix.end2end.ColumnEncodedMutableNonTxStatsCollectorIT
[INFO] Running org.apache.phoenix.end2end.ColumnEncodedImmutableNonTxStatsCollectorIT
[INFO] Running org.apache.phoenix.end2end.ColumnEncodedImmutableTxStatsCollectorIT
[INFO] Running org.apache.phoenix.end2end.ColumnEncodedMutableTxStatsCollectorIT
[INFO] Tests run: 1, Failures: 0, Errors: 0, Skipped: 0, Time elapsed: 52.286 s - in org.apache.phoenix.end2end.ConnectionUtilIT
[INFO] Running org.apache.phoenix.end2end.ContextClassloaderIT
[INFO] Tests run: 3, Failures: 0, Errors: 0, Skipped: 0, Time elapsed: 4.69 s - in org.apache.phoenix.end2end.ContextClassloaderIT
[INFO] Running org.apache.phoenix.end2end.CostBasedDecisionIT
[INFO] Running org.apache.phoenix.end2end.CountDistinctCompressionIT
[INFO] Tests run: 1, Failures: 0, Errors: 0, Skipped: 0, Time elapsed: 4.748 s - in org.apache.phoenix.end2end.CountDistinctCompressionIT
[WARNING] Tests run: 28, Failures: 0, Errors: 0, Skipped: 4, Time elapsed: 179.979 s - in org.apache.phoenix.end2end.ColumnEncodedImmutableNonTxStatsCollectorIT
[WARNING] Tests run: 28, Failures: 0, Errors: 0, Skipped: 4, Time elapsed: 183.834 s - in org.apache.phoenix.end2end.ColumnEncodedMutableNonTxStatsCollectorIT
[WARNING] Tests run: 28, Failures: 0, Errors: 0, Skipped: 4, Time elapsed: 186.137 s - in org.apache.phoenix.end2end.ColumnEncodedImmutableTxStatsCollectorIT
[WARNING] Tests run: 28, Failures: 0, Errors: 0, Skipped: 4, Time elapsed: 188.312 s - in org.apache.phoenix.end2end.ColumnEncodedMutableTxStatsCollectorIT
[INFO] Running org.apache.phoenix.end2end.CsvBulkLoadToolIT
[INFO] Running org.apache.phoenix.end2end.DropSchemaIT
[INFO] Running org.apache.phoenix.end2end.FlappingLocalIndexIT
[INFO] Running org.apache.phoenix.end2end.IndexBuildTimestampIT
[INFO] Running org.apache.phoenix.end2end.IndexExtendedIT
[INFO] Tests run: 10, Failures: 0, Errors: 0, Skipped: 0, Time elapsed: 284.134 s - in org.apache.phoenix.end2end.ConcurrentMutationsExtendedIT
[INFO] Tests run: 2, Failures: 0, Errors: 0, Skipped: 0, Time elapsed: 33.802 s - in org.apache.phoenix.end2end.DropSchemaIT
[INFO] Running org.apache.phoenix.end2end.IndexRebuildTaskIT
[INFO] Running org.apache.phoenix.end2end.IndexScrutinyToolForTenantIT
[INFO] Tests run: 16, Failures: 0, Errors: 0, Skipped: 0, Time elapsed: 149.823 s - in org.apache.phoenix.end2end.CsvBulkLoadToolIT
[INFO] Tests run: 1, Failures: 0, Errors: 0, Skipped: 0, Time elapsed: 30.016 s - in org.apache.phoenix.end2end.IndexRebuildTaskIT
[INFO] Running org.apache.phoenix.end2end.IndexScrutinyToolIT
[INFO] Running org.apache.phoenix.end2end.IndexToolForPartialBuildIT
[INFO] Tests run: 6, Failures: 0, Errors: 0, Skipped: 0, Time elapsed: 98.089 s - in org.apache.phoenix.end2end.IndexScrutinyToolForTenantIT
[INFO] Tests run: 12, Failures: 0, Errors: 0, Skipped: 0, Time elapsed: 194.393 s - in org.apache.phoenix.end2end.FlappingLocalIndexIT
[INFO] Tests run: 16, Failures: 0, Errors: 0, Skipped: 0, Time elapsed: 200.062 s - in org.apache.phoenix.end2end.IndexBuildTimestampIT
[INFO] Tests run: 1, Failures: 0, Errors: 0, Skipped: 0, Time elapsed: 25.015 s - in org.apache.phoenix.end2end.IndexToolForPartialBuildIT
[INFO] Running org.apache.phoenix.end2end.IndexToolIT
[INFO] Running org.apache.phoenix.end2end.IndexToolForPartialBuildWithNamespaceEnabledIT
[INFO] Tests run: 64, Failures: 0, Errors: 0, Skipped: 0, Time elapsed: 273.532 s - in org.apache.phoenix.end2end.IndexExtendedIT
[INFO] Running org.apache.phoenix.end2end.LocalIndexSplitMergeIT
[INFO] Running org.apache.phoenix.end2end.MaxLookbackIT
[INFO] Running org.apache.phoenix.end2end.MigrateSystemTablesToSystemNamespaceIT
[INFO] Tests run: 2, Failures: 0, Errors: 0, Skipped: 0, Time elapsed: 46.244 s - in org.apache.phoenix.end2end.IndexToolForPartialBuildWithNamespaceEnabledIT
[INFO] Tests run: 4, Failures: 0, Errors: 0, Skipped: 0, Time elapsed: 68.339 s - in org.apache.phoenix.end2end.MaxLookbackIT
[INFO] Running org.apache.phoenix.end2end.NonColumnEncodedImmutableNonTxStatsCollectorIT
[INFO] Running org.apache.phoenix.end2end.NonColumnEncodedImmutableTxStatsCollectorIT
[INFO] Tests run: 3, Failures: 0, Errors: 0, Skipped: 0, Time elapsed: 188.751 s - in org.apache.phoenix.end2end.LocalIndexSplitMergeIT
[INFO] Tests run: 20, Failures: 0, Errors: 0, Skipped: 0, Time elapsed: 689.365 s - in org.apache.phoenix.end2end.CostBasedDecisionIT
[INFO] Running org.apache.phoenix.end2end.OrderByWithServerClientSpoolingDisabledIT
[WARNING] Tests run: 28, Failures: 0, Errors: 0, Skipped: 4, Time elapsed: 182.22 s - in org.apache.phoenix.end2end.NonColumnEncodedImmutableNonTxStatsCollectorIT
[INFO] Running org.apache.phoenix.end2end.OrderByWithServerMemoryLimitIT
[WARNING] Tests run: 33, Failures: 0, Errors: 0, Skipped: 3, Time elapsed: 422.807 s - in org.apache.phoenix.end2end.IndexScrutinyToolIT
[INFO] Tests run: 1, Failures: 0, Errors: 0, Skipped: 0, Time elapsed: 4.871 s - in org.apache.phoenix.end2end.OrderByWithServerMemoryLimitIT
[INFO] Running org.apache.phoenix.end2end.ParameterizedIndexUpgradeToolIT
[INFO] Running org.apache.phoenix.end2end.PartialResultServerConfigurationIT
[INFO] Running org.apache.phoenix.end2end.OrderByWithSpillingIT
[INFO] Tests run: 1, Failures: 0, Errors: 0, Skipped: 0, Time elapsed: 63.875 s - in org.apache.phoenix.end2end.PartialResultServerConfigurationIT
[INFO] Running org.apache.phoenix.end2end.PermissionNSDisabledIT
[INFO] Tests run: 4, Failures: 0, Errors: 0, Skipped: 0, Time elapsed: 452.718 s - in org.apache.phoenix.end2end.MigrateSystemTablesToSystemNamespaceIT
[INFO] Running org.apache.phoenix.end2end.PermissionNSEnabledIT
[WARNING] Tests run: 56, Failures: 0, Errors: 0, Skipped: 8, Time elapsed: 359.904 s - in org.apache.phoenix.end2end.NonColumnEncodedImmutableTxStatsCollectorIT
[INFO] Tests run: 16, Failures: 0, Errors: 0, Skipped: 0, Time elapsed: 236.841 s - in org.apache.phoenix.end2end.OrderByWithServerClientSpoolingDisabledIT
[INFO] Running org.apache.phoenix.end2end.PermissionsCacheIT
[INFO] Running org.apache.phoenix.end2end.PhoenixDriverIT
[INFO] Tests run: 16, Failures: 0, Errors: 0, Skipped: 0, Time elapsed: 261.792 s - in org.apache.phoenix.end2end.OrderByWithSpillingIT
[INFO] Tests run: 4, Failures: 0, Errors: 0, Skipped: 0, Time elapsed: 97.286 s - in org.apache.phoenix.end2end.PhoenixDriverIT
[INFO] Running org.apache.phoenix.end2end.QueryLoggerIT
[INFO] Running org.apache.phoenix.end2end.QueryTimeoutIT
[INFO] Tests run: 2, Failures: 0, Errors: 0, Skipped: 0, Time elapsed: 9.36 s - in org.apache.phoenix.end2end.QueryTimeoutIT
[INFO] Tests run: 8, Failures: 0, Errors: 0, Skipped: 0, Time elapsed: 308.066 s - in org.apache.phoenix.end2end.PermissionNSDisabledIT
[INFO] Tests run: 7, Failures: 0, Errors: 0, Skipped: 0, Time elapsed: 63.748 s - in org.apache.phoenix.end2end.QueryLoggerIT
[INFO] Tests run: 11, Failures: 0, Errors: 0, Skipped: 0, Time elapsed: 320.98 s - in org.apache.phoenix.end2end.PermissionNSEnabledIT
[INFO] Running org.apache.phoenix.end2end.QueryWithLimitIT
[INFO] Tests run: 2, Failures: 0, Errors: 0, Skipped: 0, Time elapsed: 7.753 s - in org.apache.phoenix.end2end.QueryWithLimitIT
[INFO] Running org.apache.phoenix.end2end.RebuildIndexConnectionPropsIT
[INFO] Tests run: 1, Failures: 0, Errors: 0, Skipped: 0, Time elapsed: 0.472 s - in org.apache.phoenix.end2end.RebuildIndexConnectionPropsIT
[INFO] Tests run: 9, Failures: 0, Errors: 0, Skipped: 0, Time elapsed: 302.584 s - in org.apache.phoenix.end2end.PermissionsCacheIT
[INFO] Running org.apache.phoenix.end2end.RegexBulkLoadToolIT
[INFO] Running org.apache.phoenix.end2end.RenewLeaseIT
[INFO] Tests run: 1, Failures: 0, Errors: 0, Skipped: 0, Time elapsed: 28.608 s - in org.apache.phoenix.end2end.RenewLeaseIT
[INFO] Running org.apache.phoenix.end2end.SpillableGroupByIT
[INFO] Running org.apache.phoenix.end2end.SplitIT
[WARNING] Tests run: 10, Failures: 0, Errors: 0, Skipped: 2, Time elapsed: 67.985 s - in org.apache.phoenix.end2end.RegexBulkLoadToolIT
[INFO] Tests run: 3, Failures: 0, Errors: 0, Skipped: 0, Time elapsed: 17.556 s - in org.apache.phoenix.end2end.SpillableGroupByIT
[INFO] Running org.apache.phoenix.end2end.SystemCatalogCreationOnConnectionIT
[INFO] Running org.apache.phoenix.end2end.StatsEnabledSplitSystemCatalogIT
[INFO] Running org.apache.phoenix.end2end.SysTableNamespaceMappedStatsCollectorIT
[INFO] Running org.apache.phoenix.end2end.SequencePointInTimeIT
[ERROR] Tests run: 1, Failures: 0, Errors: 1, Skipped: 0, Time elapsed: 0.01 s <<< FAILURE! - in org.apache.phoenix.end2end.SequencePointInTimeIT
[ERROR] org.apache.phoenix.end2end.SequencePointInTimeIT Time elapsed: 0.007 s <<< ERROR!
java.lang.RuntimeException: java.io.IOException: Shutting down
at org.apache.phoenix.end2end.SequencePointInTimeIT.doSetup(SequencePointInTimeIT.java:57)
Caused by: java.io.IOException: Shutting down
at org.apache.phoenix.end2end.SequencePointInTimeIT.doSetup(SequencePointInTimeIT.java:57)
Caused by: java.lang.RuntimeException: Master not initialized after 200000ms seconds
at org.apache.phoenix.end2end.SequencePointInTimeIT.doSetup(SequencePointInTimeIT.java:57)
[INFO] Tests run: 165, Failures: 0, Errors: 0, Skipped: 0, Time elapsed: 1,094.197 s - in org.apache.phoenix.end2end.IndexToolIT
[INFO] Tests run: 18, Failures: 0, Errors: 0, Skipped: 0, Time elapsed: 119.229 s - in org.apache.phoenix.end2end.StatsEnabledSplitSystemCatalogIT
[INFO] Running org.apache.phoenix.end2end.SystemCatalogIT
[INFO] Running org.apache.phoenix.end2end.UpdateCacheAcrossDifferentClientsIT
[INFO] Running org.apache.phoenix.end2end.TableSnapshotReadsMapReduceIT
[INFO] Tests run: 4, Failures: 0, Errors: 0, Skipped: 0, Time elapsed: 43.908 s - in org.apache.phoenix.end2end.TableSnapshotReadsMapReduceIT
[INFO] Tests run: 2, Failures: 0, Errors: 0, Skipped: 0, Time elapsed: 102.917 s - in org.apache.phoenix.end2end.SystemCatalogIT
[WARNING] Tests run: 42, Failures: 0, Errors: 0, Skipped: 6, Time elapsed: 250.068 s - in org.apache.phoenix.end2end.SysTableNamespaceMappedStatsCollectorIT
[INFO] Tests run: 6, Failures: 0, Errors: 0, Skipped: 0, Time elapsed: 111.323 s - in org.apache.phoenix.end2end.UpdateCacheAcrossDifferentClientsIT
[INFO] Running org.apache.phoenix.end2end.UpgradeIT
[INFO] Tests run: 12, Failures: 0, Errors: 0, Skipped: 0, Time elapsed: 384.889 s - in org.apache.phoenix.end2end.SplitIT
[INFO] Running org.apache.phoenix.end2end.UserDefinedFunctionsIT
[INFO] Running org.apache.phoenix.end2end.index.ImmutableIndexIT
[INFO] Running org.apache.phoenix.end2end.index.GlobalIndexCheckerIT
[INFO] Running org.apache.phoenix.end2end.index.IndexRebuildIncrementDisableCountIT
[INFO] Tests run: 2, Failures: 0, Errors: 0, Skipped: 0, Time elapsed: 16.384 s - in org.apache.phoenix.end2end.index.IndexRebuildIncrementDisableCountIT
[INFO] Tests run: 9, Failures: 0, Errors: 0, Skipped: 0, Time elapsed: 153.366 s - in org.apache.phoenix.end2end.UpgradeIT
[INFO] Running org.apache.phoenix.end2end.index.LocalIndexIT
[INFO] Tests run: 16, Failures: 0, Errors: 0, Skipped: 0, Time elapsed: 181.219 s - in org.apache.phoenix.end2end.UserDefinedFunctionsIT
[INFO] Running org.apache.phoenix.end2end.index.MutableIndexExtendedIT
[INFO] Running org.apache.phoenix.end2end.index.MutableIndexFailureIT
[INFO] Tests run: 9, Failures: 0, Errors: 0, Skipped: 0, Time elapsed: 101.969 s - in org.apache.phoenix.end2end.index.MutableIndexExtendedIT
[INFO] Running org.apache.phoenix.end2end.index.MutableIndexFailureWithNamespaceIT
[INFO] Tests run: 40, Failures: 0, Errors: 0, Skipped: 0, Time elapsed: 425.577 s - in org.apache.phoenix.end2end.index.GlobalIndexCheckerIT
[INFO] Tests run: 11, Failures: 0, Errors: 0, Skipped: 0, Time elapsed: 856.513 s - in org.apache.phoenix.end2end.SystemCatalogCreationOnConnectionIT
[INFO] Running org.apache.phoenix.end2end.index.MutableIndexRebuilderIT
[INFO] Tests run: 14, Failures: 0, Errors: 0, Skipped: 0, Time elapsed: 278.665 s - in org.apache.phoenix.end2end.index.MutableIndexFailureIT
[INFO] Tests run: 8, Failures: 0, Errors: 0, Skipped: 0, Time elapsed: 186.2 s - in org.apache.phoenix.end2end.index.MutableIndexFailureWithNamespaceIT
[INFO] Running org.apache.phoenix.end2end.index.MutableIndexReplicationIT
[INFO] Tests run: 1, Failures: 0, Errors: 0, Skipped: 0, Time elapsed: 84.878 s - in org.apache.phoenix.end2end.index.MutableIndexRebuilderIT
[WARNING] Tests run: 63, Failures: 0, Errors: 0, Skipped: 18, Time elapsed: 556.861 s - in org.apache.phoenix.end2end.index.ImmutableIndexIT
[INFO] Tests run: 1, Failures: 0, Errors: 0, Skipped: 0, Time elapsed: 43.743 s - in org.apache.phoenix.end2end.index.MutableIndexReplicationIT
[INFO] Running org.apache.phoenix.end2end.index.PartialIndexRebuilderIT
[INFO] Running org.apache.phoenix.end2end.index.ShortViewIndexIdIT
[INFO] Running org.apache.phoenix.end2end.index.PhoenixMRJobSubmitterIT
[INFO] Tests run: 1, Failures: 0, Errors: 0, Skipped: 0, Time elapsed: 12.575 s - in org.apache.phoenix.end2end.index.PhoenixMRJobSubmitterIT
[INFO] Tests run: 2, Failures: 0, Errors: 0, Skipped: 0, Time elapsed: 23.655 s - in org.apache.phoenix.end2end.index.ShortViewIndexIdIT
[INFO] Running org.apache.phoenix.end2end.join.HashJoinCacheIT
[INFO] Running org.apache.phoenix.end2end.index.txn.TxWriteFailureIT
[INFO] Tests run: 3, Failures: 0, Errors: 0, Skipped: 0, Time elapsed: 34.186 s - in org.apache.phoenix.end2end.join.HashJoinCacheIT
[INFO] Running org.apache.phoenix.end2end.join.SortMergeJoinNoSpoolingIT
[INFO] Running org.apache.phoenix.execute.PartialCommitIT
[INFO] Tests run: 12, Failures: 0, Errors: 0, Skipped: 0, Time elapsed: 89.045 s - in org.apache.phoenix.end2end.index.txn.TxWriteFailureIT
[INFO] Running org.apache.phoenix.hbase.index.FailForUnsupportedHBaseVersionsIT
[INFO] Tests run: 35, Failures: 0, Errors: 0, Skipped: 0, Time elapsed: 34.748 s - in org.apache.phoenix.end2end.join.SortMergeJoinNoSpoolingIT
[INFO] Running org.apache.phoenix.execute.UpsertSelectOverlappingBatchesIT
[INFO] Tests run: 2, Failures: 0, Errors: 0, Skipped: 0, Time elapsed: 36.44 s - in org.apache.phoenix.hbase.index.FailForUnsupportedHBaseVersionsIT
[INFO] Tests run: 50, Failures: 0, Errors: 0, Skipped: 0, Time elapsed: 680.219 s - in org.apache.phoenix.end2end.index.LocalIndexIT
[INFO] Running org.apache.phoenix.iterate.RoundRobinResultIteratorWithStatsIT
[INFO] Tests run: 1, Failures: 0, Errors: 0, Skipped: 0, Time elapsed: 8.939 s - in org.apache.phoenix.iterate.RoundRobinResultIteratorWithStatsIT
[INFO] Running org.apache.phoenix.iterate.ScannerLeaseRenewalIT
[INFO] Tests run: 3, Failures: 0, Errors: 0, Skipped: 0, Time elapsed: 85.149 s - in org.apache.phoenix.execute.UpsertSelectOverlappingBatchesIT
[INFO] Running org.apache.phoenix.jdbc.SecureUserConnectionsIT
[INFO] Tests run: 8, Failures: 0, Errors: 0, Skipped: 0, Time elapsed: 6.736 s - in org.apache.phoenix.jdbc.SecureUserConnectionsIT
[INFO] Tests run: 12, Failures: 0, Errors: 0, Skipped: 0, Time elapsed: 141.708 s - in org.apache.phoenix.execute.PartialCommitIT
[INFO] Tests run: 20, Failures: 0, Errors: 0, Skipped: 0, Time elapsed: 275.219 s - in org.apache.phoenix.end2end.index.PartialIndexRebuilderIT
[INFO] Running org.apache.phoenix.tool.ParameterizedPhoenixCanaryToolIT
[INFO] Running org.apache.phoenix.monitoring.PhoenixLoggingMetricsIT
[INFO] Running org.apache.phoenix.monitoring.PhoenixMetricsIT
[INFO] Running org.apache.phoenix.rpc.PhoenixServerRpcIT
[INFO] Running org.apache.phoenix.rpc.PhoenixClientRpcIT
[INFO] Tests run: 2, Failures: 0, Errors: 0, Skipped: 0, Time elapsed: 7.694 s - in org.apache.phoenix.rpc.PhoenixClientRpcIT
[INFO] Tests run: 2, Failures: 0, Errors: 0, Skipped: 0, Time elapsed: 10.999 s - in org.apache.phoenix.rpc.PhoenixServerRpcIT
[INFO] Tests run: 4, Failures: 0, Errors: 0, Skipped: 0, Time elapsed: 43.394 s - in org.apache.phoenix.monitoring.PhoenixLoggingMetricsIT
[INFO] Tests run: 8, Failures: 0, Errors: 0, Skipped: 0, Time elapsed: 2,020.232 s - in org.apache.phoenix.end2end.ParameterizedIndexUpgradeToolIT
[INFO] Tests run: 2, Failures: 0, Errors: 0, Skipped: 0, Time elapsed: 167.399 s - in org.apache.phoenix.iterate.ScannerLeaseRenewalIT
[INFO] Tests run: 8, Failures: 0, Errors: 0, Skipped: 0, Time elapsed: 122.235 s - in org.apache.phoenix.tool.ParameterizedPhoenixCanaryToolIT
[INFO] Running org.apache.phoenix.util.CoprocessorHConnectionTableFactoryIT
[INFO] Tests run: 22, Failures: 0, Errors: 0, Skipped: 0, Time elapsed: 114.206 s - in org.apache.phoenix.monitoring.PhoenixMetricsIT
[INFO] Tests run: 1, Failures: 0, Errors: 0, Skipped: 0, Time elapsed: 13.483 s - in org.apache.phoenix.util.CoprocessorHConnectionTableFactoryIT
[INFO]
[INFO] Results:
[INFO]
[ERROR] Errors:
[ERROR] SequencePointInTimeIT.doSetup:57->BaseTest.setUpTestDriver:515->BaseTest.setUpTestDriver:520->BaseTest.checkClusterInitialized:434->BaseTest.setUpTestCluster:448->BaseTest.initMiniCluster:549 » Runtime
[INFO]
[ERROR] Tests run: 1111, Failures: 0, Errors: 1, Skipped: 58
[INFO]
[INFO]
[INFO] --- maven-failsafe-plugin:2.22.0:integration-test (SplitSystemCatalogTests) @ phoenix-core ---
[INFO]
[INFO] -------------------------------------------------------
[INFO] T E S T S
[INFO] -------------------------------------------------------
[INFO] Running org.apache.phoenix.end2end.AlterMultiTenantTableWithViewsIT
[INFO] Running org.apache.phoenix.end2end.AlterTableWithViewsIT
[INFO] Running org.apache.phoenix.end2end.DropTableWithViewsIT
[INFO] Running org.apache.phoenix.end2end.DropIndexedColsIT
[INFO] Tests run: 4, Failures: 0, Errors: 0, Skipped: 0, Time elapsed: 37.537 s - in org.apache.phoenix.end2end.DropTableWithViewsIT
[INFO] Tests run: 4, Failures: 0, Errors: 0, Skipped: 0, Time elapsed: 49.059 s - in org.apache.phoenix.end2end.DropIndexedColsIT
[INFO] Running org.apache.phoenix.end2end.TenantSpecificViewIndexSaltedIT
[INFO] Running org.apache.phoenix.end2end.TenantSpecificViewIndexIT
[INFO] Tests run: 9, Failures: 0, Errors: 0, Skipped: 0, Time elapsed: 106.836 s - in org.apache.phoenix.end2end.AlterMultiTenantTableWithViewsIT
[INFO] Running org.apache.phoenix.end2end.ViewIT
[INFO] Tests run: 4, Failures: 0, Errors: 0, Skipped: 0, Time elapsed: 56.874 s - in org.apache.phoenix.end2end.TenantSpecificViewIndexSaltedIT
[INFO] Tests run: 10, Failures: 0, Errors: 0, Skipped: 0, Time elapsed: 110.934 s - in org.apache.phoenix.end2end.TenantSpecificViewIndexIT
[INFO] Running org.apache.phoenix.end2end.ViewMetadataIT
[INFO] Running org.apache.phoenix.end2end.index.ViewIndexIT
[INFO] Tests run: 56, Failures: 0, Errors: 0, Skipped: 0, Time elapsed: 375.724 s - in org.apache.phoenix.end2end.AlterTableWithViewsIT
[WARNING] Tests run: 24, Failures: 0, Errors: 0, Skipped: 2, Time elapsed: 177.967 s - in org.apache.phoenix.end2end.index.ViewIndexIT
[INFO] Tests run: 85, Failures: 0, Errors: 0, Skipped: 0, Time elapsed: 379.022 s - in org.apache.phoenix.end2end.ViewIT
[INFO] Tests run: 22, Failures: 0, Errors: 0, Skipped: 0, Time elapsed: 274.241 s - in org.apache.phoenix.end2end.ViewMetadataIT
[INFO]
[INFO] Results:
[INFO]
[WARNING] Tests run: 218, Failures: 0, Errors: 0, Skipped: 2
[INFO]
[INFO]
[INFO] --- maven-failsafe-plugin:2.22.0:verify (ParallelStatsEnabledTest) @ phoenix-core ---
[INFO] ------------------------------------------------------------------------
[INFO] Reactor Summary for Apache Phoenix 4.16.0-HBase-1.3-SNAPSHOT:
[INFO]
[INFO] Apache Phoenix ..................................... SUCCESS [ 3.564 s]
[INFO] Phoenix Core ....................................... FAILURE [ 02:37 h]
[INFO] Phoenix - Pherf .................................... SKIPPED
[INFO] Phoenix Client ..................................... SKIPPED
[INFO] Phoenix Server ..................................... SKIPPED
[INFO] Phoenix Assembly ................................... SKIPPED
[INFO] Phoenix - Tracing Web Application .................. SKIPPED
[INFO] ------------------------------------------------------------------------
[INFO] BUILD FAILURE
[INFO] ------------------------------------------------------------------------
[INFO] Total time: 02:37 h
[INFO] Finished at: 2020-02-25T05:11:50Z
[INFO] ------------------------------------------------------------------------
[ERROR] Failed to execute goal org.apache.maven.plugins:maven-failsafe-plugin:2.22.0:verify (ParallelStatsEnabledTest) on project phoenix-core: There are test failures.
[ERROR]
[ERROR] Please refer to <https://builds.apache.org/job/Phoenix-4.x-HBase-1.3/ws/phoenix-core/target/failsafe-reports> for the individual test results.
[ERROR] Please refer to dump files (if any exist) [date]-jvmRun[N].dump, [date].dumpstream and [date]-jvmRun[N].dumpstream.
[ERROR] -> [Help 1]
[ERROR]
[ERROR] To see the full stack trace of the errors, re-run Maven with the -e switch.
[ERROR] Re-run Maven using the -X switch to enable full debug logging.
[ERROR]
[ERROR] For more information about the errors and possible solutions, please read the following articles:
[ERROR] [Help 1] http://cwiki.apache.org/confluence/display/MAVEN/MojoFailureException
[ERROR]
[ERROR] After correcting the problems, you can resume the build with the command
[ERROR] mvn <args> -rf :phoenix-core
Build step 'Invoke top-level Maven targets' marked build as failure
[JIRA] Updating issue PHOENIX-5737
Recording test results