You are viewing a plain text version of this content. The canonical link for it is here.
Posted to dev@kafka.apache.org by Apache Jenkins Server <je...@builds.apache.org> on 2019/02/09 02:00:30 UTC

Build failed in Jenkins: kafka-2.1-jdk8 #125

See <https://builds.apache.org/job/kafka-2.1-jdk8/125/display/redirect?page=changes>

Changes:

[cmccabe] MINOR: release.py: fix some compatibility problems.

------------------------------------------
[...truncated 2.84 MB...]

org.apache.kafka.connect.runtime.standalone.StandaloneHerderTest > testCreateConnectorFailedCustomValidation PASSED

org.apache.kafka.connect.runtime.standalone.StandaloneHerderTest > testCreateConnectorAlreadyExists STARTED

org.apache.kafka.connect.runtime.standalone.StandaloneHerderTest > testCreateConnectorAlreadyExists PASSED

org.apache.kafka.connect.runtime.standalone.StandaloneHerderTest > testDestroyConnector STARTED

org.apache.kafka.connect.runtime.standalone.StandaloneHerderTest > testDestroyConnector PASSED

org.apache.kafka.connect.runtime.standalone.StandaloneHerderTest > testRestartConnector STARTED

org.apache.kafka.connect.runtime.standalone.StandaloneHerderTest > testRestartConnector PASSED

org.apache.kafka.connect.runtime.standalone.StandaloneHerderTest > testRestartTask STARTED

org.apache.kafka.connect.runtime.standalone.StandaloneHerderTest > testRestartTask PASSED

org.apache.kafka.connect.runtime.standalone.StandaloneHerderTest > testAccessors STARTED

org.apache.kafka.connect.runtime.standalone.StandaloneHerderTest > testAccessors PASSED

org.apache.kafka.connect.runtime.standalone.StandaloneHerderTest > testCreateConnectorFailedBasicValidation STARTED

org.apache.kafka.connect.runtime.standalone.StandaloneHerderTest > testCreateConnectorFailedBasicValidation PASSED

org.apache.kafka.connect.runtime.WorkerTest > testStartAndStopConnector STARTED

org.apache.kafka.connect.runtime.WorkerTest > testStartAndStopConnector PASSED

org.apache.kafka.connect.runtime.WorkerTest > testStartConnectorFailure STARTED

org.apache.kafka.connect.runtime.WorkerTest > testStartConnectorFailure PASSED

org.apache.kafka.connect.runtime.WorkerTest > testAddConnectorByAlias STARTED

org.apache.kafka.connect.runtime.WorkerTest > testAddConnectorByAlias PASSED

org.apache.kafka.connect.runtime.WorkerTest > testAddConnectorByShortAlias STARTED

org.apache.kafka.connect.runtime.WorkerTest > testAddConnectorByShortAlias PASSED

org.apache.kafka.connect.runtime.WorkerTest > testStopInvalidConnector STARTED

org.apache.kafka.connect.runtime.WorkerTest > testStopInvalidConnector PASSED

org.apache.kafka.connect.runtime.WorkerTest > testReconfigureConnectorTasks STARTED

org.apache.kafka.connect.runtime.WorkerTest > testReconfigureConnectorTasks PASSED

org.apache.kafka.connect.runtime.WorkerTest > testAddRemoveTask STARTED

org.apache.kafka.connect.runtime.WorkerTest > testAddRemoveTask PASSED

org.apache.kafka.connect.runtime.WorkerTest > testStartTaskFailure STARTED

org.apache.kafka.connect.runtime.WorkerTest > testStartTaskFailure PASSED

org.apache.kafka.connect.runtime.WorkerTest > testCleanupTasksOnStop STARTED

org.apache.kafka.connect.runtime.WorkerTest > testCleanupTasksOnStop PASSED

org.apache.kafka.connect.runtime.WorkerTest > testConverterOverrides STARTED

org.apache.kafka.connect.runtime.WorkerTest > testConverterOverrides PASSED

org.apache.kafka.connect.runtime.isolation.PluginDescTest > testPluginDescWithNullVersion STARTED

org.apache.kafka.connect.runtime.isolation.PluginDescTest > testPluginDescWithNullVersion PASSED

org.apache.kafka.connect.runtime.isolation.PluginDescTest > testPluginDescComparison STARTED

org.apache.kafka.connect.runtime.isolation.PluginDescTest > testPluginDescComparison PASSED

org.apache.kafka.connect.runtime.isolation.PluginDescTest > testRegularPluginDesc STARTED

org.apache.kafka.connect.runtime.isolation.PluginDescTest > testRegularPluginDesc PASSED

org.apache.kafka.connect.runtime.isolation.PluginDescTest > testPluginDescEquality STARTED

org.apache.kafka.connect.runtime.isolation.PluginDescTest > testPluginDescEquality PASSED

org.apache.kafka.connect.runtime.isolation.PluginDescTest > testPluginDescWithSystemClassLoader STARTED

org.apache.kafka.connect.runtime.isolation.PluginDescTest > testPluginDescWithSystemClassLoader PASSED

org.apache.kafka.connect.runtime.isolation.DelegatingClassLoaderTest > testWhiteListedManifestResources STARTED

org.apache.kafka.connect.runtime.isolation.DelegatingClassLoaderTest > testWhiteListedManifestResources PASSED

org.apache.kafka.connect.runtime.isolation.DelegatingClassLoaderTest > testOtherResources STARTED

org.apache.kafka.connect.runtime.isolation.DelegatingClassLoaderTest > testOtherResources PASSED

org.apache.kafka.connect.runtime.isolation.PluginsTest > shouldInstantiateAndConfigureConnectRestExtension STARTED

org.apache.kafka.connect.runtime.isolation.PluginsTest > shouldInstantiateAndConfigureConnectRestExtension PASSED

org.apache.kafka.connect.runtime.isolation.PluginsTest > shouldInstantiateAndConfigureConverters STARTED

org.apache.kafka.connect.runtime.isolation.PluginsTest > shouldInstantiateAndConfigureConverters PASSED

org.apache.kafka.connect.runtime.isolation.PluginsTest > shouldInstantiateAndConfigureInternalConverters STARTED

org.apache.kafka.connect.runtime.isolation.PluginsTest > shouldInstantiateAndConfigureInternalConverters PASSED

org.apache.kafka.connect.runtime.isolation.PluginsTest > shouldInstantiateAndConfigureDefaultHeaderConverter STARTED

org.apache.kafka.connect.runtime.isolation.PluginsTest > shouldInstantiateAndConfigureDefaultHeaderConverter PASSED

org.apache.kafka.connect.runtime.isolation.PluginsTest > shouldInstantiateAndConfigureExplicitlySetHeaderConverterWithCurrentClassLoader STARTED

org.apache.kafka.connect.runtime.isolation.PluginsTest > shouldInstantiateAndConfigureExplicitlySetHeaderConverterWithCurrentClassLoader PASSED

org.apache.kafka.connect.runtime.isolation.PluginUtilsTest > testPluginUrlsWithRelativeSymlinkForwards STARTED

org.apache.kafka.connect.runtime.isolation.PluginUtilsTest > testPluginUrlsWithRelativeSymlinkForwards PASSED

org.apache.kafka.connect.runtime.isolation.PluginUtilsTest > testOrderOfPluginUrlsWithJars STARTED

org.apache.kafka.connect.runtime.isolation.PluginUtilsTest > testOrderOfPluginUrlsWithJars PASSED

org.apache.kafka.connect.runtime.isolation.PluginUtilsTest > testPluginUrlsWithClasses STARTED

org.apache.kafka.connect.runtime.isolation.PluginUtilsTest > testPluginUrlsWithClasses PASSED

org.apache.kafka.connect.runtime.isolation.PluginUtilsTest > testConnectFrameworkClasses STARTED

org.apache.kafka.connect.runtime.isolation.PluginUtilsTest > testConnectFrameworkClasses PASSED

org.apache.kafka.connect.runtime.isolation.PluginUtilsTest > testThirdPartyClasses STARTED

org.apache.kafka.connect.runtime.isolation.PluginUtilsTest > testThirdPartyClasses PASSED

org.apache.kafka.connect.runtime.isolation.PluginUtilsTest > testClientConfigProvider STARTED

org.apache.kafka.connect.runtime.isolation.PluginUtilsTest > testClientConfigProvider PASSED

org.apache.kafka.connect.runtime.isolation.PluginUtilsTest > testAllowedConnectFrameworkClasses STARTED

org.apache.kafka.connect.runtime.isolation.PluginUtilsTest > testAllowedConnectFrameworkClasses PASSED

org.apache.kafka.connect.runtime.isolation.PluginUtilsTest > testJavaLibraryClasses STARTED

org.apache.kafka.connect.runtime.isolation.PluginUtilsTest > testJavaLibraryClasses PASSED

org.apache.kafka.connect.runtime.isolation.PluginUtilsTest > testEmptyPluginUrls STARTED

org.apache.kafka.connect.runtime.isolation.PluginUtilsTest > testEmptyPluginUrls PASSED

org.apache.kafka.connect.runtime.isolation.PluginUtilsTest > testPluginUrlsWithJars STARTED

org.apache.kafka.connect.runtime.isolation.PluginUtilsTest > testPluginUrlsWithJars PASSED

org.apache.kafka.connect.runtime.isolation.PluginUtilsTest > testPluginUrlsWithZips STARTED

org.apache.kafka.connect.runtime.isolation.PluginUtilsTest > testPluginUrlsWithZips PASSED

org.apache.kafka.connect.runtime.isolation.PluginUtilsTest > testPluginUrlsWithRelativeSymlinkBackwards STARTED

org.apache.kafka.connect.runtime.isolation.PluginUtilsTest > testPluginUrlsWithRelativeSymlinkBackwards PASSED

org.apache.kafka.connect.runtime.isolation.PluginUtilsTest > testPluginUrlsWithAbsoluteSymlink STARTED

org.apache.kafka.connect.runtime.isolation.PluginUtilsTest > testPluginUrlsWithAbsoluteSymlink PASSED

org.apache.kafka.connect.runtime.isolation.PluginUtilsTest > testEmptyStructurePluginUrls STARTED

org.apache.kafka.connect.runtime.isolation.PluginUtilsTest > testEmptyStructurePluginUrls PASSED

org.apache.kafka.connect.runtime.TransformationConfigTest > testEmbeddedConfigCast STARTED

org.apache.kafka.connect.runtime.TransformationConfigTest > testEmbeddedConfigCast PASSED

org.apache.kafka.connect.runtime.TransformationConfigTest > testEmbeddedConfigRegexRouter STARTED

org.apache.kafka.connect.runtime.TransformationConfigTest > testEmbeddedConfigRegexRouter PASSED

org.apache.kafka.connect.runtime.TransformationConfigTest > testEmbeddedConfigSetSchemaMetadata STARTED

org.apache.kafka.connect.runtime.TransformationConfigTest > testEmbeddedConfigSetSchemaMetadata PASSED

org.apache.kafka.connect.runtime.TransformationConfigTest > testEmbeddedConfigTimestampConverter STARTED

org.apache.kafka.connect.runtime.TransformationConfigTest > testEmbeddedConfigTimestampConverter PASSED

org.apache.kafka.connect.runtime.TransformationConfigTest > testEmbeddedConfigHoistField STARTED

org.apache.kafka.connect.runtime.TransformationConfigTest > testEmbeddedConfigHoistField PASSED

org.apache.kafka.connect.runtime.TransformationConfigTest > testEmbeddedConfigMaskField STARTED

org.apache.kafka.connect.runtime.TransformationConfigTest > testEmbeddedConfigMaskField PASSED

org.apache.kafka.connect.runtime.TransformationConfigTest > testEmbeddedConfigInsertField STARTED

org.apache.kafka.connect.runtime.TransformationConfigTest > testEmbeddedConfigInsertField PASSED

org.apache.kafka.connect.runtime.TransformationConfigTest > testEmbeddedConfigFlatten STARTED

org.apache.kafka.connect.runtime.TransformationConfigTest > testEmbeddedConfigFlatten PASSED

org.apache.kafka.connect.runtime.TransformationConfigTest > testEmbeddedConfigReplaceField STARTED

org.apache.kafka.connect.runtime.TransformationConfigTest > testEmbeddedConfigReplaceField PASSED

org.apache.kafka.connect.runtime.TransformationConfigTest > testEmbeddedConfigTimestampRouter STARTED

org.apache.kafka.connect.runtime.TransformationConfigTest > testEmbeddedConfigTimestampRouter PASSED

org.apache.kafka.connect.runtime.TransformationConfigTest > testEmbeddedConfigValueToKey STARTED

org.apache.kafka.connect.runtime.TransformationConfigTest > testEmbeddedConfigValueToKey PASSED

org.apache.kafka.connect.runtime.TransformationConfigTest > testEmbeddedConfigExtractField STARTED

org.apache.kafka.connect.runtime.TransformationConfigTest > testEmbeddedConfigExtractField PASSED

380 tests completed, 1 failed

> Task :connect:runtime:test FAILED

FAILURE: Build failed with an exception.

* What went wrong:
Execution failed for task ':connect:runtime:test'.
> There were failing tests. See the report at: file://<https://builds.apache.org/job/kafka-2.1-jdk8/ws/connect/runtime/build/reports/tests/test/index.html>

* Try:
Run with --stacktrace option to get the stack trace. Run with --info or --debug option to get more log output. Run with --scan to get full insights.

* Get more help at https://help.gradle.org

BUILD FAILED in 4h 6m 30s
135 actionable tasks: 99 executed, 36 up-to-date
Build step 'Execute shell' marked build as failure
[FINDBUGS] Collecting findbugs analysis files...
Setting GRADLE_4_8_1_HOME=/home/jenkins/tools/gradle/4.8.1
[FINDBUGS] Searching for all files in <https://builds.apache.org/job/kafka-2.1-jdk8/ws/> that match the pattern **/build/reports/findbugs/*.xml
[FINDBUGS] No files found. Configuration error?
Setting GRADLE_4_8_1_HOME=/home/jenkins/tools/gradle/4.8.1
Setting GRADLE_4_8_1_HOME=/home/jenkins/tools/gradle/4.8.1
<Git Blamer> Using GitBlamer to create author and commit information for all warnings.
<Git Blamer> GIT_COMMIT=70974fff637e1765e8ce43a0d9884f6ea1e2ec96, workspace=<https://builds.apache.org/job/kafka-2.1-jdk8/ws/>
[FINDBUGS] Computing warning deltas based on reference build #123
Recording test results
Setting GRADLE_4_8_1_HOME=/home/jenkins/tools/gradle/4.8.1
Setting GRADLE_4_8_1_HOME=/home/jenkins/tools/gradle/4.8.1

Jenkins build is back to normal : kafka-2.1-jdk8 #129

Posted by Apache Jenkins Server <je...@builds.apache.org>.
See <https://builds.apache.org/job/kafka-2.1-jdk8/129/display/redirect?page=changes>


Build failed in Jenkins: kafka-2.1-jdk8 #128

Posted by Apache Jenkins Server <je...@builds.apache.org>.
See <https://builds.apache.org/job/kafka-2.1-jdk8/128/display/redirect?page=changes>

Changes:

[cmccabe] Bump version to 2.1.1

[cmccabe] Update versions to 2.1.2-SNAPSHOT

------------------------------------------
[...truncated 1.06 MB...]
org.apache.kafka.connect.runtime.rest.resources.ConnectorsResourceTest > testListConnectorsNotLeader PASSED

org.apache.kafka.connect.runtime.rest.resources.ConnectorsResourceTest > testListConnectorsNotSynced STARTED

org.apache.kafka.connect.runtime.rest.resources.ConnectorsResourceTest > testListConnectorsNotSynced PASSED

org.apache.kafka.connect.runtime.rest.resources.ConnectorsResourceTest > testCreateConnectorNotLeader STARTED

org.apache.kafka.connect.runtime.rest.resources.ConnectorsResourceTest > testCreateConnectorNotLeader PASSED

org.apache.kafka.connect.runtime.rest.resources.ConnectorsResourceTest > testCreateConnectorExists STARTED

org.apache.kafka.connect.runtime.rest.resources.ConnectorsResourceTest > testCreateConnectorExists PASSED

org.apache.kafka.connect.runtime.rest.resources.ConnectorsResourceTest > testCreateConnectorNameTrimWhitespaces STARTED

org.apache.kafka.connect.runtime.rest.resources.ConnectorsResourceTest > testCreateConnectorNameTrimWhitespaces PASSED

org.apache.kafka.connect.runtime.rest.resources.ConnectorsResourceTest > testCreateConnectorNameAllWhitespaces STARTED

org.apache.kafka.connect.runtime.rest.resources.ConnectorsResourceTest > testCreateConnectorNameAllWhitespaces PASSED

org.apache.kafka.connect.runtime.rest.resources.ConnectorsResourceTest > testCreateConnectorNoName STARTED

org.apache.kafka.connect.runtime.rest.resources.ConnectorsResourceTest > testCreateConnectorNoName PASSED

org.apache.kafka.connect.runtime.rest.resources.ConnectorsResourceTest > testDeleteConnector STARTED

org.apache.kafka.connect.runtime.rest.resources.ConnectorsResourceTest > testDeleteConnector PASSED

org.apache.kafka.connect.runtime.rest.resources.ConnectorsResourceTest > testDeleteConnectorNotLeader STARTED

org.apache.kafka.connect.runtime.rest.resources.ConnectorsResourceTest > testDeleteConnectorNotLeader PASSED

org.apache.kafka.connect.runtime.rest.resources.ConnectorsResourceTest > testDeleteConnectorNotFound STARTED

org.apache.kafka.connect.runtime.rest.resources.ConnectorsResourceTest > testDeleteConnectorNotFound PASSED

org.apache.kafka.connect.runtime.rest.resources.ConnectorsResourceTest > testGetConnector STARTED

org.apache.kafka.connect.runtime.rest.resources.ConnectorsResourceTest > testGetConnector PASSED

org.apache.kafka.connect.runtime.rest.resources.ConnectorsResourceTest > testCreateConnector STARTED

org.apache.kafka.connect.runtime.rest.resources.ConnectorsResourceTest > testCreateConnector PASSED

org.apache.kafka.connect.runtime.rest.resources.RootResourceTest > testRootGet STARTED

org.apache.kafka.connect.runtime.rest.resources.RootResourceTest > testRootGet PASSED

org.apache.kafka.connect.runtime.isolation.DelegatingClassLoaderTest > testWhiteListedManifestResources STARTED

org.apache.kafka.connect.runtime.isolation.DelegatingClassLoaderTest > testWhiteListedManifestResources PASSED

org.apache.kafka.connect.runtime.isolation.DelegatingClassLoaderTest > testOtherResources STARTED

org.apache.kafka.connect.runtime.isolation.DelegatingClassLoaderTest > testOtherResources PASSED

org.apache.kafka.connect.runtime.isolation.PluginDescTest > testPluginDescWithNullVersion STARTED

org.apache.kafka.connect.runtime.isolation.PluginDescTest > testPluginDescWithNullVersion PASSED

org.apache.kafka.connect.runtime.isolation.PluginDescTest > testPluginDescComparison STARTED

org.apache.kafka.connect.runtime.isolation.PluginDescTest > testPluginDescComparison PASSED

org.apache.kafka.connect.runtime.isolation.PluginDescTest > testRegularPluginDesc STARTED

org.apache.kafka.connect.runtime.isolation.PluginDescTest > testRegularPluginDesc PASSED

org.apache.kafka.connect.runtime.isolation.PluginDescTest > testPluginDescEquality STARTED

org.apache.kafka.connect.runtime.isolation.PluginDescTest > testPluginDescEquality PASSED

org.apache.kafka.connect.runtime.isolation.PluginDescTest > testPluginDescWithSystemClassLoader STARTED

org.apache.kafka.connect.runtime.isolation.PluginDescTest > testPluginDescWithSystemClassLoader PASSED

org.apache.kafka.connect.runtime.isolation.PluginsTest > shouldInstantiateAndConfigureConnectRestExtension STARTED

org.apache.kafka.connect.runtime.isolation.PluginsTest > shouldInstantiateAndConfigureConnectRestExtension PASSED

org.apache.kafka.connect.runtime.isolation.PluginsTest > shouldInstantiateAndConfigureConverters STARTED

org.apache.kafka.connect.runtime.isolation.PluginsTest > shouldInstantiateAndConfigureConverters PASSED

org.apache.kafka.connect.runtime.isolation.PluginsTest > shouldInstantiateAndConfigureInternalConverters STARTED

org.apache.kafka.connect.runtime.isolation.PluginsTest > shouldInstantiateAndConfigureInternalConverters PASSED

org.apache.kafka.connect.runtime.isolation.PluginsTest > shouldInstantiateAndConfigureDefaultHeaderConverter STARTED

org.apache.kafka.connect.runtime.isolation.PluginsTest > shouldInstantiateAndConfigureDefaultHeaderConverter PASSED

org.apache.kafka.connect.runtime.isolation.PluginsTest > shouldInstantiateAndConfigureExplicitlySetHeaderConverterWithCurrentClassLoader STARTED

org.apache.kafka.connect.runtime.isolation.PluginsTest > shouldInstantiateAndConfigureExplicitlySetHeaderConverterWithCurrentClassLoader PASSED

org.apache.kafka.connect.runtime.isolation.PluginUtilsTest > testPluginUrlsWithRelativeSymlinkForwards STARTED

org.apache.kafka.connect.runtime.isolation.PluginUtilsTest > testPluginUrlsWithRelativeSymlinkForwards PASSED

org.apache.kafka.connect.runtime.isolation.PluginUtilsTest > testOrderOfPluginUrlsWithJars STARTED

org.apache.kafka.connect.runtime.isolation.PluginUtilsTest > testOrderOfPluginUrlsWithJars PASSED

org.apache.kafka.connect.runtime.isolation.PluginUtilsTest > testPluginUrlsWithClasses STARTED

org.apache.kafka.connect.runtime.isolation.PluginUtilsTest > testPluginUrlsWithClasses PASSED

org.apache.kafka.connect.runtime.isolation.PluginUtilsTest > testConnectFrameworkClasses STARTED

org.apache.kafka.connect.runtime.isolation.PluginUtilsTest > testConnectFrameworkClasses PASSED

org.apache.kafka.connect.runtime.isolation.PluginUtilsTest > testThirdPartyClasses STARTED

org.apache.kafka.connect.runtime.isolation.PluginUtilsTest > testThirdPartyClasses PASSED

org.apache.kafka.connect.runtime.isolation.PluginUtilsTest > testClientConfigProvider STARTED

org.apache.kafka.connect.runtime.isolation.PluginUtilsTest > testClientConfigProvider PASSED

org.apache.kafka.connect.runtime.isolation.PluginUtilsTest > testAllowedConnectFrameworkClasses STARTED

org.apache.kafka.connect.runtime.isolation.PluginUtilsTest > testAllowedConnectFrameworkClasses PASSED

org.apache.kafka.connect.runtime.isolation.PluginUtilsTest > testJavaLibraryClasses STARTED

org.apache.kafka.connect.runtime.isolation.PluginUtilsTest > testJavaLibraryClasses PASSED

org.apache.kafka.connect.runtime.isolation.PluginUtilsTest > testEmptyPluginUrls STARTED

org.apache.kafka.connect.runtime.isolation.PluginUtilsTest > testEmptyPluginUrls PASSED

org.apache.kafka.connect.runtime.isolation.PluginUtilsTest > testPluginUrlsWithJars STARTED

org.apache.kafka.connect.runtime.isolation.PluginUtilsTest > testPluginUrlsWithJars PASSED

org.apache.kafka.connect.runtime.isolation.PluginUtilsTest > testPluginUrlsWithZips STARTED

org.apache.kafka.connect.runtime.isolation.PluginUtilsTest > testPluginUrlsWithZips PASSED

org.apache.kafka.connect.runtime.isolation.PluginUtilsTest > testPluginUrlsWithRelativeSymlinkBackwards STARTED

org.apache.kafka.connect.runtime.isolation.PluginUtilsTest > testPluginUrlsWithRelativeSymlinkBackwards PASSED

org.apache.kafka.connect.runtime.isolation.PluginUtilsTest > testPluginUrlsWithAbsoluteSymlink STARTED

org.apache.kafka.connect.runtime.isolation.PluginUtilsTest > testPluginUrlsWithAbsoluteSymlink PASSED

org.apache.kafka.connect.runtime.isolation.PluginUtilsTest > testEmptyStructurePluginUrls STARTED

org.apache.kafka.connect.runtime.isolation.PluginUtilsTest > testEmptyStructurePluginUrls PASSED

org.apache.kafka.connect.runtime.WorkerSinkTaskTest > testStartPaused STARTED

org.apache.kafka.connect.runtime.WorkerSinkTaskTest > testStartPaused PASSED

org.apache.kafka.connect.runtime.WorkerSinkTaskTest > testPause STARTED

org.apache.kafka.connect.runtime.WorkerSinkTaskTest > testPause PASSED

org.apache.kafka.connect.runtime.WorkerSinkTaskTest > testMetricsGroup STARTED

org.apache.kafka.connect.runtime.WorkerSinkTaskTest > testMetricsGroup PASSED

org.apache.kafka.connect.runtime.WorkerSinkTaskTest > testTopicsRegex STARTED

org.apache.kafka.connect.runtime.WorkerSinkTaskTest > testTopicsRegex PASSED

org.apache.kafka.connect.runtime.WorkerSinkTaskTest > testCommitWithOutOfOrderCallback STARTED

org.apache.kafka.connect.runtime.WorkerSinkTaskTest > testCommitWithOutOfOrderCallback PASSED

org.apache.kafka.connect.runtime.WorkerSinkTaskTest > testPollRedelivery STARTED

org.apache.kafka.connect.runtime.WorkerSinkTaskTest > testPollRedelivery PASSED

org.apache.kafka.connect.runtime.WorkerSinkTaskTest > testErrorInRebalancePartitionAssignment STARTED

org.apache.kafka.connect.runtime.WorkerSinkTaskTest > testErrorInRebalancePartitionAssignment PASSED

org.apache.kafka.connect.runtime.WorkerSinkTaskTest > testDeliveryWithMutatingTransform STARTED

org.apache.kafka.connect.runtime.WorkerSinkTaskTest > testDeliveryWithMutatingTransform PASSED

org.apache.kafka.connect.runtime.WorkerSinkTaskTest > testMissingTimestampPropagation STARTED

org.apache.kafka.connect.runtime.WorkerSinkTaskTest > testMissingTimestampPropagation PASSED

org.apache.kafka.connect.runtime.WorkerSinkTaskTest > testTimestampPropagation STARTED

org.apache.kafka.connect.runtime.WorkerSinkTaskTest > testTimestampPropagation PASSED

org.apache.kafka.connect.runtime.WorkerSinkTaskTest > testPreCommit STARTED

org.apache.kafka.connect.runtime.WorkerSinkTaskTest > testPreCommit PASSED

org.apache.kafka.connect.runtime.WorkerSinkTaskTest > testIgnoredCommit STARTED

org.apache.kafka.connect.runtime.WorkerSinkTaskTest > testIgnoredCommit PASSED

org.apache.kafka.connect.runtime.WorkerSinkTaskTest > testLongRunningCommitWithoutTimeout STARTED

org.apache.kafka.connect.runtime.WorkerSinkTaskTest > testLongRunningCommitWithoutTimeout PASSED

org.apache.kafka.connect.runtime.WorkerSinkTaskTest > testWakeupInCommitSyncCausesRetry STARTED

org.apache.kafka.connect.runtime.WorkerSinkTaskTest > testWakeupInCommitSyncCausesRetry PASSED

org.apache.kafka.connect.runtime.WorkerSinkTaskTest > testRequestCommit STARTED

org.apache.kafka.connect.runtime.WorkerSinkTaskTest > testRequestCommit PASSED

org.apache.kafka.connect.runtime.WorkerSinkTaskTest > testErrorInRebalancePartitionRevocation STARTED

org.apache.kafka.connect.runtime.WorkerSinkTaskTest > testErrorInRebalancePartitionRevocation PASSED

380 tests completed, 1 failed

> Task :connect:runtime:test FAILED

FAILURE: Build failed with an exception.

* What went wrong:
Execution failed for task ':connect:runtime:test'.
> There were failing tests. See the report at: file://<https://builds.apache.org/job/kafka-2.1-jdk8/ws/connect/runtime/build/reports/tests/test/index.html>

* Try:
Run with --stacktrace option to get the stack trace. Run with --info or --debug option to get more log output. Run with --scan to get full insights.

* Get more help at https://help.gradle.org

BUILD FAILED in 3h 52m 3s
127 actionable tasks: 99 executed, 28 up-to-date
Build step 'Execute shell' marked build as failure
[FINDBUGS] Collecting findbugs analysis files...
Setting GRADLE_4_8_1_HOME=/home/jenkins/tools/gradle/4.8.1
[FINDBUGS] Searching for all files in <https://builds.apache.org/job/kafka-2.1-jdk8/ws/> that match the pattern **/build/reports/findbugs/*.xml
[FINDBUGS] No files found. Configuration error?
Setting GRADLE_4_8_1_HOME=/home/jenkins/tools/gradle/4.8.1
Setting GRADLE_4_8_1_HOME=/home/jenkins/tools/gradle/4.8.1
<Git Blamer> Using GitBlamer to create author and commit information for all warnings.
<Git Blamer> GIT_COMMIT=9729a34f5050d6365ab0493bb7356a8757e97818, workspace=<https://builds.apache.org/job/kafka-2.1-jdk8/ws/>
[FINDBUGS] Computing warning deltas based on reference build #123
Recording test results
Setting GRADLE_4_8_1_HOME=/home/jenkins/tools/gradle/4.8.1
Setting GRADLE_4_8_1_HOME=/home/jenkins/tools/gradle/4.8.1
Not sending mail to unregistered user wangguoz@gmail.com

Build failed in Jenkins: kafka-2.1-jdk8 #127

Posted by Apache Jenkins Server <je...@builds.apache.org>.
See <https://builds.apache.org/job/kafka-2.1-jdk8/127/display/redirect?page=changes>

Changes:

[jason] MINOR: Make MockClient#poll() more thread-safe (#5942)

------------------------------------------
[...truncated 2.84 MB...]
org.apache.kafka.connect.runtime.standalone.StandaloneHerderTest > testRestartConnector PASSED

org.apache.kafka.connect.runtime.standalone.StandaloneHerderTest > testRestartTask STARTED

org.apache.kafka.connect.runtime.standalone.StandaloneHerderTest > testRestartTask PASSED

org.apache.kafka.connect.runtime.standalone.StandaloneHerderTest > testAccessors STARTED

org.apache.kafka.connect.runtime.standalone.StandaloneHerderTest > testAccessors PASSED

org.apache.kafka.connect.runtime.standalone.StandaloneHerderTest > testCreateConnectorFailedBasicValidation STARTED

org.apache.kafka.connect.runtime.standalone.StandaloneHerderTest > testCreateConnectorFailedBasicValidation PASSED

org.apache.kafka.connect.runtime.standalone.StandaloneHerderTest > testCreateConnectorFailedCustomValidation STARTED

org.apache.kafka.connect.runtime.standalone.StandaloneHerderTest > testCreateConnectorFailedCustomValidation PASSED

org.apache.kafka.connect.runtime.standalone.StandaloneHerderTest > testPutConnectorConfig STARTED

org.apache.kafka.connect.runtime.standalone.StandaloneHerderTest > testPutConnectorConfig PASSED

org.apache.kafka.connect.runtime.standalone.StandaloneHerderTest > testPutTaskConfigs STARTED

org.apache.kafka.connect.runtime.standalone.StandaloneHerderTest > testPutTaskConfigs PASSED

org.apache.kafka.connect.runtime.WorkerTest > testStartAndStopConnector STARTED

org.apache.kafka.connect.runtime.WorkerTest > testStartAndStopConnector PASSED

org.apache.kafka.connect.runtime.WorkerTest > testStartConnectorFailure STARTED

org.apache.kafka.connect.runtime.WorkerTest > testStartConnectorFailure PASSED

org.apache.kafka.connect.runtime.WorkerTest > testAddConnectorByAlias STARTED

org.apache.kafka.connect.runtime.WorkerTest > testAddConnectorByAlias PASSED

org.apache.kafka.connect.runtime.WorkerTest > testAddConnectorByShortAlias STARTED

org.apache.kafka.connect.runtime.WorkerTest > testAddConnectorByShortAlias PASSED

org.apache.kafka.connect.runtime.WorkerTest > testStopInvalidConnector STARTED

org.apache.kafka.connect.runtime.WorkerTest > testStopInvalidConnector PASSED

org.apache.kafka.connect.runtime.WorkerTest > testReconfigureConnectorTasks STARTED

org.apache.kafka.connect.runtime.WorkerTest > testReconfigureConnectorTasks PASSED

org.apache.kafka.connect.runtime.WorkerTest > testAddRemoveTask STARTED

org.apache.kafka.connect.runtime.WorkerTest > testAddRemoveTask PASSED

org.apache.kafka.connect.runtime.WorkerTest > testStartTaskFailure STARTED

org.apache.kafka.connect.runtime.WorkerTest > testStartTaskFailure PASSED

org.apache.kafka.connect.runtime.WorkerTest > testCleanupTasksOnStop STARTED

org.apache.kafka.connect.runtime.WorkerTest > testCleanupTasksOnStop PASSED

org.apache.kafka.connect.runtime.WorkerTest > testConverterOverrides STARTED

org.apache.kafka.connect.runtime.WorkerTest > testConverterOverrides PASSED

org.apache.kafka.connect.runtime.isolation.PluginDescTest > testPluginDescWithNullVersion STARTED

org.apache.kafka.connect.runtime.isolation.PluginDescTest > testPluginDescWithNullVersion PASSED

org.apache.kafka.connect.runtime.isolation.PluginDescTest > testPluginDescComparison STARTED

org.apache.kafka.connect.runtime.isolation.PluginDescTest > testPluginDescComparison PASSED

org.apache.kafka.connect.runtime.isolation.PluginDescTest > testRegularPluginDesc STARTED

org.apache.kafka.connect.runtime.isolation.PluginDescTest > testRegularPluginDesc PASSED

org.apache.kafka.connect.runtime.isolation.PluginDescTest > testPluginDescEquality STARTED

org.apache.kafka.connect.runtime.isolation.PluginDescTest > testPluginDescEquality PASSED

org.apache.kafka.connect.runtime.isolation.PluginDescTest > testPluginDescWithSystemClassLoader STARTED

org.apache.kafka.connect.runtime.isolation.PluginDescTest > testPluginDescWithSystemClassLoader PASSED

org.apache.kafka.connect.runtime.isolation.DelegatingClassLoaderTest > testWhiteListedManifestResources STARTED

org.apache.kafka.connect.runtime.isolation.DelegatingClassLoaderTest > testWhiteListedManifestResources PASSED

org.apache.kafka.connect.runtime.isolation.DelegatingClassLoaderTest > testOtherResources STARTED

org.apache.kafka.connect.runtime.isolation.DelegatingClassLoaderTest > testOtherResources PASSED

org.apache.kafka.connect.runtime.isolation.PluginsTest > shouldInstantiateAndConfigureConnectRestExtension STARTED

org.apache.kafka.connect.runtime.isolation.PluginsTest > shouldInstantiateAndConfigureConnectRestExtension PASSED

org.apache.kafka.connect.runtime.isolation.PluginsTest > shouldInstantiateAndConfigureConverters STARTED

org.apache.kafka.connect.runtime.isolation.PluginsTest > shouldInstantiateAndConfigureConverters PASSED

org.apache.kafka.connect.runtime.isolation.PluginsTest > shouldInstantiateAndConfigureInternalConverters STARTED

org.apache.kafka.connect.runtime.isolation.PluginsTest > shouldInstantiateAndConfigureInternalConverters PASSED

org.apache.kafka.connect.runtime.isolation.PluginsTest > shouldInstantiateAndConfigureDefaultHeaderConverter STARTED

org.apache.kafka.connect.runtime.isolation.PluginsTest > shouldInstantiateAndConfigureDefaultHeaderConverter PASSED

org.apache.kafka.connect.runtime.isolation.PluginsTest > shouldInstantiateAndConfigureExplicitlySetHeaderConverterWithCurrentClassLoader STARTED

org.apache.kafka.connect.runtime.isolation.PluginsTest > shouldInstantiateAndConfigureExplicitlySetHeaderConverterWithCurrentClassLoader PASSED

org.apache.kafka.connect.runtime.isolation.PluginUtilsTest > testPluginUrlsWithRelativeSymlinkForwards STARTED

org.apache.kafka.connect.runtime.isolation.PluginUtilsTest > testPluginUrlsWithRelativeSymlinkForwards PASSED

org.apache.kafka.connect.runtime.isolation.PluginUtilsTest > testOrderOfPluginUrlsWithJars STARTED

org.apache.kafka.connect.runtime.isolation.PluginUtilsTest > testOrderOfPluginUrlsWithJars PASSED

org.apache.kafka.connect.runtime.isolation.PluginUtilsTest > testPluginUrlsWithClasses STARTED

org.apache.kafka.connect.runtime.isolation.PluginUtilsTest > testPluginUrlsWithClasses PASSED

org.apache.kafka.connect.runtime.isolation.PluginUtilsTest > testConnectFrameworkClasses STARTED

org.apache.kafka.connect.runtime.isolation.PluginUtilsTest > testConnectFrameworkClasses PASSED

org.apache.kafka.connect.runtime.isolation.PluginUtilsTest > testThirdPartyClasses STARTED

org.apache.kafka.connect.runtime.isolation.PluginUtilsTest > testThirdPartyClasses PASSED

org.apache.kafka.connect.runtime.isolation.PluginUtilsTest > testClientConfigProvider STARTED

org.apache.kafka.connect.runtime.isolation.PluginUtilsTest > testClientConfigProvider PASSED

org.apache.kafka.connect.runtime.isolation.PluginUtilsTest > testAllowedConnectFrameworkClasses STARTED

org.apache.kafka.connect.runtime.isolation.PluginUtilsTest > testAllowedConnectFrameworkClasses PASSED

org.apache.kafka.connect.runtime.isolation.PluginUtilsTest > testJavaLibraryClasses STARTED

org.apache.kafka.connect.runtime.isolation.PluginUtilsTest > testJavaLibraryClasses PASSED

org.apache.kafka.connect.runtime.isolation.PluginUtilsTest > testEmptyPluginUrls STARTED

org.apache.kafka.connect.runtime.isolation.PluginUtilsTest > testEmptyPluginUrls PASSED

org.apache.kafka.connect.runtime.isolation.PluginUtilsTest > testPluginUrlsWithJars STARTED

org.apache.kafka.connect.runtime.isolation.PluginUtilsTest > testPluginUrlsWithJars PASSED

org.apache.kafka.connect.runtime.isolation.PluginUtilsTest > testPluginUrlsWithZips STARTED

org.apache.kafka.connect.runtime.isolation.PluginUtilsTest > testPluginUrlsWithZips PASSED

org.apache.kafka.connect.runtime.isolation.PluginUtilsTest > testPluginUrlsWithRelativeSymlinkBackwards STARTED

org.apache.kafka.connect.runtime.isolation.PluginUtilsTest > testPluginUrlsWithRelativeSymlinkBackwards PASSED

org.apache.kafka.connect.runtime.isolation.PluginUtilsTest > testPluginUrlsWithAbsoluteSymlink STARTED

org.apache.kafka.connect.runtime.isolation.PluginUtilsTest > testPluginUrlsWithAbsoluteSymlink PASSED

org.apache.kafka.connect.runtime.isolation.PluginUtilsTest > testEmptyStructurePluginUrls STARTED

org.apache.kafka.connect.runtime.isolation.PluginUtilsTest > testEmptyStructurePluginUrls PASSED

org.apache.kafka.connect.runtime.TransformationConfigTest > testEmbeddedConfigCast STARTED

org.apache.kafka.connect.runtime.TransformationConfigTest > testEmbeddedConfigCast PASSED

org.apache.kafka.connect.runtime.TransformationConfigTest > testEmbeddedConfigRegexRouter STARTED

org.apache.kafka.connect.runtime.TransformationConfigTest > testEmbeddedConfigRegexRouter PASSED

org.apache.kafka.connect.runtime.TransformationConfigTest > testEmbeddedConfigSetSchemaMetadata STARTED

org.apache.kafka.connect.runtime.TransformationConfigTest > testEmbeddedConfigSetSchemaMetadata PASSED

org.apache.kafka.connect.runtime.TransformationConfigTest > testEmbeddedConfigTimestampConverter STARTED

org.apache.kafka.connect.runtime.TransformationConfigTest > testEmbeddedConfigTimestampConverter PASSED

org.apache.kafka.connect.runtime.TransformationConfigTest > testEmbeddedConfigHoistField STARTED

org.apache.kafka.connect.runtime.TransformationConfigTest > testEmbeddedConfigHoistField PASSED

org.apache.kafka.connect.runtime.TransformationConfigTest > testEmbeddedConfigMaskField STARTED

org.apache.kafka.connect.runtime.TransformationConfigTest > testEmbeddedConfigMaskField PASSED

org.apache.kafka.connect.runtime.TransformationConfigTest > testEmbeddedConfigInsertField STARTED

org.apache.kafka.connect.runtime.TransformationConfigTest > testEmbeddedConfigInsertField PASSED

org.apache.kafka.connect.runtime.TransformationConfigTest > testEmbeddedConfigFlatten STARTED

org.apache.kafka.connect.runtime.TransformationConfigTest > testEmbeddedConfigFlatten PASSED

org.apache.kafka.connect.runtime.TransformationConfigTest > testEmbeddedConfigReplaceField STARTED

org.apache.kafka.connect.runtime.TransformationConfigTest > testEmbeddedConfigReplaceField PASSED

org.apache.kafka.connect.runtime.TransformationConfigTest > testEmbeddedConfigTimestampRouter STARTED

org.apache.kafka.connect.runtime.TransformationConfigTest > testEmbeddedConfigTimestampRouter PASSED

org.apache.kafka.connect.runtime.TransformationConfigTest > testEmbeddedConfigValueToKey STARTED

org.apache.kafka.connect.runtime.TransformationConfigTest > testEmbeddedConfigValueToKey PASSED

org.apache.kafka.connect.runtime.TransformationConfigTest > testEmbeddedConfigExtractField STARTED

org.apache.kafka.connect.runtime.TransformationConfigTest > testEmbeddedConfigExtractField PASSED

380 tests completed, 1 failed

> Task :connect:runtime:test FAILED

FAILURE: Build failed with an exception.

* What went wrong:
Execution failed for task ':connect:runtime:test'.
> There were failing tests. See the report at: file://<https://builds.apache.org/job/kafka-2.1-jdk8/ws/connect/runtime/build/reports/tests/test/index.html>

* Try:
Run with --stacktrace option to get the stack trace. Run with --info or --debug option to get more log output. Run with --scan to get full insights.

* Get more help at https://help.gradle.org

BUILD FAILED in 4h 2m 41s
134 actionable tasks: 106 executed, 28 up-to-date
Build step 'Execute shell' marked build as failure
[FINDBUGS] Collecting findbugs analysis files...
Setting GRADLE_4_8_1_HOME=/home/jenkins/tools/gradle/4.8.1
[FINDBUGS] Searching for all files in <https://builds.apache.org/job/kafka-2.1-jdk8/ws/> that match the pattern **/build/reports/findbugs/*.xml
[FINDBUGS] No files found. Configuration error?
Setting GRADLE_4_8_1_HOME=/home/jenkins/tools/gradle/4.8.1
Setting GRADLE_4_8_1_HOME=/home/jenkins/tools/gradle/4.8.1
<Git Blamer> Using GitBlamer to create author and commit information for all warnings.
<Git Blamer> GIT_COMMIT=f15678e203b0efb2ece45941238e3557d225bd67, workspace=<https://builds.apache.org/job/kafka-2.1-jdk8/ws/>
[FINDBUGS] Computing warning deltas based on reference build #123
Recording test results
Setting GRADLE_4_8_1_HOME=/home/jenkins/tools/gradle/4.8.1
Setting GRADLE_4_8_1_HOME=/home/jenkins/tools/gradle/4.8.1
Not sending mail to unregistered user wangguoz@gmail.com

Build failed in Jenkins: kafka-2.1-jdk8 #126

Posted by Apache Jenkins Server <je...@builds.apache.org>.
See <https://builds.apache.org/job/kafka-2.1-jdk8/126/display/redirect?page=changes>

Changes:

[wangguoz] KAFKA-7741: streams-scala - document dependency workaround (#6126)

------------------------------------------
[...truncated 918.73 KB...]

kafka.coordinator.transaction.TransactionCoordinatorTest > shouldRespondWithInvalidRequestAddPartitionsToTransactionWhenTransactionalIdIsEmpty STARTED

kafka.coordinator.transaction.TransactionCoordinatorTest > shouldRespondWithInvalidRequestAddPartitionsToTransactionWhenTransactionalIdIsEmpty PASSED

kafka.coordinator.transaction.TransactionCoordinatorTest > shouldAppendPrepareAbortToLogOnEndTxnWhenStatusIsOngoingAndResultIsAbort STARTED

kafka.coordinator.transaction.TransactionCoordinatorTest > shouldAppendPrepareAbortToLogOnEndTxnWhenStatusIsOngoingAndResultIsAbort PASSED

kafka.coordinator.transaction.TransactionCoordinatorTest > shouldAcceptInitPidAndReturnNextPidWhenTransactionalIdIsNull STARTED

kafka.coordinator.transaction.TransactionCoordinatorTest > shouldAcceptInitPidAndReturnNextPidWhenTransactionalIdIsNull PASSED

kafka.coordinator.transaction.TransactionCoordinatorTest > shouldRemoveTransactionsForPartitionOnEmigration STARTED

kafka.coordinator.transaction.TransactionCoordinatorTest > shouldRemoveTransactionsForPartitionOnEmigration PASSED

kafka.coordinator.transaction.TransactionCoordinatorTest > shouldWaitForCommitToCompleteOnHandleInitPidAndExistingTransactionInPrepareCommitState STARTED

kafka.coordinator.transaction.TransactionCoordinatorTest > shouldWaitForCommitToCompleteOnHandleInitPidAndExistingTransactionInPrepareCommitState PASSED

kafka.coordinator.transaction.TransactionCoordinatorTest > shouldAbortExpiredTransactionsInOngoingStateAndBumpEpoch STARTED

kafka.coordinator.transaction.TransactionCoordinatorTest > shouldAbortExpiredTransactionsInOngoingStateAndBumpEpoch PASSED

kafka.coordinator.transaction.TransactionCoordinatorTest > shouldReturnInvalidTxnRequestOnEndTxnRequestWhenStatusIsCompleteCommitAndResultIsNotCommit STARTED

kafka.coordinator.transaction.TransactionCoordinatorTest > shouldReturnInvalidTxnRequestOnEndTxnRequestWhenStatusIsCompleteCommitAndResultIsNotCommit PASSED

kafka.coordinator.transaction.TransactionCoordinatorTest > shouldReturnOkOnEndTxnWhenStatusIsCompleteCommitAndResultIsCommit STARTED

kafka.coordinator.transaction.TransactionCoordinatorTest > shouldReturnOkOnEndTxnWhenStatusIsCompleteCommitAndResultIsCommit PASSED

kafka.coordinator.transaction.TransactionCoordinatorTest > shouldRespondWithConcurrentTransactionsOnAddPartitionsWhenStateIsPrepareCommit STARTED

kafka.coordinator.transaction.TransactionCoordinatorTest > shouldRespondWithConcurrentTransactionsOnAddPartitionsWhenStateIsPrepareCommit PASSED

kafka.coordinator.transaction.TransactionCoordinatorTest > shouldIncrementEpochAndUpdateMetadataOnHandleInitPidWhenExistingCompleteTransaction STARTED

kafka.coordinator.transaction.TransactionCoordinatorTest > shouldIncrementEpochAndUpdateMetadataOnHandleInitPidWhenExistingCompleteTransaction PASSED

kafka.coordinator.transaction.TransactionCoordinatorTest > shouldGenerateNewProducerIdIfEpochsExhausted STARTED

kafka.coordinator.transaction.TransactionCoordinatorTest > shouldGenerateNewProducerIdIfEpochsExhausted PASSED

kafka.coordinator.transaction.TransactionCoordinatorTest > shouldRespondWithNotCoordinatorOnInitPidWhenNotCoordinator STARTED

kafka.coordinator.transaction.TransactionCoordinatorTest > shouldRespondWithNotCoordinatorOnInitPidWhenNotCoordinator PASSED

kafka.coordinator.transaction.TransactionCoordinatorTest > shouldRespondWithConcurrentTransactionOnAddPartitionsWhenStateIsPrepareAbort STARTED

kafka.coordinator.transaction.TransactionCoordinatorTest > shouldRespondWithConcurrentTransactionOnAddPartitionsWhenStateIsPrepareAbort PASSED

kafka.coordinator.transaction.TransactionCoordinatorTest > shouldInitPidWithEpochZeroForNewTransactionalId STARTED

kafka.coordinator.transaction.TransactionCoordinatorTest > shouldInitPidWithEpochZeroForNewTransactionalId PASSED

kafka.network.SocketServerTest > testGracefulClose STARTED

kafka.network.SocketServerTest > testGracefulClose PASSED

kafka.network.SocketServerTest > testSendActionResponseWithThrottledChannelWhereThrottlingAlreadyDone STARTED

kafka.network.SocketServerTest > testSendActionResponseWithThrottledChannelWhereThrottlingAlreadyDone PASSED

kafka.network.SocketServerTest > controlThrowable STARTED

kafka.network.SocketServerTest > controlThrowable PASSED

kafka.network.SocketServerTest > testRequestMetricsAfterStop STARTED

kafka.network.SocketServerTest > testRequestMetricsAfterStop PASSED

kafka.network.SocketServerTest > testConnectionIdReuse STARTED

kafka.network.SocketServerTest > testConnectionIdReuse PASSED

kafka.network.SocketServerTest > testClientDisconnectionUpdatesRequestMetrics STARTED

kafka.network.SocketServerTest > testClientDisconnectionUpdatesRequestMetrics PASSED

kafka.network.SocketServerTest > testProcessorMetricsTags STARTED

kafka.network.SocketServerTest > testProcessorMetricsTags PASSED

kafka.network.SocketServerTest > testMaxConnectionsPerIp STARTED

kafka.network.SocketServerTest > testMaxConnectionsPerIp PASSED

kafka.network.SocketServerTest > testConnectionId STARTED

kafka.network.SocketServerTest > testConnectionId PASSED

kafka.network.SocketServerTest > testBrokerSendAfterChannelClosedUpdatesRequestMetrics STARTED

kafka.network.SocketServerTest > testBrokerSendAfterChannelClosedUpdatesRequestMetrics PASSED

kafka.network.SocketServerTest > testNoOpAction STARTED

kafka.network.SocketServerTest > testNoOpAction PASSED

kafka.network.SocketServerTest > simpleRequest STARTED

kafka.network.SocketServerTest > simpleRequest PASSED

kafka.network.SocketServerTest > closingChannelException STARTED

kafka.network.SocketServerTest > closingChannelException PASSED

kafka.network.SocketServerTest > testSendActionResponseWithThrottledChannelWhereThrottlingInProgress STARTED

kafka.network.SocketServerTest > testSendActionResponseWithThrottledChannelWhereThrottlingInProgress PASSED

kafka.network.SocketServerTest > testIdleConnection STARTED

kafka.network.SocketServerTest > testIdleConnection PASSED

kafka.network.SocketServerTest > testClientDisconnectionWithStagedReceivesFullyProcessed STARTED

kafka.network.SocketServerTest > testClientDisconnectionWithStagedReceivesFullyProcessed PASSED

kafka.network.SocketServerTest > testZeroMaxConnectionsPerIp STARTED

kafka.network.SocketServerTest > testZeroMaxConnectionsPerIp PASSED

kafka.network.SocketServerTest > testMetricCollectionAfterShutdown STARTED

kafka.network.SocketServerTest > testMetricCollectionAfterShutdown PASSED

kafka.network.SocketServerTest > testSessionPrincipal STARTED

kafka.network.SocketServerTest > testSessionPrincipal PASSED

kafka.network.SocketServerTest > configureNewConnectionException STARTED

kafka.network.SocketServerTest > configureNewConnectionException PASSED

kafka.network.SocketServerTest > testMaxConnectionsPerIpOverrides STARTED

kafka.network.SocketServerTest > testMaxConnectionsPerIpOverrides PASSED

kafka.network.SocketServerTest > processNewResponseException STARTED

kafka.network.SocketServerTest > processNewResponseException PASSED

kafka.network.SocketServerTest > processCompletedSendException STARTED

kafka.network.SocketServerTest > processCompletedSendException PASSED

kafka.network.SocketServerTest > processDisconnectedException STARTED

kafka.network.SocketServerTest > processDisconnectedException PASSED

kafka.network.SocketServerTest > sendCancelledKeyException STARTED

kafka.network.SocketServerTest > sendCancelledKeyException PASSED

kafka.network.SocketServerTest > processCompletedReceiveException STARTED

kafka.network.SocketServerTest > processCompletedReceiveException PASSED

kafka.network.SocketServerTest > testSocketsCloseOnShutdown STARTED

kafka.network.SocketServerTest > testSocketsCloseOnShutdown PASSED

kafka.network.SocketServerTest > testNoOpActionResponseWithThrottledChannelWhereThrottlingAlreadyDone STARTED

kafka.network.SocketServerTest > testNoOpActionResponseWithThrottledChannelWhereThrottlingAlreadyDone PASSED

kafka.network.SocketServerTest > pollException STARTED

kafka.network.SocketServerTest > pollException PASSED

kafka.network.SocketServerTest > testSslSocketServer STARTED

kafka.network.SocketServerTest > testSslSocketServer PASSED

kafka.network.SocketServerTest > tooBigRequestIsRejected STARTED

kafka.network.SocketServerTest > tooBigRequestIsRejected PASSED

kafka.network.SocketServerTest > testNoOpActionResponseWithThrottledChannelWhereThrottlingInProgress STARTED

kafka.network.SocketServerTest > testNoOpActionResponseWithThrottledChannelWhereThrottlingInProgress PASSED

kafka.network.DynamicConnectionQuotaTest > testDynamicConnectionQuota STARTED

kafka.network.DynamicConnectionQuotaTest > testDynamicConnectionQuota PASSED

kafka.common.InterBrokerSendThreadTest > shouldCreateClientRequestAndSendWhenNodeIsReady STARTED

kafka.common.InterBrokerSendThreadTest > shouldCreateClientRequestAndSendWhenNodeIsReady PASSED

kafka.common.InterBrokerSendThreadTest > testFailingExpiredRequests STARTED

kafka.common.InterBrokerSendThreadTest > testFailingExpiredRequests PASSED

kafka.common.InterBrokerSendThreadTest > shouldCallCompletionHandlerWithDisconnectedResponseWhenNodeNotReady STARTED

kafka.common.InterBrokerSendThreadTest > shouldCallCompletionHandlerWithDisconnectedResponseWhenNodeNotReady PASSED

kafka.common.InterBrokerSendThreadTest > shouldNotSendAnythingWhenNoRequests STARTED

kafka.common.InterBrokerSendThreadTest > shouldNotSendAnythingWhenNoRequests PASSED

kafka.common.ZkNodeChangeNotificationListenerTest > testProcessNotification STARTED

kafka.common.ZkNodeChangeNotificationListenerTest > testProcessNotification PASSED

kafka.common.ZkNodeChangeNotificationListenerTest > testSwallowsProcessorException STARTED

kafka.common.ZkNodeChangeNotificationListenerTest > testSwallowsProcessorException PASSED

unit.kafka.utils.ThrottlerTest > testThrottleDesiredRate STARTED

unit.kafka.utils.ThrottlerTest > testThrottleDesiredRate PASSED

2156 tests completed, 1 failed, 4 skipped

> Task :kafka-2.1-jdk8:core:test FAILED
> Task :testScala_2_12 FAILED

FAILURE: Build failed with an exception.

* What went wrong:
Execution failed for task ':kafka-2.1-jdk8:core:test'.
> There were failing tests. See the report at: file://<https://builds.apache.org/job/kafka-2.1-jdk8/ws/core/build/reports/tests/test/index.html>

* Try:
Run with --stacktrace option to get the stack trace. Run with --info or --debug option to get more log output. Run with --scan to get full insights.

* Get more help at https://help.gradle.org

BUILD FAILED in 4h 22m 11s
27 actionable tasks: 4 executed, 23 up-to-date
Build step 'Execute shell' marked build as failure
[FINDBUGS] Collecting findbugs analysis files...
Setting GRADLE_4_8_1_HOME=/home/jenkins/tools/gradle/4.8.1
[FINDBUGS] Searching for all files in <https://builds.apache.org/job/kafka-2.1-jdk8/ws/> that match the pattern **/build/reports/findbugs/*.xml
[FINDBUGS] No files found. Configuration error?
Setting GRADLE_4_8_1_HOME=/home/jenkins/tools/gradle/4.8.1
Setting GRADLE_4_8_1_HOME=/home/jenkins/tools/gradle/4.8.1
<Git Blamer> Using GitBlamer to create author and commit information for all warnings.
<Git Blamer> GIT_COMMIT=1b74172ea60710e76756971b0f696a498cd660c5, workspace=<https://builds.apache.org/job/kafka-2.1-jdk8/ws/>
[FINDBUGS] Computing warning deltas based on reference build #123
Recording test results
Setting GRADLE_4_8_1_HOME=/home/jenkins/tools/gradle/4.8.1
Setting GRADLE_4_8_1_HOME=/home/jenkins/tools/gradle/4.8.1
Not sending mail to unregistered user wangguoz@gmail.com