You are viewing a plain text version of this content. The canonical link for it is here.
Posted to commits@tuscany.apache.org by Apache Jenkins Server <je...@builds.apache.org> on 2011/06/18 02:55:28 UTC
Build failed in Jenkins: Tuscany-2x #252
See <https://builds.apache.org/job/Tuscany-2x/252/changes>
Changes:
[bdaniel] Correctly remove policies from endpoints and endpoint references when there are multiple endpoints
[bdaniel] Endpoints should only inherit interaction intents
[bdaniel] Only create tx impl interceptors for valid policies
[bdaniel] Allow tx interaction policies to attach to services and references in addition to bindings
[antelder] Add a testcase for stopCompositeAndUninstallUnused
[antelder] Add a method to stop a running composite and then uninstall any contributions that were used by the composite and are unused now that the composite is stopped
[edwardsmj] Adding org.apache.tuscany.sca.assembly.impl package to imports in MANIFEST.MF to correct an OSGi access error.
[antelder] When uninstalling a contribution also remove any stopped DeployedComposites so that they get correctly rebuilt afresh on a re-start
[antelder] Add a method to get the URIs of all the contributions used by this DeployedComposite
------------------------------------------
[...truncated 11963 lines...]
AU testing/itest/scabindingmapper/pom.xml
A testing/itest/operation-overloading
A testing/itest/operation-overloading/src
A testing/itest/operation-overloading/src/test
A testing/itest/operation-overloading/src/test/java
A testing/itest/operation-overloading/src/test/java/org
A testing/itest/operation-overloading/src/test/java/org/apache
A testing/itest/operation-overloading/src/test/java/org/apache/tuscany
A testing/itest/operation-overloading/src/test/java/org/apache/tuscany/sca
A testing/itest/operation-overloading/src/test/java/org/apache/tuscany/sca/test
A testing/itest/operation-overloading/src/test/java/org/apache/tuscany/sca/test/opoverload
A testing/itest/operation-overloading/src/test/java/org/apache/tuscany/sca/test/opoverload/impl
AU testing/itest/operation-overloading/src/test/java/org/apache/tuscany/sca/test/opoverload/impl/OverloadATestCase.java
A testing/itest/operation-overloading/src/main
A testing/itest/operation-overloading/src/main/java
A testing/itest/operation-overloading/src/main/java/org
A testing/itest/operation-overloading/src/main/java/org/apache
A testing/itest/operation-overloading/src/main/java/org/apache/tuscany
A testing/itest/operation-overloading/src/main/java/org/apache/tuscany/sca
A testing/itest/operation-overloading/src/main/java/org/apache/tuscany/sca/test
A testing/itest/operation-overloading/src/main/java/org/apache/tuscany/sca/test/opoverload
A testing/itest/operation-overloading/src/main/java/org/apache/tuscany/sca/test/opoverload/impl
AU testing/itest/operation-overloading/src/main/java/org/apache/tuscany/sca/test/opoverload/impl/OverloadATarget.java
AU testing/itest/operation-overloading/src/main/java/org/apache/tuscany/sca/test/opoverload/impl/OverloadASource.java
AU testing/itest/operation-overloading/src/main/java/org/apache/tuscany/sca/test/opoverload/OverloadASourceTarget.java
A testing/itest/operation-overloading/src/main/resources
AU testing/itest/operation-overloading/src/main/resources/OperationOverload.composite
AU testing/itest/operation-overloading/pom.xml
A testing/itest/node-launcher-equinox
A testing/itest/node-launcher-equinox/src
A testing/itest/node-launcher-equinox/src/test
A testing/itest/node-launcher-equinox/src/test/java
A testing/itest/node-launcher-equinox/src/test/java/hello
AU testing/itest/node-launcher-equinox/src/test/java/hello/HelloWorldClient.java
AU testing/itest/node-launcher-equinox/src/test/java/hello/HelloWorld.java
AU testing/itest/node-launcher-equinox/src/test/java/hello/HelloWorldImpl.java
A testing/itest/node-launcher-equinox/src/test/java/org
A testing/itest/node-launcher-equinox/src/test/java/org/apache
A testing/itest/node-launcher-equinox/src/test/java/org/apache/tuscany
A testing/itest/node-launcher-equinox/src/test/java/org/apache/tuscany/sca
A testing/itest/node-launcher-equinox/src/test/java/org/apache/tuscany/sca/node
A testing/itest/node-launcher-equinox/src/test/java/org/apache/tuscany/sca/node/equinox
A testing/itest/node-launcher-equinox/src/test/java/org/apache/tuscany/sca/node/equinox/launcher
AU testing/itest/node-launcher-equinox/src/test/java/org/apache/tuscany/sca/node/equinox/launcher/NodeLauncherTestCase.java
AU testing/itest/node-launcher-equinox/src/test/java/org/apache/tuscany/sca/node/equinox/launcher/EquinoxOSGiHostTestCase.java
A testing/itest/node-launcher-equinox/src/test/resources
AU testing/itest/node-launcher-equinox/src/test/resources/HelloWorld.composite
A testing/itest/node-launcher-equinox/pom.xml
A testing/itest/base
A testing/itest/base/dependencies
A testing/itest/base/dependencies/src
A testing/itest/base/dependencies/src/test
A testing/itest/base/dependencies/src/test/java
A testing/itest/base/dependencies/src/test/java/org
A testing/itest/base/dependencies/src/test/java/org/apache
A testing/itest/base/dependencies/src/test/java/org/apache/tuscany
A testing/itest/base/dependencies/src/test/java/org/apache/tuscany/sca
A testing/itest/base/dependencies/src/test/java/org/apache/tuscany/sca/itest
A testing/itest/base/dependencies/src/test/java/org/apache/tuscany/sca/itest/base
A testing/itest/base/dependencies/src/test/java/org/apache/tuscany/sca/itest/base/dependencies
A testing/itest/base/dependencies/src/test/java/org/apache/tuscany/sca/itest/base/dependencies/ValidateDependenciesTestCase.java
A testing/itest/base/dependencies/pom.xml
A testing/itest/base/pom.xml
A testing/itest/callback-basic
A testing/itest/callback-basic/src
A testing/itest/callback-basic/src/test
A testing/itest/callback-basic/src/test/java
A testing/itest/callback-basic/src/test/java/org
A testing/itest/callback-basic/src/test/java/org/apache
A testing/itest/callback-basic/src/test/java/org/apache/tuscany
A testing/itest/callback-basic/src/test/java/org/apache/tuscany/sca
A testing/itest/callback-basic/src/test/java/org/apache/tuscany/sca/test
AU testing/itest/callback-basic/src/test/java/org/apache/tuscany/sca/test/CallBackBasicTestCase.java
A testing/itest/callback-basic/src/main
A testing/itest/callback-basic/src/main/java
A testing/itest/callback-basic/src/main/java/org
A testing/itest/callback-basic/src/main/java/org/apache
A testing/itest/callback-basic/src/main/java/org/apache/tuscany
A testing/itest/callback-basic/src/main/java/org/apache/tuscany/sca
A testing/itest/callback-basic/src/main/java/org/apache/tuscany/sca/test
AU testing/itest/callback-basic/src/main/java/org/apache/tuscany/sca/test/CallBackBasicClientImpl.java
AU testing/itest/callback-basic/src/main/java/org/apache/tuscany/sca/test/CallBackBasicService.java
AU testing/itest/callback-basic/src/main/java/org/apache/tuscany/sca/test/CallBackBasicServiceImpl.java
AU testing/itest/callback-basic/src/main/java/org/apache/tuscany/sca/test/CallBackBasicCallBack.java
AU testing/itest/callback-basic/src/main/java/org/apache/tuscany/sca/test/CallBackBasicClient.java
A testing/itest/callback-basic/src/main/resources
AU testing/itest/callback-basic/src/main/resources/CallBackBasicTest.composite
A testing/itest/callback-basic/src/main/resources/META-INF
AU testing/itest/callback-basic/src/main/resources/META-INF/sca-contribution.xml
AU testing/itest/callback-basic/pom.xml
A testing/compliance-tests
A testing/compliance-tests/assembly
A testing/compliance-tests/assembly/src
A testing/compliance-tests/assembly/src/test
A testing/compliance-tests/assembly/src/test/java
A testing/compliance-tests/assembly/src/test/java/org
A testing/compliance-tests/assembly/src/test/java/org/apache
A testing/compliance-tests/assembly/src/test/java/org/apache/tuscany
A testing/compliance-tests/assembly/src/test/java/org/apache/tuscany/sca
A testing/compliance-tests/assembly/src/test/java/org/apache/tuscany/sca/otest
A testing/compliance-tests/assembly/src/test/java/org/apache/tuscany/sca/otest/TuscanyRuntimeBridge.java
A testing/compliance-tests/assembly/src/test/resources
A testing/compliance-tests/assembly/src/test/resources/tuscany-oasis-sca-tests-errors.properties
A testing/compliance-tests/assembly/src/test/resources/oasis-sca-tests.properties
A testing/compliance-tests/assembly/src/main
A testing/compliance-tests/assembly/pom.xml
A testing/compliance-tests/policy
A testing/compliance-tests/policy/src
A testing/compliance-tests/policy/src/test
A testing/compliance-tests/policy/src/test/java
A testing/compliance-tests/policy/src/test/java/org
A testing/compliance-tests/policy/src/test/java/org/apache
A testing/compliance-tests/policy/src/test/java/org/apache/tuscany
A testing/compliance-tests/policy/src/test/java/org/apache/tuscany/sca
A testing/compliance-tests/policy/src/test/java/org/apache/tuscany/sca/otest
A testing/compliance-tests/policy/src/test/java/org/apache/tuscany/sca/otest/TuscanyRuntimeBridge.java
A testing/compliance-tests/policy/src/test/resources
A testing/compliance-tests/policy/src/test/resources/tuscany-oasis-sca-tests-errors.properties
A testing/compliance-tests/policy/src/test/resources/oasis-sca-tests.properties
A testing/compliance-tests/policy/pom.xml
A testing/compliance-tests/binding-jms
A testing/compliance-tests/binding-jms/src
A testing/compliance-tests/binding-jms/src/test
A testing/compliance-tests/binding-jms/src/test/java
A testing/compliance-tests/binding-jms/src/test/java/org
A testing/compliance-tests/binding-jms/src/test/java/org/apache
A testing/compliance-tests/binding-jms/src/test/java/org/apache/tuscany
A testing/compliance-tests/binding-jms/src/test/java/org/apache/tuscany/sca
A testing/compliance-tests/binding-jms/src/test/java/org/apache/tuscany/sca/otest
AU testing/compliance-tests/binding-jms/src/test/java/org/apache/tuscany/sca/otest/TuscanyRuntimeBridge.java
A testing/compliance-tests/binding-jms/src/test/resources
AU testing/compliance-tests/binding-jms/src/test/resources/tuscany-oasis-sca-tests-errors.properties
AU testing/compliance-tests/binding-jms/src/test/resources/oasis-sca-tests.properties
AU testing/compliance-tests/binding-jms/pom.xml
A testing/compliance-tests/binding-ws
A testing/compliance-tests/binding-ws/src
A testing/compliance-tests/binding-ws/src/test
A testing/compliance-tests/binding-ws/src/test/java
A testing/compliance-tests/binding-ws/src/test/java/org
A testing/compliance-tests/binding-ws/src/test/java/org/apache
A testing/compliance-tests/binding-ws/src/test/java/org/apache/tuscany
A testing/compliance-tests/binding-ws/src/test/java/org/apache/tuscany/sca
A testing/compliance-tests/binding-ws/src/test/java/org/apache/tuscany/sca/otest
AU testing/compliance-tests/binding-ws/src/test/java/org/apache/tuscany/sca/otest/TuscanyRuntimeBridge.java
A testing/compliance-tests/binding-ws/src/test/resources
AU testing/compliance-tests/binding-ws/src/test/resources/tuscany-oasis-sca-tests-errors.properties
AU testing/compliance-tests/binding-ws/src/test/resources/oasis-sca-tests.properties
A testing/compliance-tests/binding-ws/sca_variables.dtd
AU testing/compliance-tests/binding-ws/pom.xml
A testing/compliance-tests/java-caa
A testing/compliance-tests/java-caa/src
A testing/compliance-tests/java-caa/src/test
A testing/compliance-tests/java-caa/src/test/java
A testing/compliance-tests/java-caa/src/test/java/org
A testing/compliance-tests/java-caa/src/test/java/org/apache
A testing/compliance-tests/java-caa/src/test/java/org/apache/tuscany
A testing/compliance-tests/java-caa/src/test/java/org/apache/tuscany/sca
A testing/compliance-tests/java-caa/src/test/java/org/apache/tuscany/sca/otest
A testing/compliance-tests/java-caa/src/test/java/org/apache/tuscany/sca/otest/TuscanyRuntimeBridge.java
A testing/compliance-tests/java-caa/src/test/resources
A testing/compliance-tests/java-caa/src/test/resources/tuscany-oasis-sca-tests-errors.properties
A testing/compliance-tests/java-caa/src/test/resources/oasis-sca-tests.properties
A testing/compliance-tests/java-caa/pom.xml
A testing/compliance-tests/java-ci
A testing/compliance-tests/java-ci/src
A testing/compliance-tests/java-ci/src/test
A testing/compliance-tests/java-ci/src/test/java
A testing/compliance-tests/java-ci/src/test/java/org
A testing/compliance-tests/java-ci/src/test/java/org/apache
A testing/compliance-tests/java-ci/src/test/java/org/apache/tuscany
A testing/compliance-tests/java-ci/src/test/java/org/apache/tuscany/sca
A testing/compliance-tests/java-ci/src/test/java/org/apache/tuscany/sca/otest
A testing/compliance-tests/java-ci/src/test/java/org/apache/tuscany/sca/otest/TuscanyRuntimeBridge.java
A testing/compliance-tests/java-ci/src/test/resources
A testing/compliance-tests/java-ci/src/test/resources/tuscany-oasis-sca-tests-errors.properties
A testing/compliance-tests/java-ci/src/test/resources/oasis-sca-tests.properties
A testing/compliance-tests/java-ci/pom.xml
A testing/compliance-tests/pom.xml
A features
A features/web20
AU features/web20/pom.xml
A features/osgi
AU features/osgi/pom.xml
A features/sdo
AU features/sdo/pom.xml
A features/ejava
AU features/ejava/pom.xml
A features/all
AU features/all/pom.xml
A features/core
AU features/core/pom.xml
A features/api
AU features/api/pom.xml
A features/eclipse-pde
AU features/eclipse-pde/pom.xml
AU features/pom.xml
A features/process
AU features/process/pom.xml
A features/webapp
AU features/webapp/pom.xml
A features/webservice
AU features/webservice/pom.xml
U .
At revision 1137105
ERROR: Ignore Problem expanding maven opts macros org.jenkinsci.plugins.tokenmacro.TokenMacro
Found mavenVersion 2.2.1 from file jar:file:/home/hudson/tools/maven/latest/lib/maven-2.2.1-uber.jar!/META-INF/maven/org.apache.maven/maven-core/pom.properties
Parsing POMs
failed to transfer Unable to locate resource in repository
downloaded artifact http://repo1.maven.org/maven2//org/apache/apache/8/apache-8.pom
ERROR: Failed to parse POMs
hudson.util.IOException2: remote file operation failed: <https://builds.apache.org/job/Tuscany-2x/ws/sca-2x> at hudson.remoting.Channel@6eb8fbd8:ubuntu1
at hudson.FilePath.act(FilePath.java:754)
at hudson.FilePath.act(FilePath.java:740)
at hudson.maven.MavenModuleSetBuild$RunnerImpl.parsePoms(MavenModuleSetBuild.java:817)
at hudson.maven.MavenModuleSetBuild$RunnerImpl.doRun(MavenModuleSetBuild.java:617)
at hudson.model.AbstractBuild$AbstractRunner.run(AbstractBuild.java:429)
at hudson.model.Run.run(Run.java:1374)
at hudson.maven.MavenModuleSetBuild.run(MavenModuleSetBuild.java:467)
at hudson.model.ResourceController.execute(ResourceController.java:88)
at hudson.model.Executor.run(Executor.java:145)
Caused by: hudson.remoting.ProxyException: hudson.maven.MavenModuleSetBuild$MavenExecutionException: org.apache.maven.project.ProjectBuildingException: Some problems were encountered while processing the POMs:
[WARNING] 'parent.relativePath' points at org.apache.tuscany.sca:itest-policy instead of org.apache.tuscany.sca:itest-ws, please verify your project structure @ line 22, column 13
[FATAL] Non-resolvable parent POM: Could not find artifact org.apache.tuscany.sca:itest-ws:pom:2.0-SNAPSHOT and 'parent.relativePath' points at wrong local POM @ line 22, column 13
at hudson.maven.MavenModuleSetBuild$PomParser.invoke(MavenModuleSetBuild.java:1327)
at hudson.maven.MavenModuleSetBuild$PomParser.invoke(MavenModuleSetBuild.java:1110)
at hudson.FilePath$FileCallableWrapper.call(FilePath.java:1979)
at hudson.remoting.UserRequest.perform(UserRequest.java:118)
at hudson.remoting.UserRequest.perform(UserRequest.java:48)
at hudson.remoting.Request$2.run(Request.java:270)
at java.util.concurrent.Executors$RunnableAdapter.call(Executors.java:471)
at java.util.concurrent.FutureTask$Sync.innerRun(FutureTask.java:334)
at java.util.concurrent.FutureTask.run(FutureTask.java:166)
at java.util.concurrent.ThreadPoolExecutor.runWorker(ThreadPoolExecutor.java:1110)
at java.util.concurrent.ThreadPoolExecutor$Worker.run(ThreadPoolExecutor.java:603)
at java.lang.Thread.run(Thread.java:636)
Caused by: hudson.remoting.ProxyException: org.apache.maven.project.ProjectBuildingException: Some problems were encountered while processing the POMs:
[WARNING] 'parent.relativePath' points at org.apache.tuscany.sca:itest-policy instead of org.apache.tuscany.sca:itest-ws, please verify your project structure @ line 22, column 13
[FATAL] Non-resolvable parent POM: Could not find artifact org.apache.tuscany.sca:itest-ws:pom:2.0-SNAPSHOT and 'parent.relativePath' points at wrong local POM @ line 22, column 13
at org.apache.maven.project.DefaultProjectBuilder.build(DefaultProjectBuilder.java:339)
at hudson.maven.MavenEmbedder.buildProjects(MavenEmbedder.java:360)
at hudson.maven.MavenEmbedder.readProjects(MavenEmbedder.java:330)
at hudson.maven.MavenEmbedder.readProject(MavenEmbedder.java:321)
at hudson.maven.MavenModuleSetBuild$PomParser.readChilds(MavenModuleSetBuild.java:1381)
at hudson.maven.MavenModuleSetBuild$PomParser.readChilds(MavenModuleSetBuild.java:1384)
at hudson.maven.MavenModuleSetBuild$PomParser.readChilds(MavenModuleSetBuild.java:1384)
at hudson.maven.MavenModuleSetBuild$PomParser.invoke(MavenModuleSetBuild.java:1288)
... 11 more
Build failed in Jenkins: Tuscany-2x #256
Posted by Apache Jenkins Server <je...@builds.apache.org>.
See <https://builds.apache.org/job/Tuscany-2x/256/changes>
Changes:
[bdaniel] Revert change to only inherit interaction intents on interfaces. Though the implementation intents are not used at runtime, they are used for validation.
[antelder] Correct module parent to fix Hudson build issue
------------------------------------------
[...truncated 33933 lines...]
INFO: Remove endpoint - binding.sca - OkService/OkImpl
Jun 21, 2011 1:20:10 PM org.apache.tuscany.sca.core.assembly.impl.DomainRegistryImpl removeEndpoint
INFO: Remove endpoint - binding.sca - ConstructorException/ConstructorException
Jun 21, 2011 1:20:10 PM org.apache.tuscany.sca.core.assembly.impl.DomainRegistryImpl removeEndpoint
INFO: Remove endpoint - binding.sca - InitCompositeScopeException/InitCompositeScopeException
Jun 21, 2011 1:20:10 PM org.apache.tuscany.sca.core.assembly.impl.DomainRegistryImpl removeEndpoint
INFO: Remove endpoint - binding.sca - InitStatelessScopeException/InitStatelessScopeException
Jun 21, 2011 1:20:10 PM org.apache.tuscany.sca.core.assembly.impl.DomainRegistryImpl removeEndpoint
INFO: Remove endpoint - binding.sca - DestroyCompositeScopeException/DestroyCompositeScopeException
Jun 21, 2011 1:20:10 PM org.apache.tuscany.sca.core.assembly.impl.DomainRegistryImpl removeEndpoint
INFO: Remove endpoint - binding.sca - DestroyCompositeScopeException2/DestroyCompositeScopeException
Jun 21, 2011 1:20:10 PM org.apache.tuscany.sca.node.impl.NodeImpl start
INFO: Starting node: http://tuscany.apache.org/sca/1.1/nodes/default0 domain: default
Jun 21, 2011 1:20:10 PM org.apache.tuscany.sca.node.impl.NodeFactoryImpl loadContributions
INFO: Loading contribution: <https://builds.apache.org/job/Tuscany-2x/ws/sca-2x/testing/itest/java-lifecycle-exceptions/target/classes/>
Jun 21, 2011 1:20:11 PM org.apache.tuscany.sca.core.assembly.impl.DomainRegistryImpl addEndpoint
INFO: Add endpoint - binding.sca - OkService/OkImpl
Jun 21, 2011 1:20:11 PM org.apache.tuscany.sca.core.assembly.impl.DomainRegistryImpl addEndpoint
INFO: Add endpoint - binding.sca - ConstructorException/ConstructorException
Jun 21, 2011 1:20:11 PM org.apache.tuscany.sca.core.assembly.impl.DomainRegistryImpl addEndpoint
INFO: Add endpoint - binding.sca - InitCompositeScopeException/InitCompositeScopeException
Jun 21, 2011 1:20:11 PM org.apache.tuscany.sca.core.assembly.impl.DomainRegistryImpl addEndpoint
INFO: Add endpoint - binding.sca - InitStatelessScopeException/InitStatelessScopeException
Jun 21, 2011 1:20:11 PM org.apache.tuscany.sca.core.assembly.impl.DomainRegistryImpl addEndpoint
INFO: Add endpoint - binding.sca - DestroyCompositeScopeException/DestroyCompositeScopeException
Jun 21, 2011 1:20:11 PM org.apache.tuscany.sca.core.assembly.impl.DomainRegistryImpl addEndpoint
INFO: Add endpoint - binding.sca - DestroyCompositeScopeException2/DestroyCompositeScopeException
Jun 21, 2011 1:20:11 PM org.apache.tuscany.sca.node.impl.NodeImpl stop
INFO: Stopping node: http://tuscany.apache.org/sca/1.1/nodes/default0
Jun 21, 2011 1:20:11 PM org.apache.tuscany.sca.core.assembly.impl.DomainRegistryImpl removeEndpoint
INFO: Remove endpoint - binding.sca - OkService/OkImpl
Jun 21, 2011 1:20:11 PM org.apache.tuscany.sca.core.assembly.impl.DomainRegistryImpl removeEndpoint
INFO: Remove endpoint - binding.sca - ConstructorException/ConstructorException
Jun 21, 2011 1:20:11 PM org.apache.tuscany.sca.core.assembly.impl.DomainRegistryImpl removeEndpoint
INFO: Remove endpoint - binding.sca - InitCompositeScopeException/InitCompositeScopeException
Jun 21, 2011 1:20:11 PM org.apache.tuscany.sca.core.assembly.impl.DomainRegistryImpl removeEndpoint
INFO: Remove endpoint - binding.sca - InitStatelessScopeException/InitStatelessScopeException
Jun 21, 2011 1:20:11 PM org.apache.tuscany.sca.core.assembly.impl.DomainRegistryImpl removeEndpoint
INFO: Remove endpoint - binding.sca - DestroyCompositeScopeException/DestroyCompositeScopeException
Jun 21, 2011 1:20:11 PM org.apache.tuscany.sca.core.assembly.impl.DomainRegistryImpl removeEndpoint
INFO: Remove endpoint - binding.sca - DestroyCompositeScopeException2/DestroyCompositeScopeException
Jun 21, 2011 1:20:11 PM org.apache.tuscany.sca.node.impl.NodeImpl start
INFO: Starting node: http://tuscany.apache.org/sca/1.1/nodes/default0 domain: default
Jun 21, 2011 1:20:11 PM org.apache.tuscany.sca.node.impl.NodeFactoryImpl loadContributions
INFO: Loading contribution: <https://builds.apache.org/job/Tuscany-2x/ws/sca-2x/testing/itest/java-lifecycle-exceptions/target/classes/>
Jun 21, 2011 1:20:11 PM org.apache.tuscany.sca.core.assembly.impl.DomainRegistryImpl addEndpoint
INFO: Add endpoint - binding.sca - OkService/OkImpl
Jun 21, 2011 1:20:11 PM org.apache.tuscany.sca.core.assembly.impl.DomainRegistryImpl addEndpoint
INFO: Add endpoint - binding.sca - ConstructorException/ConstructorException
Jun 21, 2011 1:20:11 PM org.apache.tuscany.sca.core.assembly.impl.DomainRegistryImpl addEndpoint
INFO: Add endpoint - binding.sca - InitCompositeScopeException/InitCompositeScopeException
Jun 21, 2011 1:20:11 PM org.apache.tuscany.sca.core.assembly.impl.DomainRegistryImpl addEndpoint
INFO: Add endpoint - binding.sca - InitStatelessScopeException/InitStatelessScopeException
Jun 21, 2011 1:20:11 PM org.apache.tuscany.sca.core.assembly.impl.DomainRegistryImpl addEndpoint
INFO: Add endpoint - binding.sca - DestroyCompositeScopeException/DestroyCompositeScopeException
Jun 21, 2011 1:20:11 PM org.apache.tuscany.sca.core.assembly.impl.DomainRegistryImpl addEndpoint
INFO: Add endpoint - binding.sca - DestroyCompositeScopeException2/DestroyCompositeScopeException
Jun 21, 2011 1:20:11 PM org.apache.tuscany.sca.node.impl.NodeImpl stop
INFO: Stopping node: http://tuscany.apache.org/sca/1.1/nodes/default0
Jun 21, 2011 1:20:11 PM org.apache.tuscany.sca.core.assembly.impl.DomainRegistryImpl removeEndpoint
INFO: Remove endpoint - binding.sca - OkService/OkImpl
Jun 21, 2011 1:20:11 PM org.apache.tuscany.sca.core.assembly.impl.DomainRegistryImpl removeEndpoint
INFO: Remove endpoint - binding.sca - ConstructorException/ConstructorException
Jun 21, 2011 1:20:11 PM org.apache.tuscany.sca.core.assembly.impl.DomainRegistryImpl removeEndpoint
INFO: Remove endpoint - binding.sca - InitCompositeScopeException/InitCompositeScopeException
Jun 21, 2011 1:20:11 PM org.apache.tuscany.sca.core.assembly.impl.DomainRegistryImpl removeEndpoint
INFO: Remove endpoint - binding.sca - InitStatelessScopeException/InitStatelessScopeException
Jun 21, 2011 1:20:11 PM org.apache.tuscany.sca.core.assembly.impl.DomainRegistryImpl removeEndpoint
INFO: Remove endpoint - binding.sca - DestroyCompositeScopeException/DestroyCompositeScopeException
Jun 21, 2011 1:20:11 PM org.apache.tuscany.sca.core.assembly.impl.DomainRegistryImpl removeEndpoint
INFO: Remove endpoint - binding.sca - DestroyCompositeScopeException2/DestroyCompositeScopeException
Jun 21, 2011 1:20:11 PM org.apache.tuscany.sca.node.impl.NodeImpl start
INFO: Starting node: http://tuscany.apache.org/sca/1.1/nodes/default0 domain: default
Jun 21, 2011 1:20:11 PM org.apache.tuscany.sca.node.impl.NodeFactoryImpl loadContributions
INFO: Loading contribution: <https://builds.apache.org/job/Tuscany-2x/ws/sca-2x/testing/itest/java-lifecycle-exceptions/target/classes/>
Jun 21, 2011 1:20:11 PM org.apache.tuscany.sca.core.assembly.impl.DomainRegistryImpl addEndpoint
INFO: Add endpoint - binding.sca - OkService/OkImpl
Jun 21, 2011 1:20:11 PM org.apache.tuscany.sca.core.assembly.impl.DomainRegistryImpl addEndpoint
INFO: Add endpoint - binding.sca - ConstructorException/ConstructorException
Jun 21, 2011 1:20:11 PM org.apache.tuscany.sca.core.assembly.impl.DomainRegistryImpl addEndpoint
INFO: Add endpoint - binding.sca - InitCompositeScopeException/InitCompositeScopeException
Jun 21, 2011 1:20:11 PM org.apache.tuscany.sca.core.assembly.impl.DomainRegistryImpl addEndpoint
INFO: Add endpoint - binding.sca - InitStatelessScopeException/InitStatelessScopeException
Jun 21, 2011 1:20:11 PM org.apache.tuscany.sca.core.assembly.impl.DomainRegistryImpl addEndpoint
INFO: Add endpoint - binding.sca - DestroyCompositeScopeException/DestroyCompositeScopeException
Jun 21, 2011 1:20:11 PM org.apache.tuscany.sca.core.assembly.impl.DomainRegistryImpl addEndpoint
INFO: Add endpoint - binding.sca - DestroyCompositeScopeException2/DestroyCompositeScopeException
Jun 21, 2011 1:20:11 PM org.apache.tuscany.sca.node.impl.NodeImpl stop
INFO: Stopping node: http://tuscany.apache.org/sca/1.1/nodes/default0
Jun 21, 2011 1:20:11 PM org.apache.tuscany.sca.core.assembly.impl.DomainRegistryImpl removeEndpoint
INFO: Remove endpoint - binding.sca - OkService/OkImpl
Jun 21, 2011 1:20:11 PM org.apache.tuscany.sca.core.assembly.impl.DomainRegistryImpl removeEndpoint
INFO: Remove endpoint - binding.sca - ConstructorException/ConstructorException
Jun 21, 2011 1:20:11 PM org.apache.tuscany.sca.core.assembly.impl.DomainRegistryImpl removeEndpoint
INFO: Remove endpoint - binding.sca - InitCompositeScopeException/InitCompositeScopeException
Jun 21, 2011 1:20:11 PM org.apache.tuscany.sca.core.assembly.impl.DomainRegistryImpl removeEndpoint
INFO: Remove endpoint - binding.sca - InitStatelessScopeException/InitStatelessScopeException
Jun 21, 2011 1:20:11 PM org.apache.tuscany.sca.core.assembly.impl.DomainRegistryImpl removeEndpoint
INFO: Remove endpoint - binding.sca - DestroyCompositeScopeException/DestroyCompositeScopeException
Jun 21, 2011 1:20:11 PM org.apache.tuscany.sca.core.assembly.impl.CompositeActivatorImpl [] (StopException)
SEVERE: Exception during stop processing
org.apache.tuscany.sca.implementation.java.invocation.EventInvocationException: Exception thrown by event method [destroy]
at org.apache.tuscany.sca.implementation.java.invocation.MethodEventInvoker.invokeEvent(MethodEventInvoker.java:52)
at org.apache.tuscany.sca.implementation.java.context.ReflectiveInstanceWrapper.stop(ReflectiveInstanceWrapper.java:64)
at org.apache.tuscany.sca.core.scope.impl.CompositeScopeContainer.stop(CompositeScopeContainer.java:47)
at org.apache.tuscany.sca.core.assembly.impl.CompositeActivatorImpl.stop(CompositeActivatorImpl.java:514)
at org.apache.tuscany.sca.core.assembly.impl.CompositeActivatorImpl.stop(CompositeActivatorImpl.java:372)
at org.apache.tuscany.sca.node.impl.NodeImpl.stop(NodeImpl.java:224)
at itest.InitTestCase.testDestroyCompositeScopeException(InitTestCase.java:142)
at sun.reflect.NativeMethodAccessorImpl.invoke0(Native Method)
at sun.reflect.NativeMethodAccessorImpl.invoke(NativeMethodAccessorImpl.java:39)
at sun.reflect.DelegatingMethodAccessorImpl.invoke(DelegatingMethodAccessorImpl.java:25)
at java.lang.reflect.Method.invoke(Method.java:597)
at org.junit.runners.model.FrameworkMethod$1.runReflectiveCall(FrameworkMethod.java:44)
at org.junit.internal.runners.model.ReflectiveCallable.run(ReflectiveCallable.java:15)
at org.junit.runners.model.FrameworkMethod.invokeExplosively(FrameworkMethod.java:41)
at org.junit.internal.runners.statements.InvokeMethod.evaluate(InvokeMethod.java:20)
at org.junit.internal.runners.statements.RunBefores.evaluate(RunBefores.java:28)
at org.junit.internal.runners.statements.RunAfters.evaluate(RunAfters.java:31)
at org.junit.runners.BlockJUnit4ClassRunner.runChild(BlockJUnit4ClassRunner.java:76)
at org.junit.runners.BlockJUnit4ClassRunner.runChild(BlockJUnit4ClassRunner.java:50)
at org.junit.runners.ParentRunner$3.run(ParentRunner.java:193)
at org.junit.runners.ParentRunner$1.schedule(ParentRunner.java:52)
at org.junit.runners.ParentRunner.runChildren(ParentRunner.java:191)
at org.junit.runners.ParentRunner.access$000(ParentRunner.java:42)
at org.junit.runners.ParentRunner$2.evaluate(ParentRunner.java:184)
at org.junit.runners.ParentRunner.run(ParentRunner.java:236)
at org.apache.maven.surefire.junit4.JUnit4TestSet.execute(JUnit4TestSet.java:62)
at org.apache.maven.surefire.suite.AbstractDirectoryTestSuite.executeTestSet(AbstractDirectoryTestSuite.java:140)
at org.apache.maven.surefire.suite.AbstractDirectoryTestSuite.execute(AbstractDirectoryTestSuite.java:127)
at org.apache.maven.surefire.Surefire.run(Surefire.java:177)
at sun.reflect.NativeMethodAccessorImpl.invoke0(Native Method)
at sun.reflect.NativeMethodAccessorImpl.invoke(NativeMethodAccessorImpl.java:39)
at sun.reflect.DelegatingMethodAccessorImpl.invoke(DelegatingMethodAccessorImpl.java:25)
at java.lang.reflect.Method.invoke(Method.java:597)
at org.apache.maven.surefire.booter.SurefireBooter.runSuitesInProcess(SurefireBooter.java:345)
at org.apache.maven.surefire.booter.SurefireBooter.main(SurefireBooter.java:1009)
Caused by: java.lang.NullPointerException
at itest.DestroyCompositeScopeException.destroy(DestroyCompositeScopeException.java:53)
at sun.reflect.NativeMethodAccessorImpl.invoke0(Native Method)
at sun.reflect.NativeMethodAccessorImpl.invoke(NativeMethodAccessorImpl.java:39)
at sun.reflect.DelegatingMethodAccessorImpl.invoke(DelegatingMethodAccessorImpl.java:25)
at java.lang.reflect.Method.invoke(Method.java:597)
at org.apache.tuscany.sca.implementation.java.invocation.MethodEventInvoker.invokeEvent(MethodEventInvoker.java:43)
... 34 more
Jun 21, 2011 1:20:11 PM org.apache.tuscany.sca.core.assembly.impl.DomainRegistryImpl removeEndpoint
INFO: Remove endpoint - binding.sca - DestroyCompositeScopeException2/DestroyCompositeScopeException
Tests run: 5, Failures: 0, Errors: 0, Skipped: 0, Time elapsed: 1.911 sec
Results :
Tests run: 5, Failures: 0, Errors: 0, Skipped: 0
[JENKINS] Recording test results
[INFO] [jar:jar {execution: default-jar}]
[INFO] Building jar: <https://builds.apache.org/job/Tuscany-2x/ws/sca-2x/testing/itest/java-lifecycle-exceptions/target/itest-java-lifecycle-exceptions-2.0-SNAPSHOT.jar>
[INFO] [install:install {execution: default-install}]
[INFO] Installing <https://builds.apache.org/job/Tuscany-2x/ws/sca-2x/testing/itest/java-lifecycle-exceptions/target/itest-java-lifecycle-exceptions-2.0-SNAPSHOT.jar> to <https://builds.apache.org/job/Tuscany-2x/ws/.repository/org/apache/tuscany/sca/itest-java-lifecycle-exceptions/2.0-SNAPSHOT/itest-java-lifecycle-exceptions-2.0-SNAPSHOT.jar>
[JENKINS] Archiving disabled - not archiving <https://builds.apache.org/job/Tuscany-2x/ws/sca-2x/testing/itest/java-lifecycle-exceptions/pom.xml>
[JENKINS] Archiving disabled - not archiving <https://builds.apache.org/job/Tuscany-2x/ws/sca-2x/testing/itest/java-lifecycle-exceptions/target/itest-java-lifecycle-exceptions-2.0-SNAPSHOT.jar>
[INFO] ------------------------------------------------------------------------
[INFO] Building Apache Tuscany SCA iTest JMS
[INFO] task-segment: [clean, install]
[INFO] ------------------------------------------------------------------------
[INFO] [clean:clean {execution: default-clean}]
Downloading: http://svn.apache.org/repos/asf/tuscany/maven/org/apache/activemq/activemq-core/5.2.0/activemq-core-5.2.0.pom
[INFO] Unable to find resource 'org.apache.activemq:activemq-core:pom:5.2.0' in repository tuscany.repo (http://svn.apache.org/repos/asf/tuscany/maven)
Downloading: http://repo1.maven.org/maven2/org/apache/activemq/activemq-core/5.2.0/activemq-core-5.2.0.pom
Downloading: http://svn.apache.org/repos/asf/tuscany/maven/org/apache/activemq/activemq-parent/5.2.0/activemq-parent-5.2.0.pom
[INFO] Unable to find resource 'org.apache.activemq:activemq-parent:pom:5.2.0' in repository tuscany.repo (http://svn.apache.org/repos/asf/tuscany/maven)
Downloading: http://repo1.maven.org/maven2/org/apache/activemq/activemq-parent/5.2.0/activemq-parent-5.2.0.pom
Downloading: http://svn.apache.org/repos/asf/tuscany/maven/org/apache/camel/camel-core/1.5.0/camel-core-1.5.0.pom
[INFO] Unable to find resource 'org.apache.camel:camel-core:pom:1.5.0' in repository tuscany.repo (http://svn.apache.org/repos/asf/tuscany/maven)
Downloading: http://repo1.maven.org/maven2/org/apache/camel/camel-core/1.5.0/camel-core-1.5.0.pom
Downloading: http://download.java.net/maven/1//org.apache.camel/poms/camel-parent-1.5.0.pom
[INFO] Unable to find resource 'org.apache.camel:camel-parent:pom:1.5.0' in repository java.net (http://download.java.net/maven/1/)
Downloading: http://svn.apache.org/repos/asf/tuscany/maven/org/apache/camel/camel-parent/1.5.0/camel-parent-1.5.0.pom
[INFO] Unable to find resource 'org.apache.camel:camel-parent:pom:1.5.0' in repository tuscany.repo (http://svn.apache.org/repos/asf/tuscany/maven)
Downloading: http://repo1.maven.org/maven2/org/apache/camel/camel-parent/1.5.0/camel-parent-1.5.0.pom
Downloading: http://svn.apache.org/repos/asf/tuscany/maven/org/apache/activemq/activeio-core/3.1.0/activeio-core-3.1.0.pom
[INFO] Unable to find resource 'org.apache.activemq:activeio-core:pom:3.1.0' in repository tuscany.repo (http://svn.apache.org/repos/asf/tuscany/maven)
Downloading: http://repo1.maven.org/maven2/org/apache/activemq/activeio-core/3.1.0/activeio-core-3.1.0.pom
Downloading: http://svn.apache.org/repos/asf/tuscany/maven/org/apache/activemq/activeio-parent/3.1.0/activeio-parent-3.1.0.pom
[INFO] Unable to find resource 'org.apache.activemq:activeio-parent:pom:3.1.0' in repository tuscany.repo (http://svn.apache.org/repos/asf/tuscany/maven)
Downloading: http://repo1.maven.org/maven2/org/apache/activemq/activeio-parent/3.1.0/activeio-parent-3.1.0.pom
Downloading: http://svn.apache.org/repos/asf/tuscany/maven/org/apache/activemq/activemq-core/5.2.0/activemq-core-5.2.0.jar
Downloading: http://svn.apache.org/repos/asf/tuscany/maven/org/apache/camel/camel-core/1.5.0/camel-core-1.5.0.jar
[INFO] Unable to find resource 'org.apache.camel:camel-core:jar:1.5.0' in repository tuscany.repo (http://svn.apache.org/repos/asf/tuscany/maven)
[INFO] Unable to find resource 'org.apache.activemq:activemq-core:jar:5.2.0' in repository tuscany.repo (http://svn.apache.org/repos/asf/tuscany/maven)
Downloading: http://repo1.maven.org/maven2/org/apache/activemq/activemq-core/5.2.0/activemq-core-5.2.0.jar
Downloading: http://repo1.maven.org/maven2/org/apache/camel/camel-core/1.5.0/camel-core-1.5.0.jar
Downloading: http://svn.apache.org/repos/asf/tuscany/maven/org/apache/activemq/activeio-core/3.1.0/activeio-core-3.1.0.jar
[INFO] Unable to find resource 'org.apache.activemq:activeio-core:jar:3.1.0' in repository tuscany.repo (http://svn.apache.org/repos/asf/tuscany/maven)
Downloading: http://repo1.maven.org/maven2/org/apache/activemq/activeio-core/3.1.0/activeio-core-3.1.0.jar
[WARNING] Unable to get resource 'org.apache.camel:camel-core:jar:1.5.0' from repository central (http://repo1.maven.org/maven2): Error transferring file: Connection timed out
[JENKINS] Archiving disabled - not archiving <https://builds.apache.org/job/Tuscany-2x/ws/sca-2x/testing/itest/jms/pom.xml>
[INFO] ------------------------------------------------------------------------
[ERROR] BUILD ERROR
[INFO] ------------------------------------------------------------------------
[INFO] Failed to resolve artifact.
Missing:
----------
1) org.apache.camel:camel-core:jar:1.5.0
Try downloading the file manually from the project website.
Then, install it using the command:
mvn install:install-file -DgroupId=org.apache.camel -DartifactId=camel-core -Dversion=1.5.0 -Dpackaging=jar -Dfile=/path/to/file
Alternatively, if you host your own repository you can deploy the file there:
mvn deploy:deploy-file -DgroupId=org.apache.camel -DartifactId=camel-core -Dversion=1.5.0 -Dpackaging=jar -Dfile=/path/to/file -Durl=[url] -DrepositoryId=[id]
Path to dependency:
1) org.apache.tuscany.sca:itest-jms:pom:2.0-SNAPSHOT
2) org.apache.activemq:activemq-core:jar:5.2.0
3) org.apache.camel:camel-core:jar:1.5.0
----------
1 required artifact is missing.
for artifact:
org.apache.tuscany.sca:itest-jms:pom:2.0-SNAPSHOT
from the specified remote repositories:
central (http://repo1.maven.org/maven2),
tuscany.repo (http://svn.apache.org/repos/asf/tuscany/maven),
Nexus (http://repository.apache.org/snapshots)
[INFO] ------------------------------------------------------------------------
[INFO] For more information, run Maven with the -e switch
[INFO] ------------------------------------------------------------------------
[INFO] Total time: 32 minutes 12 seconds
[INFO] Finished at: Tue Jun 21 13:20:48 UTC 2011
[INFO] Final Memory: 146M/746M
[INFO] ------------------------------------------------------------------------
channel stopped
2011-06-21 13:20:50.237:INFO::Shutdown hook executing
2011-06-21 13:20:50.237:INFO::Shutdown hook complete
Build failed in Jenkins: Tuscany-2x #255
Posted by Apache Jenkins Server <je...@builds.apache.org>.
See <https://builds.apache.org/job/Tuscany-2x/255/changes>
Changes:
[antelder] Update old plugin name
[antelder] Add some experimental code to look at dynamic updates to a running Node
[antelder] Avoid exception in updateCOntribution if the contribution doesn't exist for some reason, and add a new method to uninstall a contribution and stop any started composites that were using it
------------------------------------------
[...truncated 11974 lines...]
AU testing/itest/scabindingmapper/pom.xml
A testing/itest/operation-overloading
A testing/itest/operation-overloading/src
A testing/itest/operation-overloading/src/test
A testing/itest/operation-overloading/src/test/java
A testing/itest/operation-overloading/src/test/java/org
A testing/itest/operation-overloading/src/test/java/org/apache
A testing/itest/operation-overloading/src/test/java/org/apache/tuscany
A testing/itest/operation-overloading/src/test/java/org/apache/tuscany/sca
A testing/itest/operation-overloading/src/test/java/org/apache/tuscany/sca/test
A testing/itest/operation-overloading/src/test/java/org/apache/tuscany/sca/test/opoverload
A testing/itest/operation-overloading/src/test/java/org/apache/tuscany/sca/test/opoverload/impl
AU testing/itest/operation-overloading/src/test/java/org/apache/tuscany/sca/test/opoverload/impl/OverloadATestCase.java
A testing/itest/operation-overloading/src/main
A testing/itest/operation-overloading/src/main/java
A testing/itest/operation-overloading/src/main/java/org
A testing/itest/operation-overloading/src/main/java/org/apache
A testing/itest/operation-overloading/src/main/java/org/apache/tuscany
A testing/itest/operation-overloading/src/main/java/org/apache/tuscany/sca
A testing/itest/operation-overloading/src/main/java/org/apache/tuscany/sca/test
A testing/itest/operation-overloading/src/main/java/org/apache/tuscany/sca/test/opoverload
A testing/itest/operation-overloading/src/main/java/org/apache/tuscany/sca/test/opoverload/impl
AU testing/itest/operation-overloading/src/main/java/org/apache/tuscany/sca/test/opoverload/impl/OverloadATarget.java
AU testing/itest/operation-overloading/src/main/java/org/apache/tuscany/sca/test/opoverload/impl/OverloadASource.java
AU testing/itest/operation-overloading/src/main/java/org/apache/tuscany/sca/test/opoverload/OverloadASourceTarget.java
A testing/itest/operation-overloading/src/main/resources
AU testing/itest/operation-overloading/src/main/resources/OperationOverload.composite
AU testing/itest/operation-overloading/pom.xml
A testing/itest/node-launcher-equinox
A testing/itest/node-launcher-equinox/src
A testing/itest/node-launcher-equinox/src/test
A testing/itest/node-launcher-equinox/src/test/java
A testing/itest/node-launcher-equinox/src/test/java/hello
AU testing/itest/node-launcher-equinox/src/test/java/hello/HelloWorldClient.java
AU testing/itest/node-launcher-equinox/src/test/java/hello/HelloWorld.java
AU testing/itest/node-launcher-equinox/src/test/java/hello/HelloWorldImpl.java
A testing/itest/node-launcher-equinox/src/test/java/org
A testing/itest/node-launcher-equinox/src/test/java/org/apache
A testing/itest/node-launcher-equinox/src/test/java/org/apache/tuscany
A testing/itest/node-launcher-equinox/src/test/java/org/apache/tuscany/sca
A testing/itest/node-launcher-equinox/src/test/java/org/apache/tuscany/sca/node
A testing/itest/node-launcher-equinox/src/test/java/org/apache/tuscany/sca/node/equinox
A testing/itest/node-launcher-equinox/src/test/java/org/apache/tuscany/sca/node/equinox/launcher
AU testing/itest/node-launcher-equinox/src/test/java/org/apache/tuscany/sca/node/equinox/launcher/NodeLauncherTestCase.java
AU testing/itest/node-launcher-equinox/src/test/java/org/apache/tuscany/sca/node/equinox/launcher/EquinoxOSGiHostTestCase.java
A testing/itest/node-launcher-equinox/src/test/resources
AU testing/itest/node-launcher-equinox/src/test/resources/HelloWorld.composite
A testing/itest/node-launcher-equinox/pom.xml
A testing/itest/base
A testing/itest/base/dependencies
A testing/itest/base/dependencies/src
A testing/itest/base/dependencies/src/test
A testing/itest/base/dependencies/src/test/java
A testing/itest/base/dependencies/src/test/java/org
A testing/itest/base/dependencies/src/test/java/org/apache
A testing/itest/base/dependencies/src/test/java/org/apache/tuscany
A testing/itest/base/dependencies/src/test/java/org/apache/tuscany/sca
A testing/itest/base/dependencies/src/test/java/org/apache/tuscany/sca/itest
A testing/itest/base/dependencies/src/test/java/org/apache/tuscany/sca/itest/base
A testing/itest/base/dependencies/src/test/java/org/apache/tuscany/sca/itest/base/dependencies
A testing/itest/base/dependencies/src/test/java/org/apache/tuscany/sca/itest/base/dependencies/ValidateDependenciesTestCase.java
A testing/itest/base/dependencies/pom.xml
A testing/itest/base/pom.xml
A testing/itest/callback-basic
A testing/itest/callback-basic/src
A testing/itest/callback-basic/src/test
A testing/itest/callback-basic/src/test/java
A testing/itest/callback-basic/src/test/java/org
A testing/itest/callback-basic/src/test/java/org/apache
A testing/itest/callback-basic/src/test/java/org/apache/tuscany
A testing/itest/callback-basic/src/test/java/org/apache/tuscany/sca
A testing/itest/callback-basic/src/test/java/org/apache/tuscany/sca/test
AU testing/itest/callback-basic/src/test/java/org/apache/tuscany/sca/test/CallBackBasicTestCase.java
A testing/itest/callback-basic/src/main
A testing/itest/callback-basic/src/main/java
A testing/itest/callback-basic/src/main/java/org
A testing/itest/callback-basic/src/main/java/org/apache
A testing/itest/callback-basic/src/main/java/org/apache/tuscany
A testing/itest/callback-basic/src/main/java/org/apache/tuscany/sca
A testing/itest/callback-basic/src/main/java/org/apache/tuscany/sca/test
AU testing/itest/callback-basic/src/main/java/org/apache/tuscany/sca/test/CallBackBasicClientImpl.java
AU testing/itest/callback-basic/src/main/java/org/apache/tuscany/sca/test/CallBackBasicService.java
AU testing/itest/callback-basic/src/main/java/org/apache/tuscany/sca/test/CallBackBasicServiceImpl.java
AU testing/itest/callback-basic/src/main/java/org/apache/tuscany/sca/test/CallBackBasicCallBack.java
AU testing/itest/callback-basic/src/main/java/org/apache/tuscany/sca/test/CallBackBasicClient.java
A testing/itest/callback-basic/src/main/resources
AU testing/itest/callback-basic/src/main/resources/CallBackBasicTest.composite
A testing/itest/callback-basic/src/main/resources/META-INF
AU testing/itest/callback-basic/src/main/resources/META-INF/sca-contribution.xml
AU testing/itest/callback-basic/pom.xml
A testing/compliance-tests
A testing/compliance-tests/assembly
A testing/compliance-tests/assembly/src
A testing/compliance-tests/assembly/src/test
A testing/compliance-tests/assembly/src/test/java
A testing/compliance-tests/assembly/src/test/java/org
A testing/compliance-tests/assembly/src/test/java/org/apache
A testing/compliance-tests/assembly/src/test/java/org/apache/tuscany
A testing/compliance-tests/assembly/src/test/java/org/apache/tuscany/sca
A testing/compliance-tests/assembly/src/test/java/org/apache/tuscany/sca/otest
A testing/compliance-tests/assembly/src/test/java/org/apache/tuscany/sca/otest/TuscanyRuntimeBridge.java
A testing/compliance-tests/assembly/src/test/resources
A testing/compliance-tests/assembly/src/test/resources/tuscany-oasis-sca-tests-errors.properties
A testing/compliance-tests/assembly/src/test/resources/oasis-sca-tests.properties
A testing/compliance-tests/assembly/src/main
A testing/compliance-tests/assembly/pom.xml
A testing/compliance-tests/policy
A testing/compliance-tests/policy/src
A testing/compliance-tests/policy/src/test
A testing/compliance-tests/policy/src/test/java
A testing/compliance-tests/policy/src/test/java/org
A testing/compliance-tests/policy/src/test/java/org/apache
A testing/compliance-tests/policy/src/test/java/org/apache/tuscany
A testing/compliance-tests/policy/src/test/java/org/apache/tuscany/sca
A testing/compliance-tests/policy/src/test/java/org/apache/tuscany/sca/otest
A testing/compliance-tests/policy/src/test/java/org/apache/tuscany/sca/otest/TuscanyRuntimeBridge.java
A testing/compliance-tests/policy/src/test/resources
A testing/compliance-tests/policy/src/test/resources/tuscany-oasis-sca-tests-errors.properties
A testing/compliance-tests/policy/src/test/resources/oasis-sca-tests.properties
A testing/compliance-tests/policy/pom.xml
A testing/compliance-tests/binding-jms
A testing/compliance-tests/binding-jms/src
A testing/compliance-tests/binding-jms/src/test
A testing/compliance-tests/binding-jms/src/test/java
A testing/compliance-tests/binding-jms/src/test/java/org
A testing/compliance-tests/binding-jms/src/test/java/org/apache
A testing/compliance-tests/binding-jms/src/test/java/org/apache/tuscany
A testing/compliance-tests/binding-jms/src/test/java/org/apache/tuscany/sca
A testing/compliance-tests/binding-jms/src/test/java/org/apache/tuscany/sca/otest
AU testing/compliance-tests/binding-jms/src/test/java/org/apache/tuscany/sca/otest/TuscanyRuntimeBridge.java
A testing/compliance-tests/binding-jms/src/test/resources
AU testing/compliance-tests/binding-jms/src/test/resources/tuscany-oasis-sca-tests-errors.properties
AU testing/compliance-tests/binding-jms/src/test/resources/oasis-sca-tests.properties
AU testing/compliance-tests/binding-jms/pom.xml
A testing/compliance-tests/binding-ws
A testing/compliance-tests/binding-ws/src
A testing/compliance-tests/binding-ws/src/test
A testing/compliance-tests/binding-ws/src/test/java
A testing/compliance-tests/binding-ws/src/test/java/org
A testing/compliance-tests/binding-ws/src/test/java/org/apache
A testing/compliance-tests/binding-ws/src/test/java/org/apache/tuscany
A testing/compliance-tests/binding-ws/src/test/java/org/apache/tuscany/sca
A testing/compliance-tests/binding-ws/src/test/java/org/apache/tuscany/sca/otest
AU testing/compliance-tests/binding-ws/src/test/java/org/apache/tuscany/sca/otest/TuscanyRuntimeBridge.java
A testing/compliance-tests/binding-ws/src/test/resources
AU testing/compliance-tests/binding-ws/src/test/resources/tuscany-oasis-sca-tests-errors.properties
AU testing/compliance-tests/binding-ws/src/test/resources/oasis-sca-tests.properties
A testing/compliance-tests/binding-ws/sca_variables.dtd
AU testing/compliance-tests/binding-ws/pom.xml
A testing/compliance-tests/java-caa
A testing/compliance-tests/java-caa/src
A testing/compliance-tests/java-caa/src/test
A testing/compliance-tests/java-caa/src/test/java
A testing/compliance-tests/java-caa/src/test/java/org
A testing/compliance-tests/java-caa/src/test/java/org/apache
A testing/compliance-tests/java-caa/src/test/java/org/apache/tuscany
A testing/compliance-tests/java-caa/src/test/java/org/apache/tuscany/sca
A testing/compliance-tests/java-caa/src/test/java/org/apache/tuscany/sca/otest
A testing/compliance-tests/java-caa/src/test/java/org/apache/tuscany/sca/otest/TuscanyRuntimeBridge.java
A testing/compliance-tests/java-caa/src/test/resources
A testing/compliance-tests/java-caa/src/test/resources/tuscany-oasis-sca-tests-errors.properties
A testing/compliance-tests/java-caa/src/test/resources/oasis-sca-tests.properties
A testing/compliance-tests/java-caa/pom.xml
A testing/compliance-tests/java-ci
A testing/compliance-tests/java-ci/src
A testing/compliance-tests/java-ci/src/test
A testing/compliance-tests/java-ci/src/test/java
A testing/compliance-tests/java-ci/src/test/java/org
A testing/compliance-tests/java-ci/src/test/java/org/apache
A testing/compliance-tests/java-ci/src/test/java/org/apache/tuscany
A testing/compliance-tests/java-ci/src/test/java/org/apache/tuscany/sca
A testing/compliance-tests/java-ci/src/test/java/org/apache/tuscany/sca/otest
A testing/compliance-tests/java-ci/src/test/java/org/apache/tuscany/sca/otest/TuscanyRuntimeBridge.java
A testing/compliance-tests/java-ci/src/test/resources
A testing/compliance-tests/java-ci/src/test/resources/tuscany-oasis-sca-tests-errors.properties
A testing/compliance-tests/java-ci/src/test/resources/oasis-sca-tests.properties
A testing/compliance-tests/java-ci/pom.xml
A testing/compliance-tests/pom.xml
A features
A features/web20
AU features/web20/pom.xml
A features/osgi
AU features/osgi/pom.xml
A features/sdo
AU features/sdo/pom.xml
A features/ejava
AU features/ejava/pom.xml
A features/all
AU features/all/pom.xml
A features/core
AU features/core/pom.xml
A features/api
AU features/api/pom.xml
A features/eclipse-pde
AU features/eclipse-pde/pom.xml
AU features/pom.xml
A features/process
AU features/process/pom.xml
A features/webapp
AU features/webapp/pom.xml
A features/webservice
AU features/webservice/pom.xml
U .
At revision 1137830
ERROR: Ignore Problem expanding maven opts macros org.jenkinsci.plugins.tokenmacro.TokenMacro
Found mavenVersion 2.2.1 from file jar:file:/home/hudson/tools/maven/latest/lib/maven-2.2.1-uber.jar!/META-INF/maven/org.apache.maven/maven-core/pom.properties
Parsing POMs
failed to transfer Unable to locate resource in repository
downloaded artifact http://repo1.maven.org/maven2//org/apache/apache/8/apache-8.pom
ERROR: Failed to parse POMs
hudson.util.IOException2: remote file operation failed: <https://builds.apache.org/job/Tuscany-2x/ws/sca-2x> at hudson.remoting.Channel@779bbaa7:ubuntu1
at hudson.FilePath.act(FilePath.java:754)
at hudson.FilePath.act(FilePath.java:740)
at hudson.maven.MavenModuleSetBuild$RunnerImpl.parsePoms(MavenModuleSetBuild.java:817)
at hudson.maven.MavenModuleSetBuild$RunnerImpl.doRun(MavenModuleSetBuild.java:617)
at hudson.model.AbstractBuild$AbstractRunner.run(AbstractBuild.java:429)
at hudson.model.Run.run(Run.java:1374)
at hudson.maven.MavenModuleSetBuild.run(MavenModuleSetBuild.java:467)
at hudson.model.ResourceController.execute(ResourceController.java:88)
at hudson.model.Executor.run(Executor.java:145)
Caused by: hudson.remoting.ProxyException: hudson.maven.MavenModuleSetBuild$MavenExecutionException: org.apache.maven.project.ProjectBuildingException: Some problems were encountered while processing the POMs:
[WARNING] 'parent.relativePath' points at org.apache.tuscany.sca:itest-policy instead of org.apache.tuscany.sca:itest-ws, please verify your project structure @ line 22, column 13
[FATAL] Non-resolvable parent POM: Could not find artifact org.apache.tuscany.sca:itest-ws:pom:2.0-SNAPSHOT and 'parent.relativePath' points at wrong local POM @ line 22, column 13
at hudson.maven.MavenModuleSetBuild$PomParser.invoke(MavenModuleSetBuild.java:1327)
at hudson.maven.MavenModuleSetBuild$PomParser.invoke(MavenModuleSetBuild.java:1110)
at hudson.FilePath$FileCallableWrapper.call(FilePath.java:1979)
at hudson.remoting.UserRequest.perform(UserRequest.java:118)
at hudson.remoting.UserRequest.perform(UserRequest.java:48)
at hudson.remoting.Request$2.run(Request.java:270)
at java.util.concurrent.Executors$RunnableAdapter.call(Executors.java:471)
at java.util.concurrent.FutureTask$Sync.innerRun(FutureTask.java:334)
at java.util.concurrent.FutureTask.run(FutureTask.java:166)
at java.util.concurrent.ThreadPoolExecutor.runWorker(ThreadPoolExecutor.java:1110)
at java.util.concurrent.ThreadPoolExecutor$Worker.run(ThreadPoolExecutor.java:603)
at java.lang.Thread.run(Thread.java:636)
Caused by: hudson.remoting.ProxyException: org.apache.maven.project.ProjectBuildingException: Some problems were encountered while processing the POMs:
[WARNING] 'parent.relativePath' points at org.apache.tuscany.sca:itest-policy instead of org.apache.tuscany.sca:itest-ws, please verify your project structure @ line 22, column 13
[FATAL] Non-resolvable parent POM: Could not find artifact org.apache.tuscany.sca:itest-ws:pom:2.0-SNAPSHOT and 'parent.relativePath' points at wrong local POM @ line 22, column 13
at org.apache.maven.project.DefaultProjectBuilder.build(DefaultProjectBuilder.java:339)
at hudson.maven.MavenEmbedder.buildProjects(MavenEmbedder.java:360)
at hudson.maven.MavenEmbedder.readProjects(MavenEmbedder.java:330)
at hudson.maven.MavenEmbedder.readProject(MavenEmbedder.java:321)
at hudson.maven.MavenModuleSetBuild$PomParser.readChilds(MavenModuleSetBuild.java:1381)
at hudson.maven.MavenModuleSetBuild$PomParser.readChilds(MavenModuleSetBuild.java:1384)
at hudson.maven.MavenModuleSetBuild$PomParser.readChilds(MavenModuleSetBuild.java:1384)
at hudson.maven.MavenModuleSetBuild$PomParser.invoke(MavenModuleSetBuild.java:1288)
... 11 more
Build failed in Jenkins: Tuscany-2x #254
Posted by Apache Jenkins Server <je...@builds.apache.org>.
See <https://builds.apache.org/job/Tuscany-2x/254/changes>
Changes:
[antelder] Update contribution update to handle additional deployed composites and a testcase for that
[antelder] Add an impl to the update contribution method and a testcase
[antelder] Start adding a method to update an installed contribution
[antelder] Add another test for recursive composites
[antelder] add testcase missed off on the composite update commit
[antelder] Correct typo
------------------------------------------
[...truncated 11971 lines...]
AU testing/itest/scabindingmapper/pom.xml
A testing/itest/operation-overloading
A testing/itest/operation-overloading/src
A testing/itest/operation-overloading/src/test
A testing/itest/operation-overloading/src/test/java
A testing/itest/operation-overloading/src/test/java/org
A testing/itest/operation-overloading/src/test/java/org/apache
A testing/itest/operation-overloading/src/test/java/org/apache/tuscany
A testing/itest/operation-overloading/src/test/java/org/apache/tuscany/sca
A testing/itest/operation-overloading/src/test/java/org/apache/tuscany/sca/test
A testing/itest/operation-overloading/src/test/java/org/apache/tuscany/sca/test/opoverload
A testing/itest/operation-overloading/src/test/java/org/apache/tuscany/sca/test/opoverload/impl
AU testing/itest/operation-overloading/src/test/java/org/apache/tuscany/sca/test/opoverload/impl/OverloadATestCase.java
A testing/itest/operation-overloading/src/main
A testing/itest/operation-overloading/src/main/java
A testing/itest/operation-overloading/src/main/java/org
A testing/itest/operation-overloading/src/main/java/org/apache
A testing/itest/operation-overloading/src/main/java/org/apache/tuscany
A testing/itest/operation-overloading/src/main/java/org/apache/tuscany/sca
A testing/itest/operation-overloading/src/main/java/org/apache/tuscany/sca/test
A testing/itest/operation-overloading/src/main/java/org/apache/tuscany/sca/test/opoverload
A testing/itest/operation-overloading/src/main/java/org/apache/tuscany/sca/test/opoverload/impl
AU testing/itest/operation-overloading/src/main/java/org/apache/tuscany/sca/test/opoverload/impl/OverloadATarget.java
AU testing/itest/operation-overloading/src/main/java/org/apache/tuscany/sca/test/opoverload/impl/OverloadASource.java
AU testing/itest/operation-overloading/src/main/java/org/apache/tuscany/sca/test/opoverload/OverloadASourceTarget.java
A testing/itest/operation-overloading/src/main/resources
AU testing/itest/operation-overloading/src/main/resources/OperationOverload.composite
AU testing/itest/operation-overloading/pom.xml
A testing/itest/node-launcher-equinox
A testing/itest/node-launcher-equinox/src
A testing/itest/node-launcher-equinox/src/test
A testing/itest/node-launcher-equinox/src/test/java
A testing/itest/node-launcher-equinox/src/test/java/hello
AU testing/itest/node-launcher-equinox/src/test/java/hello/HelloWorldClient.java
AU testing/itest/node-launcher-equinox/src/test/java/hello/HelloWorld.java
AU testing/itest/node-launcher-equinox/src/test/java/hello/HelloWorldImpl.java
A testing/itest/node-launcher-equinox/src/test/java/org
A testing/itest/node-launcher-equinox/src/test/java/org/apache
A testing/itest/node-launcher-equinox/src/test/java/org/apache/tuscany
A testing/itest/node-launcher-equinox/src/test/java/org/apache/tuscany/sca
A testing/itest/node-launcher-equinox/src/test/java/org/apache/tuscany/sca/node
A testing/itest/node-launcher-equinox/src/test/java/org/apache/tuscany/sca/node/equinox
A testing/itest/node-launcher-equinox/src/test/java/org/apache/tuscany/sca/node/equinox/launcher
AU testing/itest/node-launcher-equinox/src/test/java/org/apache/tuscany/sca/node/equinox/launcher/NodeLauncherTestCase.java
AU testing/itest/node-launcher-equinox/src/test/java/org/apache/tuscany/sca/node/equinox/launcher/EquinoxOSGiHostTestCase.java
A testing/itest/node-launcher-equinox/src/test/resources
AU testing/itest/node-launcher-equinox/src/test/resources/HelloWorld.composite
A testing/itest/node-launcher-equinox/pom.xml
A testing/itest/base
A testing/itest/base/dependencies
A testing/itest/base/dependencies/src
A testing/itest/base/dependencies/src/test
A testing/itest/base/dependencies/src/test/java
A testing/itest/base/dependencies/src/test/java/org
A testing/itest/base/dependencies/src/test/java/org/apache
A testing/itest/base/dependencies/src/test/java/org/apache/tuscany
A testing/itest/base/dependencies/src/test/java/org/apache/tuscany/sca
A testing/itest/base/dependencies/src/test/java/org/apache/tuscany/sca/itest
A testing/itest/base/dependencies/src/test/java/org/apache/tuscany/sca/itest/base
A testing/itest/base/dependencies/src/test/java/org/apache/tuscany/sca/itest/base/dependencies
A testing/itest/base/dependencies/src/test/java/org/apache/tuscany/sca/itest/base/dependencies/ValidateDependenciesTestCase.java
A testing/itest/base/dependencies/pom.xml
A testing/itest/base/pom.xml
A testing/itest/callback-basic
A testing/itest/callback-basic/src
A testing/itest/callback-basic/src/test
A testing/itest/callback-basic/src/test/java
A testing/itest/callback-basic/src/test/java/org
A testing/itest/callback-basic/src/test/java/org/apache
A testing/itest/callback-basic/src/test/java/org/apache/tuscany
A testing/itest/callback-basic/src/test/java/org/apache/tuscany/sca
A testing/itest/callback-basic/src/test/java/org/apache/tuscany/sca/test
AU testing/itest/callback-basic/src/test/java/org/apache/tuscany/sca/test/CallBackBasicTestCase.java
A testing/itest/callback-basic/src/main
A testing/itest/callback-basic/src/main/java
A testing/itest/callback-basic/src/main/java/org
A testing/itest/callback-basic/src/main/java/org/apache
A testing/itest/callback-basic/src/main/java/org/apache/tuscany
A testing/itest/callback-basic/src/main/java/org/apache/tuscany/sca
A testing/itest/callback-basic/src/main/java/org/apache/tuscany/sca/test
AU testing/itest/callback-basic/src/main/java/org/apache/tuscany/sca/test/CallBackBasicClientImpl.java
AU testing/itest/callback-basic/src/main/java/org/apache/tuscany/sca/test/CallBackBasicService.java
AU testing/itest/callback-basic/src/main/java/org/apache/tuscany/sca/test/CallBackBasicServiceImpl.java
AU testing/itest/callback-basic/src/main/java/org/apache/tuscany/sca/test/CallBackBasicCallBack.java
AU testing/itest/callback-basic/src/main/java/org/apache/tuscany/sca/test/CallBackBasicClient.java
A testing/itest/callback-basic/src/main/resources
AU testing/itest/callback-basic/src/main/resources/CallBackBasicTest.composite
A testing/itest/callback-basic/src/main/resources/META-INF
AU testing/itest/callback-basic/src/main/resources/META-INF/sca-contribution.xml
AU testing/itest/callback-basic/pom.xml
A testing/compliance-tests
A testing/compliance-tests/assembly
A testing/compliance-tests/assembly/src
A testing/compliance-tests/assembly/src/test
A testing/compliance-tests/assembly/src/test/java
A testing/compliance-tests/assembly/src/test/java/org
A testing/compliance-tests/assembly/src/test/java/org/apache
A testing/compliance-tests/assembly/src/test/java/org/apache/tuscany
A testing/compliance-tests/assembly/src/test/java/org/apache/tuscany/sca
A testing/compliance-tests/assembly/src/test/java/org/apache/tuscany/sca/otest
A testing/compliance-tests/assembly/src/test/java/org/apache/tuscany/sca/otest/TuscanyRuntimeBridge.java
A testing/compliance-tests/assembly/src/test/resources
A testing/compliance-tests/assembly/src/test/resources/tuscany-oasis-sca-tests-errors.properties
A testing/compliance-tests/assembly/src/test/resources/oasis-sca-tests.properties
A testing/compliance-tests/assembly/src/main
A testing/compliance-tests/assembly/pom.xml
A testing/compliance-tests/policy
A testing/compliance-tests/policy/src
A testing/compliance-tests/policy/src/test
A testing/compliance-tests/policy/src/test/java
A testing/compliance-tests/policy/src/test/java/org
A testing/compliance-tests/policy/src/test/java/org/apache
A testing/compliance-tests/policy/src/test/java/org/apache/tuscany
A testing/compliance-tests/policy/src/test/java/org/apache/tuscany/sca
A testing/compliance-tests/policy/src/test/java/org/apache/tuscany/sca/otest
A testing/compliance-tests/policy/src/test/java/org/apache/tuscany/sca/otest/TuscanyRuntimeBridge.java
A testing/compliance-tests/policy/src/test/resources
A testing/compliance-tests/policy/src/test/resources/tuscany-oasis-sca-tests-errors.properties
A testing/compliance-tests/policy/src/test/resources/oasis-sca-tests.properties
A testing/compliance-tests/policy/pom.xml
A testing/compliance-tests/binding-jms
A testing/compliance-tests/binding-jms/src
A testing/compliance-tests/binding-jms/src/test
A testing/compliance-tests/binding-jms/src/test/java
A testing/compliance-tests/binding-jms/src/test/java/org
A testing/compliance-tests/binding-jms/src/test/java/org/apache
A testing/compliance-tests/binding-jms/src/test/java/org/apache/tuscany
A testing/compliance-tests/binding-jms/src/test/java/org/apache/tuscany/sca
A testing/compliance-tests/binding-jms/src/test/java/org/apache/tuscany/sca/otest
AU testing/compliance-tests/binding-jms/src/test/java/org/apache/tuscany/sca/otest/TuscanyRuntimeBridge.java
A testing/compliance-tests/binding-jms/src/test/resources
AU testing/compliance-tests/binding-jms/src/test/resources/tuscany-oasis-sca-tests-errors.properties
AU testing/compliance-tests/binding-jms/src/test/resources/oasis-sca-tests.properties
AU testing/compliance-tests/binding-jms/pom.xml
A testing/compliance-tests/binding-ws
A testing/compliance-tests/binding-ws/src
A testing/compliance-tests/binding-ws/src/test
A testing/compliance-tests/binding-ws/src/test/java
A testing/compliance-tests/binding-ws/src/test/java/org
A testing/compliance-tests/binding-ws/src/test/java/org/apache
A testing/compliance-tests/binding-ws/src/test/java/org/apache/tuscany
A testing/compliance-tests/binding-ws/src/test/java/org/apache/tuscany/sca
A testing/compliance-tests/binding-ws/src/test/java/org/apache/tuscany/sca/otest
AU testing/compliance-tests/binding-ws/src/test/java/org/apache/tuscany/sca/otest/TuscanyRuntimeBridge.java
A testing/compliance-tests/binding-ws/src/test/resources
AU testing/compliance-tests/binding-ws/src/test/resources/tuscany-oasis-sca-tests-errors.properties
AU testing/compliance-tests/binding-ws/src/test/resources/oasis-sca-tests.properties
A testing/compliance-tests/binding-ws/sca_variables.dtd
AU testing/compliance-tests/binding-ws/pom.xml
A testing/compliance-tests/java-caa
A testing/compliance-tests/java-caa/src
A testing/compliance-tests/java-caa/src/test
A testing/compliance-tests/java-caa/src/test/java
A testing/compliance-tests/java-caa/src/test/java/org
A testing/compliance-tests/java-caa/src/test/java/org/apache
A testing/compliance-tests/java-caa/src/test/java/org/apache/tuscany
A testing/compliance-tests/java-caa/src/test/java/org/apache/tuscany/sca
A testing/compliance-tests/java-caa/src/test/java/org/apache/tuscany/sca/otest
A testing/compliance-tests/java-caa/src/test/java/org/apache/tuscany/sca/otest/TuscanyRuntimeBridge.java
A testing/compliance-tests/java-caa/src/test/resources
A testing/compliance-tests/java-caa/src/test/resources/tuscany-oasis-sca-tests-errors.properties
A testing/compliance-tests/java-caa/src/test/resources/oasis-sca-tests.properties
A testing/compliance-tests/java-caa/pom.xml
A testing/compliance-tests/java-ci
A testing/compliance-tests/java-ci/src
A testing/compliance-tests/java-ci/src/test
A testing/compliance-tests/java-ci/src/test/java
A testing/compliance-tests/java-ci/src/test/java/org
A testing/compliance-tests/java-ci/src/test/java/org/apache
A testing/compliance-tests/java-ci/src/test/java/org/apache/tuscany
A testing/compliance-tests/java-ci/src/test/java/org/apache/tuscany/sca
A testing/compliance-tests/java-ci/src/test/java/org/apache/tuscany/sca/otest
A testing/compliance-tests/java-ci/src/test/java/org/apache/tuscany/sca/otest/TuscanyRuntimeBridge.java
A testing/compliance-tests/java-ci/src/test/resources
A testing/compliance-tests/java-ci/src/test/resources/tuscany-oasis-sca-tests-errors.properties
A testing/compliance-tests/java-ci/src/test/resources/oasis-sca-tests.properties
A testing/compliance-tests/java-ci/pom.xml
A testing/compliance-tests/pom.xml
A features
A features/web20
AU features/web20/pom.xml
A features/osgi
AU features/osgi/pom.xml
A features/sdo
AU features/sdo/pom.xml
A features/ejava
AU features/ejava/pom.xml
A features/all
AU features/all/pom.xml
A features/core
AU features/core/pom.xml
A features/api
AU features/api/pom.xml
A features/eclipse-pde
AU features/eclipse-pde/pom.xml
AU features/pom.xml
A features/process
AU features/process/pom.xml
A features/webapp
AU features/webapp/pom.xml
A features/webservice
AU features/webservice/pom.xml
U .
At revision 1137471
ERROR: Ignore Problem expanding maven opts macros org.jenkinsci.plugins.tokenmacro.TokenMacro
Found mavenVersion 2.2.1 from file jar:file:/home/hudson/tools/maven/latest/lib/maven-2.2.1-uber.jar!/META-INF/maven/org.apache.maven/maven-core/pom.properties
Parsing POMs
failed to transfer Unable to locate resource in repository
downloaded artifact http://repo1.maven.org/maven2//org/apache/apache/8/apache-8.pom
ERROR: Failed to parse POMs
hudson.util.IOException2: remote file operation failed: <https://builds.apache.org/job/Tuscany-2x/ws/sca-2x> at hudson.remoting.Channel@4b1cb97d:ubuntu1
at hudson.FilePath.act(FilePath.java:754)
at hudson.FilePath.act(FilePath.java:740)
at hudson.maven.MavenModuleSetBuild$RunnerImpl.parsePoms(MavenModuleSetBuild.java:817)
at hudson.maven.MavenModuleSetBuild$RunnerImpl.doRun(MavenModuleSetBuild.java:617)
at hudson.model.AbstractBuild$AbstractRunner.run(AbstractBuild.java:429)
at hudson.model.Run.run(Run.java:1374)
at hudson.maven.MavenModuleSetBuild.run(MavenModuleSetBuild.java:467)
at hudson.model.ResourceController.execute(ResourceController.java:88)
at hudson.model.Executor.run(Executor.java:145)
Caused by: hudson.remoting.ProxyException: hudson.maven.MavenModuleSetBuild$MavenExecutionException: org.apache.maven.project.ProjectBuildingException: Some problems were encountered while processing the POMs:
[WARNING] 'parent.relativePath' points at org.apache.tuscany.sca:itest-policy instead of org.apache.tuscany.sca:itest-ws, please verify your project structure @ line 22, column 13
[FATAL] Non-resolvable parent POM: Could not find artifact org.apache.tuscany.sca:itest-ws:pom:2.0-SNAPSHOT and 'parent.relativePath' points at wrong local POM @ line 22, column 13
at hudson.maven.MavenModuleSetBuild$PomParser.invoke(MavenModuleSetBuild.java:1327)
at hudson.maven.MavenModuleSetBuild$PomParser.invoke(MavenModuleSetBuild.java:1110)
at hudson.FilePath$FileCallableWrapper.call(FilePath.java:1979)
at hudson.remoting.UserRequest.perform(UserRequest.java:118)
at hudson.remoting.UserRequest.perform(UserRequest.java:48)
at hudson.remoting.Request$2.run(Request.java:270)
at java.util.concurrent.Executors$RunnableAdapter.call(Executors.java:471)
at java.util.concurrent.FutureTask$Sync.innerRun(FutureTask.java:334)
at java.util.concurrent.FutureTask.run(FutureTask.java:166)
at java.util.concurrent.ThreadPoolExecutor.runWorker(ThreadPoolExecutor.java:1110)
at java.util.concurrent.ThreadPoolExecutor$Worker.run(ThreadPoolExecutor.java:603)
at java.lang.Thread.run(Thread.java:636)
Caused by: hudson.remoting.ProxyException: org.apache.maven.project.ProjectBuildingException: Some problems were encountered while processing the POMs:
[WARNING] 'parent.relativePath' points at org.apache.tuscany.sca:itest-policy instead of org.apache.tuscany.sca:itest-ws, please verify your project structure @ line 22, column 13
[FATAL] Non-resolvable parent POM: Could not find artifact org.apache.tuscany.sca:itest-ws:pom:2.0-SNAPSHOT and 'parent.relativePath' points at wrong local POM @ line 22, column 13
at org.apache.maven.project.DefaultProjectBuilder.build(DefaultProjectBuilder.java:339)
at hudson.maven.MavenEmbedder.buildProjects(MavenEmbedder.java:360)
at hudson.maven.MavenEmbedder.readProjects(MavenEmbedder.java:330)
at hudson.maven.MavenEmbedder.readProject(MavenEmbedder.java:321)
at hudson.maven.MavenModuleSetBuild$PomParser.readChilds(MavenModuleSetBuild.java:1381)
at hudson.maven.MavenModuleSetBuild$PomParser.readChilds(MavenModuleSetBuild.java:1384)
at hudson.maven.MavenModuleSetBuild$PomParser.readChilds(MavenModuleSetBuild.java:1384)
at hudson.maven.MavenModuleSetBuild$PomParser.invoke(MavenModuleSetBuild.java:1288)
... 11 more
Build failed in Jenkins: Tuscany-2x #253
Posted by Apache Jenkins Server <je...@builds.apache.org>.
See <https://builds.apache.org/job/Tuscany-2x/253/changes>
Changes:
[antelder] Add a method to restart started composites that depend on another composite. That so you can updated a composite and have everything thats using it pick up the changes
[antelder] Clear out old endpoints before adding the binding endpoints. Without this you get duplicated endpoints when reusing contributions. It may be that we need a better way of resetting this and other things for restarts
[antelder] Keep track of the fuse composites
[antelder] Update Composite to keep track of 'fused' includes. 'Fused' is the term the code is using for the merging of the inlcudes inline into the composite. But after that process has happened there was nolonger any way to find what includes a composite had so this new method enables still finding that
[antelder] Change setting a contributions dependencies explicitly from using the domain.properties file to use a <contributionName>.dependencies file to be more consistent with how the other files are used
------------------------------------------
[...truncated 11964 lines...]
AU testing/itest/scabindingmapper/pom.xml
A testing/itest/operation-overloading
A testing/itest/operation-overloading/src
A testing/itest/operation-overloading/src/test
A testing/itest/operation-overloading/src/test/java
A testing/itest/operation-overloading/src/test/java/org
A testing/itest/operation-overloading/src/test/java/org/apache
A testing/itest/operation-overloading/src/test/java/org/apache/tuscany
A testing/itest/operation-overloading/src/test/java/org/apache/tuscany/sca
A testing/itest/operation-overloading/src/test/java/org/apache/tuscany/sca/test
A testing/itest/operation-overloading/src/test/java/org/apache/tuscany/sca/test/opoverload
A testing/itest/operation-overloading/src/test/java/org/apache/tuscany/sca/test/opoverload/impl
AU testing/itest/operation-overloading/src/test/java/org/apache/tuscany/sca/test/opoverload/impl/OverloadATestCase.java
A testing/itest/operation-overloading/src/main
A testing/itest/operation-overloading/src/main/java
A testing/itest/operation-overloading/src/main/java/org
A testing/itest/operation-overloading/src/main/java/org/apache
A testing/itest/operation-overloading/src/main/java/org/apache/tuscany
A testing/itest/operation-overloading/src/main/java/org/apache/tuscany/sca
A testing/itest/operation-overloading/src/main/java/org/apache/tuscany/sca/test
A testing/itest/operation-overloading/src/main/java/org/apache/tuscany/sca/test/opoverload
A testing/itest/operation-overloading/src/main/java/org/apache/tuscany/sca/test/opoverload/impl
AU testing/itest/operation-overloading/src/main/java/org/apache/tuscany/sca/test/opoverload/impl/OverloadATarget.java
AU testing/itest/operation-overloading/src/main/java/org/apache/tuscany/sca/test/opoverload/impl/OverloadASource.java
AU testing/itest/operation-overloading/src/main/java/org/apache/tuscany/sca/test/opoverload/OverloadASourceTarget.java
A testing/itest/operation-overloading/src/main/resources
AU testing/itest/operation-overloading/src/main/resources/OperationOverload.composite
AU testing/itest/operation-overloading/pom.xml
A testing/itest/node-launcher-equinox
A testing/itest/node-launcher-equinox/src
A testing/itest/node-launcher-equinox/src/test
A testing/itest/node-launcher-equinox/src/test/java
A testing/itest/node-launcher-equinox/src/test/java/hello
AU testing/itest/node-launcher-equinox/src/test/java/hello/HelloWorldClient.java
AU testing/itest/node-launcher-equinox/src/test/java/hello/HelloWorld.java
AU testing/itest/node-launcher-equinox/src/test/java/hello/HelloWorldImpl.java
A testing/itest/node-launcher-equinox/src/test/java/org
A testing/itest/node-launcher-equinox/src/test/java/org/apache
A testing/itest/node-launcher-equinox/src/test/java/org/apache/tuscany
A testing/itest/node-launcher-equinox/src/test/java/org/apache/tuscany/sca
A testing/itest/node-launcher-equinox/src/test/java/org/apache/tuscany/sca/node
A testing/itest/node-launcher-equinox/src/test/java/org/apache/tuscany/sca/node/equinox
A testing/itest/node-launcher-equinox/src/test/java/org/apache/tuscany/sca/node/equinox/launcher
AU testing/itest/node-launcher-equinox/src/test/java/org/apache/tuscany/sca/node/equinox/launcher/NodeLauncherTestCase.java
AU testing/itest/node-launcher-equinox/src/test/java/org/apache/tuscany/sca/node/equinox/launcher/EquinoxOSGiHostTestCase.java
A testing/itest/node-launcher-equinox/src/test/resources
AU testing/itest/node-launcher-equinox/src/test/resources/HelloWorld.composite
A testing/itest/node-launcher-equinox/pom.xml
A testing/itest/base
A testing/itest/base/dependencies
A testing/itest/base/dependencies/src
A testing/itest/base/dependencies/src/test
A testing/itest/base/dependencies/src/test/java
A testing/itest/base/dependencies/src/test/java/org
A testing/itest/base/dependencies/src/test/java/org/apache
A testing/itest/base/dependencies/src/test/java/org/apache/tuscany
A testing/itest/base/dependencies/src/test/java/org/apache/tuscany/sca
A testing/itest/base/dependencies/src/test/java/org/apache/tuscany/sca/itest
A testing/itest/base/dependencies/src/test/java/org/apache/tuscany/sca/itest/base
A testing/itest/base/dependencies/src/test/java/org/apache/tuscany/sca/itest/base/dependencies
A testing/itest/base/dependencies/src/test/java/org/apache/tuscany/sca/itest/base/dependencies/ValidateDependenciesTestCase.java
A testing/itest/base/dependencies/pom.xml
A testing/itest/base/pom.xml
A testing/itest/callback-basic
A testing/itest/callback-basic/src
A testing/itest/callback-basic/src/test
A testing/itest/callback-basic/src/test/java
A testing/itest/callback-basic/src/test/java/org
A testing/itest/callback-basic/src/test/java/org/apache
A testing/itest/callback-basic/src/test/java/org/apache/tuscany
A testing/itest/callback-basic/src/test/java/org/apache/tuscany/sca
A testing/itest/callback-basic/src/test/java/org/apache/tuscany/sca/test
AU testing/itest/callback-basic/src/test/java/org/apache/tuscany/sca/test/CallBackBasicTestCase.java
A testing/itest/callback-basic/src/main
A testing/itest/callback-basic/src/main/java
A testing/itest/callback-basic/src/main/java/org
A testing/itest/callback-basic/src/main/java/org/apache
A testing/itest/callback-basic/src/main/java/org/apache/tuscany
A testing/itest/callback-basic/src/main/java/org/apache/tuscany/sca
A testing/itest/callback-basic/src/main/java/org/apache/tuscany/sca/test
AU testing/itest/callback-basic/src/main/java/org/apache/tuscany/sca/test/CallBackBasicClientImpl.java
AU testing/itest/callback-basic/src/main/java/org/apache/tuscany/sca/test/CallBackBasicService.java
AU testing/itest/callback-basic/src/main/java/org/apache/tuscany/sca/test/CallBackBasicServiceImpl.java
AU testing/itest/callback-basic/src/main/java/org/apache/tuscany/sca/test/CallBackBasicCallBack.java
AU testing/itest/callback-basic/src/main/java/org/apache/tuscany/sca/test/CallBackBasicClient.java
A testing/itest/callback-basic/src/main/resources
AU testing/itest/callback-basic/src/main/resources/CallBackBasicTest.composite
A testing/itest/callback-basic/src/main/resources/META-INF
AU testing/itest/callback-basic/src/main/resources/META-INF/sca-contribution.xml
AU testing/itest/callback-basic/pom.xml
A testing/compliance-tests
A testing/compliance-tests/assembly
A testing/compliance-tests/assembly/src
A testing/compliance-tests/assembly/src/test
A testing/compliance-tests/assembly/src/test/java
A testing/compliance-tests/assembly/src/test/java/org
A testing/compliance-tests/assembly/src/test/java/org/apache
A testing/compliance-tests/assembly/src/test/java/org/apache/tuscany
A testing/compliance-tests/assembly/src/test/java/org/apache/tuscany/sca
A testing/compliance-tests/assembly/src/test/java/org/apache/tuscany/sca/otest
A testing/compliance-tests/assembly/src/test/java/org/apache/tuscany/sca/otest/TuscanyRuntimeBridge.java
A testing/compliance-tests/assembly/src/test/resources
A testing/compliance-tests/assembly/src/test/resources/tuscany-oasis-sca-tests-errors.properties
A testing/compliance-tests/assembly/src/test/resources/oasis-sca-tests.properties
A testing/compliance-tests/assembly/src/main
A testing/compliance-tests/assembly/pom.xml
A testing/compliance-tests/policy
A testing/compliance-tests/policy/src
A testing/compliance-tests/policy/src/test
A testing/compliance-tests/policy/src/test/java
A testing/compliance-tests/policy/src/test/java/org
A testing/compliance-tests/policy/src/test/java/org/apache
A testing/compliance-tests/policy/src/test/java/org/apache/tuscany
A testing/compliance-tests/policy/src/test/java/org/apache/tuscany/sca
A testing/compliance-tests/policy/src/test/java/org/apache/tuscany/sca/otest
A testing/compliance-tests/policy/src/test/java/org/apache/tuscany/sca/otest/TuscanyRuntimeBridge.java
A testing/compliance-tests/policy/src/test/resources
A testing/compliance-tests/policy/src/test/resources/tuscany-oasis-sca-tests-errors.properties
A testing/compliance-tests/policy/src/test/resources/oasis-sca-tests.properties
A testing/compliance-tests/policy/pom.xml
A testing/compliance-tests/binding-jms
A testing/compliance-tests/binding-jms/src
A testing/compliance-tests/binding-jms/src/test
A testing/compliance-tests/binding-jms/src/test/java
A testing/compliance-tests/binding-jms/src/test/java/org
A testing/compliance-tests/binding-jms/src/test/java/org/apache
A testing/compliance-tests/binding-jms/src/test/java/org/apache/tuscany
A testing/compliance-tests/binding-jms/src/test/java/org/apache/tuscany/sca
A testing/compliance-tests/binding-jms/src/test/java/org/apache/tuscany/sca/otest
AU testing/compliance-tests/binding-jms/src/test/java/org/apache/tuscany/sca/otest/TuscanyRuntimeBridge.java
A testing/compliance-tests/binding-jms/src/test/resources
AU testing/compliance-tests/binding-jms/src/test/resources/tuscany-oasis-sca-tests-errors.properties
AU testing/compliance-tests/binding-jms/src/test/resources/oasis-sca-tests.properties
AU testing/compliance-tests/binding-jms/pom.xml
A testing/compliance-tests/binding-ws
A testing/compliance-tests/binding-ws/src
A testing/compliance-tests/binding-ws/src/test
A testing/compliance-tests/binding-ws/src/test/java
A testing/compliance-tests/binding-ws/src/test/java/org
A testing/compliance-tests/binding-ws/src/test/java/org/apache
A testing/compliance-tests/binding-ws/src/test/java/org/apache/tuscany
A testing/compliance-tests/binding-ws/src/test/java/org/apache/tuscany/sca
A testing/compliance-tests/binding-ws/src/test/java/org/apache/tuscany/sca/otest
AU testing/compliance-tests/binding-ws/src/test/java/org/apache/tuscany/sca/otest/TuscanyRuntimeBridge.java
A testing/compliance-tests/binding-ws/src/test/resources
AU testing/compliance-tests/binding-ws/src/test/resources/tuscany-oasis-sca-tests-errors.properties
AU testing/compliance-tests/binding-ws/src/test/resources/oasis-sca-tests.properties
A testing/compliance-tests/binding-ws/sca_variables.dtd
AU testing/compliance-tests/binding-ws/pom.xml
A testing/compliance-tests/java-caa
A testing/compliance-tests/java-caa/src
A testing/compliance-tests/java-caa/src/test
A testing/compliance-tests/java-caa/src/test/java
A testing/compliance-tests/java-caa/src/test/java/org
A testing/compliance-tests/java-caa/src/test/java/org/apache
A testing/compliance-tests/java-caa/src/test/java/org/apache/tuscany
A testing/compliance-tests/java-caa/src/test/java/org/apache/tuscany/sca
A testing/compliance-tests/java-caa/src/test/java/org/apache/tuscany/sca/otest
A testing/compliance-tests/java-caa/src/test/java/org/apache/tuscany/sca/otest/TuscanyRuntimeBridge.java
A testing/compliance-tests/java-caa/src/test/resources
A testing/compliance-tests/java-caa/src/test/resources/tuscany-oasis-sca-tests-errors.properties
A testing/compliance-tests/java-caa/src/test/resources/oasis-sca-tests.properties
A testing/compliance-tests/java-caa/pom.xml
A testing/compliance-tests/java-ci
A testing/compliance-tests/java-ci/src
A testing/compliance-tests/java-ci/src/test
A testing/compliance-tests/java-ci/src/test/java
A testing/compliance-tests/java-ci/src/test/java/org
A testing/compliance-tests/java-ci/src/test/java/org/apache
A testing/compliance-tests/java-ci/src/test/java/org/apache/tuscany
A testing/compliance-tests/java-ci/src/test/java/org/apache/tuscany/sca
A testing/compliance-tests/java-ci/src/test/java/org/apache/tuscany/sca/otest
A testing/compliance-tests/java-ci/src/test/java/org/apache/tuscany/sca/otest/TuscanyRuntimeBridge.java
A testing/compliance-tests/java-ci/src/test/resources
A testing/compliance-tests/java-ci/src/test/resources/tuscany-oasis-sca-tests-errors.properties
A testing/compliance-tests/java-ci/src/test/resources/oasis-sca-tests.properties
A testing/compliance-tests/java-ci/pom.xml
A testing/compliance-tests/pom.xml
A features
A features/web20
AU features/web20/pom.xml
A features/osgi
AU features/osgi/pom.xml
A features/sdo
AU features/sdo/pom.xml
A features/ejava
AU features/ejava/pom.xml
A features/all
AU features/all/pom.xml
A features/core
AU features/core/pom.xml
A features/api
AU features/api/pom.xml
A features/eclipse-pde
AU features/eclipse-pde/pom.xml
AU features/pom.xml
A features/process
AU features/process/pom.xml
A features/webapp
AU features/webapp/pom.xml
A features/webservice
AU features/webservice/pom.xml
U .
At revision 1137268
ERROR: Ignore Problem expanding maven opts macros org.jenkinsci.plugins.tokenmacro.TokenMacro
Found mavenVersion 2.2.1 from file jar:file:/home/hudson/tools/maven/latest/lib/maven-2.2.1-uber.jar!/META-INF/maven/org.apache.maven/maven-core/pom.properties
Parsing POMs
failed to transfer Unable to locate resource in repository
downloaded artifact http://repo1.maven.org/maven2//org/apache/apache/8/apache-8.pom
ERROR: Failed to parse POMs
hudson.util.IOException2: remote file operation failed: <https://builds.apache.org/job/Tuscany-2x/ws/sca-2x> at hudson.remoting.Channel@40808e5d:ubuntu1
at hudson.FilePath.act(FilePath.java:754)
at hudson.FilePath.act(FilePath.java:740)
at hudson.maven.MavenModuleSetBuild$RunnerImpl.parsePoms(MavenModuleSetBuild.java:817)
at hudson.maven.MavenModuleSetBuild$RunnerImpl.doRun(MavenModuleSetBuild.java:617)
at hudson.model.AbstractBuild$AbstractRunner.run(AbstractBuild.java:429)
at hudson.model.Run.run(Run.java:1374)
at hudson.maven.MavenModuleSetBuild.run(MavenModuleSetBuild.java:467)
at hudson.model.ResourceController.execute(ResourceController.java:88)
at hudson.model.Executor.run(Executor.java:145)
Caused by: hudson.remoting.ProxyException: hudson.maven.MavenModuleSetBuild$MavenExecutionException: org.apache.maven.project.ProjectBuildingException: Some problems were encountered while processing the POMs:
[WARNING] 'parent.relativePath' points at org.apache.tuscany.sca:itest-policy instead of org.apache.tuscany.sca:itest-ws, please verify your project structure @ line 22, column 13
[FATAL] Non-resolvable parent POM: Could not find artifact org.apache.tuscany.sca:itest-ws:pom:2.0-SNAPSHOT and 'parent.relativePath' points at wrong local POM @ line 22, column 13
at hudson.maven.MavenModuleSetBuild$PomParser.invoke(MavenModuleSetBuild.java:1327)
at hudson.maven.MavenModuleSetBuild$PomParser.invoke(MavenModuleSetBuild.java:1110)
at hudson.FilePath$FileCallableWrapper.call(FilePath.java:1979)
at hudson.remoting.UserRequest.perform(UserRequest.java:118)
at hudson.remoting.UserRequest.perform(UserRequest.java:48)
at hudson.remoting.Request$2.run(Request.java:270)
at java.util.concurrent.Executors$RunnableAdapter.call(Executors.java:471)
at java.util.concurrent.FutureTask$Sync.innerRun(FutureTask.java:334)
at java.util.concurrent.FutureTask.run(FutureTask.java:166)
at java.util.concurrent.ThreadPoolExecutor.runWorker(ThreadPoolExecutor.java:1110)
at java.util.concurrent.ThreadPoolExecutor$Worker.run(ThreadPoolExecutor.java:603)
at java.lang.Thread.run(Thread.java:636)
Caused by: hudson.remoting.ProxyException: org.apache.maven.project.ProjectBuildingException: Some problems were encountered while processing the POMs:
[WARNING] 'parent.relativePath' points at org.apache.tuscany.sca:itest-policy instead of org.apache.tuscany.sca:itest-ws, please verify your project structure @ line 22, column 13
[FATAL] Non-resolvable parent POM: Could not find artifact org.apache.tuscany.sca:itest-ws:pom:2.0-SNAPSHOT and 'parent.relativePath' points at wrong local POM @ line 22, column 13
at org.apache.maven.project.DefaultProjectBuilder.build(DefaultProjectBuilder.java:339)
at hudson.maven.MavenEmbedder.buildProjects(MavenEmbedder.java:360)
at hudson.maven.MavenEmbedder.readProjects(MavenEmbedder.java:330)
at hudson.maven.MavenEmbedder.readProject(MavenEmbedder.java:321)
at hudson.maven.MavenModuleSetBuild$PomParser.readChilds(MavenModuleSetBuild.java:1381)
at hudson.maven.MavenModuleSetBuild$PomParser.readChilds(MavenModuleSetBuild.java:1384)
at hudson.maven.MavenModuleSetBuild$PomParser.readChilds(MavenModuleSetBuild.java:1384)
at hudson.maven.MavenModuleSetBuild$PomParser.invoke(MavenModuleSetBuild.java:1288)
... 11 more