You are viewing a plain text version of this content. The canonical link for it is here.
Posted to dev@oozie.apache.org by Apache Jenkins Server <je...@builds.apache.org> on 2018/10/11 21:22:33 UTC

Failed: OOZIE-3364 PreCommit Build #884

Jira: https://issues.apache.org/jira/browse/OOZIE-3364
Build: https://builds.apache.org/job/PreCommit-OOZIE-Build/884/

###################################################################################
########################## LAST 100 LINES OF THE CONSOLE ###########################
[...truncated 1.89 MB...]
[DEBUG] There are no new bugs found in [sharelib/streaming].
[TRACE] New XMLLib present, calling 'xmllint --xpath' to get bug instance counts
[DEBUG] There are no new bugs found in [sharelib/git].
[TRACE] New XMLLib present, calling 'xmllint --xpath' to get bug instance counts
[DEBUG] There are no new bugs found in [sharelib/sqoop].
[TRACE] New XMLLib present, calling 'xmllint --xpath' to get bug instance counts
[DEBUG] There are no new bugs found in [sharelib/spark].
[TRACE] New XMLLib present, calling 'xmllint --xpath' to get bug instance counts
[DEBUG] There are no new bugs found in [examples].
[INFO] There are no new bugs found totally].
[TRACE] FindBugs diffs checked and reports created
[TRACE] Summary file size is 2558 bytes
[TRACE] Full summary file size is 1471 bytes
[TRACE] File [/home/jenkins/jenkins-slave/workspace/PreCommit-OOZIE-Build/test-patch/tmp/FINDBUGS_DIFF/diff/findbugs-diff-0.1.0-all.jar] removed
[TRACE] File [/home/jenkins/jenkins-slave/workspace/PreCommit-OOZIE-Build/test-patch/tmp/FINDBUGS_DIFF/diff/findbugs-diff-0.1.0-all.jar.md5sum] removed
  Running test-patch task BACKWARDS_COMPATIBILITY
  Running test-patch task TESTS
  Running test-patch task DISTRO


Testing JIRA OOZIE-3364

Cleaning local git workspace

----------------------------

+1 PATCH_APPLIES
+1 CLEAN
-1 RAW_PATCH_ANALYSIS
    +1 the patch does not introduce any @author tags
    +1 the patch does not introduce any tabs
    +1 the patch does not introduce any trailing spaces
    +1 the patch does not introduce any star imports
    -1 the patch contains 1 line(s) longer than 132 characters
    +1 the patch adds/modifies 1 testcase(s)
+1 RAT
    +1 the patch does not seem to introduce new RAT warnings
+1 JAVADOC
    +1 Javadoc generation succeeded with the patch
    +1 the patch does not seem to introduce new Javadoc warning(s)
    WARNING: the current HEAD has 100 Javadoc warning(s)
+1 COMPILE
    +1 HEAD compiles
    +1 patch compiles
    +1 the patch does not seem to introduce new javac warnings
+1 There are no new bugs found in total.
 +1 There are no new bugs found in [fluent-job/fluent-job-api].
 +1 There are no new bugs found in [client].
 +1 There are no new bugs found in [docs].
 +1 There are no new bugs found in [tools].
 +1 There are no new bugs found in [webapp].
 +1 There are no new bugs found in [core].
 +1 There are no new bugs found in [server].
 +1 There are no new bugs found in [sharelib/pig].
 +1 There are no new bugs found in [sharelib/distcp].
 +1 There are no new bugs found in [sharelib/hive2].
 +1 There are no new bugs found in [sharelib/oozie].
 +1 There are no new bugs found in [sharelib/hcatalog].
 +1 There are no new bugs found in [sharelib/hive].
 +1 There are no new bugs found in [sharelib/streaming].
 +1 There are no new bugs found in [sharelib/git].
 +1 There are no new bugs found in [sharelib/sqoop].
 +1 There are no new bugs found in [sharelib/spark].
 +1 There are no new bugs found in [examples].
+1 BACKWARDS_COMPATIBILITY
    +1 the patch does not change any JPA Entity/Colum/Basic/Lob/Transient annotations
    +1 the patch does not modify JPA files
+1 TESTS
    Tests run: 3056
    Tests failed at first run:
TestCoordActionsKillXCommand#testActionKillCommandDate
TestBulkWorkflowXCommand#testbulkWfKillSuccess
    For the complete list of flaky tests, see TEST-SUMMARY-FULL files.
+1 DISTRO
    +1 distro tarball builds with the patch 

----------------------------
-1 Overall result, please check the reported -1(s)

 There is at least one warning, please check

The full output of the test-patch run is available at

 https://builds.apache.org/job/PreCommit-OOZIE-Build/884/

Adding comment to JIRA
  % Total    % Received % Xferd  Average Speed   Time    Time     Time  Current
                                 Dload  Upload   Total   Spent    Left  Speed
  0     0    0     0    0     0      0      0 --:--:-- --:--:-- --:--:--     0{"self":"https://issues.apache.org/jira/rest/api/2/issue/13190995/comment/16647046","id":"16647046","author":{"self":"https://issues.apache.org/jira/rest/api/2/user?username=hadoopqa","name":"hadoopqa","key":"hadoopqa","avatarUrls":{"48x48":"https://issues.apache.org/jira/secure/useravatar?ownerId=hadoopqa&avatarId=10393","24x24":"https://issues.apache.org/jira/secure/useravatar?size=small&ownerId=hadoopqa&avatarId=10393","16x16":"https://issues.apache.org/jira/secure/useravatar?size=xsmall&ownerId=hadoopqa&avatarId=10393","32x32":"https://issues.apache.org/jira/secure/useravatar?size=medium&ownerId=hadoopqa&avatarId=10393"},"displayName":"Hadoop QA","active":true,"timeZone":"Etc/UTC"},"body":"\nTesting JIRA OOZIE-3364\n\nCleaning local git workspace\n\n----------------------------\n\n{color:green}+1 PATCH_APPLIES{color}\n{color:green}+1 CLEAN{color}\n{color:red}-1 RAW_PATCH_ANALYSIS{color}\n.    {color:green}+1{color} the patch does not introduce any @author tags\n.    {color:green}+1{color} the patch does not introduce any tabs\n.    {color:green}+1{color} the patch does not introduce any trailing spaces\n.    {color:green}+1{color} the patch does not introduce any star imports\n.    {color:red}-1{color} the patch contains 1 line(s) longer than 132 characters\n.    {color:green}+1{color} the patch adds/modifies 1 testcase(s)\n{color:green}+1 RAT{color}\n.    {color:green}+1{color} the patch does not seem to introduce new RAT warnings\n{color:green}+1 JAVADOC{color}\n.    {color:green}+1{color} Javadoc generation succeeded with the patch\n.    {color:green}+1{color} the patch does not seem to introduce new Javadoc warning(s)\n.    {color:orange}WARNING{color}: the current HEAD has 100 Javadoc warning(s)\n{color:green}+1 COMPILE{color}\n.    {color:green}+1{color} HEAD compiles\n.    {color:green}+1{color} patch compiles\n.    {color:green}+1{color} the patch does not seem to introduce new javac warnings\n{color:green}+1{color} There are no new bugs found in total.\n. {color:green}+1{color} There are no new bugs found in [fluent-job/fluent-job-api].\n. {color:green}+1{color} There are no new bugs found in [client].\n. {color:green}+1{color} There are no new bugs found in [docs].\n. {color:green}+1{color} There are no new bugs found in [tools].\n. {color:green}+1{color} There are no new bugs found in [webapp].\n. {color:green}+1{color} There are no new bugs found in [core].\n. {color:green}+1{color} There are no new bugs found in [server].\n. {color:green}+1{color} There are no new bugs found in [sharelib/pig].\n. {color:green}+1{color} There are no new bugs found in [sharelib/distcp].\n. {color:green}+1{color} There are no new bugs found in [sharelib/hive2].\n. {color:green}+1{color} There are no new bugs found in [sharelib/oozie].\n. {color:green}+1{color} There are no new bugs found in [sharelib/hcatalog].\n. {color:green}+1{color} There are no new bugs found in [sharelib/hive].\n. {color:green}+1{color} There are no new bugs found in [sharelib/streaming].\n. {color:green}+1{color} There are no new bugs found in [sharelib/git].\n. {color:green}+1{color} There are no new bugs found in [sharelib/sqoop].\n. {color:green}+1{color} There are no new bugs found in [sharelib/spark].\n. {color:green}+1{color} There are no new bugs found in [examples].\n{color:green}+1 BACKWARDS_COMPATIBILITY{color}\n.    {color:green}+1{color} the patch does not change any JPA Entity/Colum/Basic/Lob/Transient annotations\n.    {color:green}+1{color} the patch does not modify JPA files\n{color:green}+1 TESTS{color}\n.    Tests run: 3056\n.    {color:orange}Tests failed at first run:{color}\nTestCoordActionsKillXCommand#testActionKillCommandDate\nTestBulkWorkflowXCommand#testbulkWfKillSuccess\n.    For the complete list of flaky tests, see TEST-SUMMARY-FULL files.\n{color:green}+1 DISTRO{color}\n.    {color:green}+1{color} distro tarball builds with the patch \n\n----------------------------\n{color:red}*-1 Overall result, please check the reported -1(s)*{color}\n\n{color:red}. There is at least one warning, please check{color}\n\nThe full output100  8394    0  4885  100  3509   5689   4086 --:--:-- --:--:-- --:--:--  5693
 of the test-patch run is available at\n\n. https://builds.apache.org/job/PreCommit-OOZIE-Build/884/\n\n","updateAuthor":{"self":"https://issues.apache.org/jira/rest/api/2/user?username=hadoopqa","name":"hadoopqa","key":"hadoopqa","avatarUrls":{"48x48":"https://issues.apache.org/jira/secure/useravatar?ownerId=hadoopqa&avatarId=10393","24x24":"https://issues.apache.org/jira/secure/useravatar?size=small&ownerId=hadoopqa&avatarId=10393","16x16":"https://issues.apache.org/jira/secure/useravatar?size=xsmall&ownerId=hadoopqa&avatarId=10393","32x32":"https://issues.apache.org/jira/secure/useravatar?size=medium&ownerId=hadoopqa&avatarId=10393"},"displayName":"Hadoop QA","active":true,"timeZone":"Etc/UTC"},"created":"2018-10-11T21:22:28.879+0000","updated":"2018-10-11T21:22:28.879+0000"}
test-patch exit code: 1

Build step 'Execute shell' marked build as failure
[description-setter] Description set: OOZIE-3364
Archiving artifacts
Recording test results
ERROR: Step ?Publish JUnit test result report? failed: No test report files were found. Configuration error?
Email was triggered for: Failure - Any
Sending email for trigger: Failure - Any



###################################################################################
############################## FAILED TESTS (if any) ##############################
No tests ran.

Failed: OOZIE-3367 PreCommit Build #887

Posted by Apache Jenkins Server <je...@builds.apache.org>.
Jira: https://issues.apache.org/jira/browse/OOZIE-3367
Build: https://builds.apache.org/job/PreCommit-OOZIE-Build/887/

###################################################################################
########################## LAST 100 LINES OF THE CONSOLE ###########################
[...truncated 1.88 MB...]
[TRACE] New XMLLib present, calling 'xmllint --xpath' to get bug instance counts
[DEBUG] There are no new bugs found in [sharelib/distcp].
[TRACE] New XMLLib present, calling 'xmllint --xpath' to get bug instance counts
[DEBUG] There are no new bugs found in [examples].
[TRACE] New XMLLib present, calling 'xmllint --xpath' to get bug instance counts
[DEBUG] There are no new bugs found in [tools].
[TRACE] New XMLLib present, calling 'xmllint --xpath' to get bug instance counts
[DEBUG] There are no new bugs found in [server].
[TRACE] New XMLLib present, calling 'xmllint --xpath' to get bug instance counts
[DEBUG] There are no new bugs found in [fluent-job/fluent-job-api].
[INFO] There are no new bugs found totally].
[TRACE] FindBugs diffs checked and reports created
[TRACE] Summary file size is 2558 bytes
[TRACE] Full summary file size is 1471 bytes
[TRACE] File [/home/jenkins/jenkins-slave/workspace/PreCommit-OOZIE-Build/test-patch/tmp/FINDBUGS_DIFF/diff/findbugs-diff-0.1.0-all.jar] removed
[TRACE] File [/home/jenkins/jenkins-slave/workspace/PreCommit-OOZIE-Build/test-patch/tmp/FINDBUGS_DIFF/diff/findbugs-diff-0.1.0-all.jar.md5sum] removed
  Running test-patch task BACKWARDS_COMPATIBILITY
  Running test-patch task TESTS
  Running test-patch task DISTRO


Testing JIRA OOZIE-3367

Cleaning local git workspace

----------------------------

+1 PATCH_APPLIES
+1 CLEAN
-1 RAW_PATCH_ANALYSIS
    +1 the patch does not introduce any @author tags
    +1 the patch does not introduce any tabs
    +1 the patch does not introduce any trailing spaces
    +1 the patch does not introduce any star imports
    -1 the patch contains 1 line(s) longer than 132 characters
    +1 the patch adds/modifies 1 testcase(s)
+1 RAT
    +1 the patch does not seem to introduce new RAT warnings
+1 JAVADOC
    +1 Javadoc generation succeeded with the patch
    +1 the patch does not seem to introduce new Javadoc warning(s)
    WARNING: the current HEAD has 100 Javadoc warning(s)
+1 COMPILE
    +1 HEAD compiles
    +1 patch compiles
    +1 the patch does not seem to introduce new javac warnings
+1 There are no new bugs found in total.
 +1 There are no new bugs found in [webapp].
 +1 There are no new bugs found in [core].
 +1 There are no new bugs found in [client].
 +1 There are no new bugs found in [docs].
 +1 There are no new bugs found in [sharelib/streaming].
 +1 There are no new bugs found in [sharelib/hive].
 +1 There are no new bugs found in [sharelib/hive2].
 +1 There are no new bugs found in [sharelib/sqoop].
 +1 There are no new bugs found in [sharelib/oozie].
 +1 There are no new bugs found in [sharelib/git].
 +1 There are no new bugs found in [sharelib/hcatalog].
 +1 There are no new bugs found in [sharelib/pig].
 +1 There are no new bugs found in [sharelib/spark].
 +1 There are no new bugs found in [sharelib/distcp].
 +1 There are no new bugs found in [examples].
 +1 There are no new bugs found in [tools].
 +1 There are no new bugs found in [server].
 +1 There are no new bugs found in [fluent-job/fluent-job-api].
+1 BACKWARDS_COMPATIBILITY
    +1 the patch does not change any JPA Entity/Colum/Basic/Lob/Transient annotations
    +1 the patch does not modify JPA files
+1 TESTS
    Tests run: 3057
    Tests failed at first run:
TestSubWorkflowActionExecutor#testSubWorkflowRerun
    For the complete list of flaky tests, see TEST-SUMMARY-FULL files.
+1 DISTRO
    +1 distro tarball builds with the patch 

----------------------------
-1 Overall result, please check the reported -1(s)

 There is at least one warning, please check

The full output of the test-patch run is available at

 https://builds.apache.org/job/PreCommit-OOZIE-Build/887/

Adding comment to JIRA
  % Total    % Received % Xferd  Average Speed   Time    Time     Time  Current
                                 Dload  Upload   Total   Spent    Left  Speed
  0     0    0     0    0     0      0      0 --:--:-- --:--:-- --:--:--     0{"self":"https://issues.apache.org/jira/rest/api/2/issue/13191090/comment/16647403","id":"16647403","author":{"self":"https://issues.apache.org/jira/rest/api/2/user?username=hadoopqa","name":"hadoopqa","key":"hadoopqa","avatarUrls":{"48x48":"https://issues.apache.org/jira/secure/useravatar?ownerId=hadoopqa&avatarId=10393","24x24":"https://issues.apache.org/jira/secure/useravatar?size=small&ownerId=hadoopqa&avatarId=10393","16x16":"https://issues.apache.org/jira/secure/useravatar?size=xsmall&ownerId=hadoopqa&avatarId=10393","32x32":"https://issues.apache.org/jira/secure/useravatar?size=medium&ownerId=hadoopqa&avatarId=10393"},"displayName":"Hadoop QA","active":true,"timeZone":"Etc/UTC"},"body":"\nTesting JIRA OOZIE-3367\n\nCleaning local git workspace\n\n----------------------------\n\n{color:green}+1 PATCH_APPLIES{color}\n{color:green}+1 CLEAN{color}\n{color:red}-1 RAW_PATCH_ANALYSIS{color}\n.    {color:green}+1{color} the patch does not introduce any @author tags\n.    {color:green}+1{color} the patch does not introduce any tabs\n.    {color:green}+1{color} the patch does not introduce any trailing spaces\n.    {color:green}+1{color} the patch does not introduce any star imports\n.    {color:red}-1{color} the patch contains 1 line(s) longer than 132 characters\n.    {color:green}+1{color} the patch adds/modifies 1 testcase(s)\n{color:green}+1 RAT{color}\n.    {color:green}+1{color} the patch does not seem to introduce new RAT warnings\n{color:green}+1 JAVADOC{color}\n.    {color:green}+1{color} Javadoc generation succeeded with the patch\n.    {color:green}+1{color} the patch does not seem to introduce new Javadoc warning(s)\n.    {color:orange}WARNING{color}: the current HEAD has 100 Javadoc warning(s)\n{color:green}+1 COMPILE{color}\n.    {color:green}+1{color} HEAD compiles\n.    {color:green}+1{color} patch compiles\n.    {color:green}+1{color} the patch does not seem to introduce new javac warnings\n{color:green}+1{color} There are no new bugs found in total.\n. {color:green}+1{color} There are no new bugs found in [webapp].\n. {color:green}+1{color} There are no new bugs found in [core].\n. {color:green}+1{color} There are no new bugs found in [client].\n. {color:green}+1{color} There are no new bugs found in [docs].\n. {color:green}+1{color} There are no new bugs found in [sharelib/streaming].\n. {color:green}+1{color} There are no new bugs found in [sharelib/hive].\n. {color:green}+1{color} There are no new bugs found in [sharelib/hive2].\n. {color:green}+1{color} There are no new bugs found in [sharelib/sqoop].\n. {color:green}+1{color} There are no new bugs found in [sharelib/oozie].\n. {color:green}+1{color} There are no new bugs found in [sharelib/git].\n. {color:green}+1{color} There are no new bugs found in [sharelib/hcatalog].\n. {color:green}+1{color} There are no new bugs found in [sharelib/pig].\n. {color:green}+1{color} There are no new bugs found in [sharelib/spark].\n. {color:green}+1{color} There are no new bugs found in [sharelib/distcp].\n. {color:green}+1{color} There are no new bugs found in [examples].\n. {color:green}+1{color} There are no new bugs found in [tools].\n. {color:green}+1{color} There are no new bugs found in [server].\n. {color:green}+1{color} There are no new bugs found in [fluent-job/fluent-job-api].\n{color:green}+1 BACKWARDS_COMPATIBILITY{color}\n.    {color:green}+1{color} the patch does not change any JPA Entity/Colum/Basic/Lob/Transient annotations\n.    {color:green}+1{color} the patch does not modify JPA files\n{color:green}+1 TESTS{color}\n.    Tests run: 3057\n.    {color:orange}Tests failed at first run:{color}\nTestSubWorkflowActionExecutor#testSubWorkflowRerun\n.    For the complete list of flaky tests, see TEST-SUMMARY-FULL files.\n{color:green}+1 DISTRO{color}\n.    {color:green}+1{color} distro tarball builds with the patch \n\n----------------------------\n{color:red}*-1 Overall result, please check the reported -1(s)*{color}\n\n{color:red}. There is at least one warning, please check{color}\n\nThe full output of the test-patch run is available at\n\n. https://100  8290    0  4833  100  3457   5483   3922 --:--:-- --:--:-- --:--:--  5485
builds.apache.org/job/PreCommit-OOZIE-Build/887/\n\n","updateAuthor":{"self":"https://issues.apache.org/jira/rest/api/2/user?username=hadoopqa","name":"hadoopqa","key":"hadoopqa","avatarUrls":{"48x48":"https://issues.apache.org/jira/secure/useravatar?ownerId=hadoopqa&avatarId=10393","24x24":"https://issues.apache.org/jira/secure/useravatar?size=small&ownerId=hadoopqa&avatarId=10393","16x16":"https://issues.apache.org/jira/secure/useravatar?size=xsmall&ownerId=hadoopqa&avatarId=10393","32x32":"https://issues.apache.org/jira/secure/useravatar?size=medium&ownerId=hadoopqa&avatarId=10393"},"displayName":"Hadoop QA","active":true,"timeZone":"Etc/UTC"},"created":"2018-10-12T04:02:44.987+0000","updated":"2018-10-12T04:02:44.987+0000"}
test-patch exit code: 1

Build step 'Execute shell' marked build as failure
[description-setter] Description set: OOZIE-3367
Archiving artifacts
Recording test results
ERROR: Step ?Publish JUnit test result report? failed: No test report files were found. Configuration error?
Email was triggered for: Failure - Any
Sending email for trigger: Failure - Any



###################################################################################
############################## FAILED TESTS (if any) ##############################
No tests ran.

Failed: OOZIE-3366 PreCommit Build #886

Posted by Apache Jenkins Server <je...@builds.apache.org>.
Jira: https://issues.apache.org/jira/browse/OOZIE-3366
Build: https://builds.apache.org/job/PreCommit-OOZIE-Build/886/

###################################################################################
########################## LAST 100 LINES OF THE CONSOLE ###########################
[...truncated 1.89 MB...]
[DEBUG] There are no new bugs found in [sharelib/streaming].
[TRACE] New XMLLib present, calling 'xmllint --xpath' to get bug instance counts
[DEBUG] There are no new bugs found in [sharelib/git].
[TRACE] New XMLLib present, calling 'xmllint --xpath' to get bug instance counts
[DEBUG] There are no new bugs found in [sharelib/sqoop].
[TRACE] New XMLLib present, calling 'xmllint --xpath' to get bug instance counts
[DEBUG] There are no new bugs found in [sharelib/spark].
[TRACE] New XMLLib present, calling 'xmllint --xpath' to get bug instance counts
[DEBUG] There are no new bugs found in [examples].
[INFO] There are no new bugs found totally].
[TRACE] FindBugs diffs checked and reports created
[TRACE] Summary file size is 2558 bytes
[TRACE] Full summary file size is 1471 bytes
[TRACE] File [/home/jenkins/jenkins-slave/workspace/PreCommit-OOZIE-Build/test-patch/tmp/FINDBUGS_DIFF/diff/findbugs-diff-0.1.0-all.jar] removed
[TRACE] File [/home/jenkins/jenkins-slave/workspace/PreCommit-OOZIE-Build/test-patch/tmp/FINDBUGS_DIFF/diff/findbugs-diff-0.1.0-all.jar.md5sum] removed
  Running test-patch task BACKWARDS_COMPATIBILITY
  Running test-patch task TESTS
  Running test-patch task DISTRO


Testing JIRA OOZIE-3366

Cleaning local git workspace

----------------------------

+1 PATCH_APPLIES
+1 CLEAN
-1 RAW_PATCH_ANALYSIS
    +1 the patch does not introduce any @author tags
    +1 the patch does not introduce any tabs
    +1 the patch does not introduce any trailing spaces
    +1 the patch does not introduce any star imports
    -1 the patch contains 4 line(s) longer than 132 characters
    +1 the patch adds/modifies 3 testcase(s)
+1 RAT
    +1 the patch does not seem to introduce new RAT warnings
+1 JAVADOC
    +1 Javadoc generation succeeded with the patch
    +1 the patch does not seem to introduce new Javadoc warning(s)
    WARNING: the current HEAD has 100 Javadoc warning(s)
+1 COMPILE
    +1 HEAD compiles
    +1 patch compiles
    +1 the patch does not seem to introduce new javac warnings
+1 There are no new bugs found in total.
 +1 There are no new bugs found in [fluent-job/fluent-job-api].
 +1 There are no new bugs found in [client].
 +1 There are no new bugs found in [docs].
 +1 There are no new bugs found in [tools].
 +1 There are no new bugs found in [webapp].
 +1 There are no new bugs found in [core].
 +1 There are no new bugs found in [server].
 +1 There are no new bugs found in [sharelib/pig].
 +1 There are no new bugs found in [sharelib/distcp].
 +1 There are no new bugs found in [sharelib/hive2].
 +1 There are no new bugs found in [sharelib/oozie].
 +1 There are no new bugs found in [sharelib/hcatalog].
 +1 There are no new bugs found in [sharelib/hive].
 +1 There are no new bugs found in [sharelib/streaming].
 +1 There are no new bugs found in [sharelib/git].
 +1 There are no new bugs found in [sharelib/sqoop].
 +1 There are no new bugs found in [sharelib/spark].
 +1 There are no new bugs found in [examples].
+1 BACKWARDS_COMPATIBILITY
    +1 the patch does not change any JPA Entity/Colum/Basic/Lob/Transient annotations
    +1 the patch does not modify JPA files
+1 TESTS
    Tests run: 3058
    Tests failed at first run:
TestSubWorkflowActionExecutor#testSubWorkflowParentSuspend
TestCoordActionsKillXCommand#testActionKillCommandActionNumbers
    For the complete list of flaky tests, see TEST-SUMMARY-FULL files.
+1 DISTRO
    +1 distro tarball builds with the patch 

----------------------------
-1 Overall result, please check the reported -1(s)

 There is at least one warning, please check

The full output of the test-patch run is available at

 https://builds.apache.org/job/PreCommit-OOZIE-Build/886/

Adding comment to JIRA
  % Total    % Received % Xferd  Average Speed   Time    Time     Time  Current
                                 Dload  Upload   Total   Spent    Left  Speed
  0     0    0     0    0     0      0      0 --:--:-- --:--:-- --:--:--     0  0     0    0     0    0     0      0      0 --:--:-- --:--:-- --:--:--     0{"self":"https://issues.apache.org/jira/rest/api/2/issue/13191069/comment/16647329","id":"16647329","author":{"self":"https://issues.apache.org/jira/rest/api/2/user?username=hadoopqa","name":"hadoopqa","key":"hadoopqa","avatarUrls":{"48x48":"https://issues.apache.org/jira/secure/useravatar?ownerId=hadoopqa&avatarId=10393","24x24":"https://issues.apache.org/jira/secure/useravatar?size=small&ownerId=hadoopqa&avatarId=10393","16x16":"https://issues.apache.org/jira/secure/useravatar?size=xsmall&ownerId=hadoopqa&avatarId=10393","32x32":"https://issues.apache.org/jira/secure/useravatar?size=medium&ownerId=hadoopqa&avatarId=10393"},"displayName":"Hadoop QA","active":true,"timeZone":"Etc/UTC"},"body":"\nTesting JIRA OOZIE-3366\n\nCleaning local git workspace\n\n----------------------------\n\n{color:green}+1 PATCH_APPLIES{color}\n{color:green}+1 CLEAN{color}\n{color:red}-1 RAW_PATCH_ANALYSIS{color}\n.    {color:green}+1{color} the patch does not introduce any @author tags\n.    {color:green}+1{color} the patch does not introduce any tabs\n.    {color:green}+1{color} the patch does not introduce any trailing spaces\n.    {color:green}+1{color} the patch does not introduce any star imports\n.    {color:red}-1{color} the patch contains 4 line(s) longer than 132 characters\n.    {color:green}+1{color} the patch adds/modifies 3 testcase(s)\n{color:green}+1 RAT{color}\n.    {color:green}+1{color} the patch does not seem to introduce new RAT warnings\n{color:green}+1 JAVADOC{color}\n.    {color:green}+1{color} Javadoc generation succeeded with the patch\n.    {color:green}+1{color} the patch does not seem to introduce new Javadoc warning(s)\n.    {color:orange}WARNING{color}: the current HEAD has 100 Javadoc warning(s)\n{color:green}+1 COMPILE{color}\n.    {color:green}+1{color} HEAD compiles\n.    {color:green}+1{color} patch compiles\n.    {color:green}+1{color} the patch does not seem to introduce new javac warnings\n{color:green}+1{color} There are no new bugs found in total.\n. {color:green}+1{color} There are no new bugs found in [fluent-job/fluent-job-api].\n. {color:green}+1{color} There are no new bugs found in [client].\n. {color:green}+1{color} There are no new bugs found in [docs].\n. {color:green}+1{color} There are no new bugs found in [tools].\n. {color:green}+1{color} There are no new bugs found in [webapp].\n. {color:green}+1{color} There are no new bugs found in [core].\n. {color:green}+1{color} There are no new bugs found in [server].\n. {color:green}+1{color} There are no new bugs found in [sharelib/pig].\n. {color:green}+1{color} There are no new bugs found in [sharelib/distcp].\n. {color:green}+1{color} There are no new bugs found in [sharelib/hive2].\n. {color:green}+1{color} There are no new bugs found in [sharelib/oozie].\n. {color:green}+1{color} There are no new bugs found in [sharelib/hcatalog].\n. {color:green}+1{color} There are no new bugs found in [sharelib/hive].\n. {color:green}+1{color} There are no new bugs found in [sharelib/streaming].\n. {color:green}+1{color} There are no new bugs found in [sharelib/git].\n. {color:green}+1{color} There are no new bugs found in [sharelib/sqoop].\n. {color:green}+1{color} There are no new bugs found in [sharelib/spark].\n. {color:green}+1{color} There are no new bugs found in [examples].\n{color:green}+1 BACKWARDS_COMPATIBILITY{color}\n.    {color:green}+1{color} the patch does not change any JPA Entity/Colum/Basic/Lob/Transient annotations\n.    {color:green}+1{color} the patch does not modify JPA files\n{color:green}+1 TESTS{color}\n.    Tests run: 3058\n.    {color:orange}Tests failed at first run:{color}\nTestSubWorkflowActionExecutor#testSubWorkflowParentSuspend\nTestCoordActionsKillXCommand#testActionKillCommandActionNumbers\n.    For the complete list of flaky tests, see TEST-SUMMARY-FULL files.\n{color:green}+1 DISTRO{color}\n.    {color:green}+1{color} distro tarball builds with the patch \n\n----------------------------\n{color:red}*-1 Overall result, please check the reported -1(s)*{color}\n\n{color:red}. There is at least one warning, please check{colo100  8436    0  4906  100  3530   5331   3836 --:--:-- --:--:-- --:--:--  5326
r}\n\nThe full output of the test-patch run is available at\n\n. https://builds.apache.org/job/PreCommit-OOZIE-Build/886/\n\n","updateAuthor":{"self":"https://issues.apache.org/jira/rest/api/2/user?username=hadoopqa","name":"hadoopqa","key":"hadoopqa","avatarUrls":{"48x48":"https://issues.apache.org/jira/secure/useravatar?ownerId=hadoopqa&avatarId=10393","24x24":"https://issues.apache.org/jira/secure/useravatar?size=small&ownerId=hadoopqa&avatarId=10393","16x16":"https://issues.apache.org/jira/secure/useravatar?size=xsmall&ownerId=hadoopqa&avatarId=10393","32x32":"https://issues.apache.org/jira/secure/useravatar?size=medium&ownerId=hadoopqa&avatarId=10393"},"displayName":"Hadoop QA","active":true,"timeZone":"Etc/UTC"},"created":"2018-10-12T02:43:32.589+0000","updated":"2018-10-12T02:43:32.589+0000"}
test-patch exit code: 1

Build step 'Execute shell' marked build as failure
[description-setter] Description set: OOZIE-3366
Archiving artifacts
Recording test results
ERROR: Step ?Publish JUnit test result report? failed: No test report files were found. Configuration error?
Email was triggered for: Failure - Any
Sending email for trigger: Failure - Any



###################################################################################
############################## FAILED TESTS (if any) ##############################
No tests ran.

Failed: OOZIE-3365 PreCommit Build #885

Posted by Apache Jenkins Server <je...@builds.apache.org>.
Jira: https://issues.apache.org/jira/browse/OOZIE-3365
Build: https://builds.apache.org/job/PreCommit-OOZIE-Build/885/

###################################################################################
########################## LAST 100 LINES OF THE CONSOLE ###########################
[...truncated 1.88 MB...]
[DEBUG] There are no new bugs found in [webapp].
[TRACE] New XMLLib present, calling 'xmllint --xpath' to get bug instance counts
[DEBUG] There are no new bugs found in [tools].
[TRACE] New XMLLib present, calling 'xmllint --xpath' to get bug instance counts
[DEBUG] There are no new bugs found in [docs].
[TRACE] New XMLLib present, calling 'xmllint --xpath' to get bug instance counts
[DEBUG] There are no new bugs found in [server].
[TRACE] New XMLLib present, calling 'xmllint --xpath' to get bug instance counts
[DEBUG] There are no new bugs found in [fluent-job/fluent-job-api].
[TRACE] New XMLLib present, calling 'xmllint --xpath' to get bug instance counts
[DEBUG] There are no new bugs found in [client].
[INFO] There are no new bugs found totally].
[TRACE] FindBugs diffs checked and reports created
[TRACE] Summary file size is 2560 bytes
[TRACE] Full summary file size is 1471 bytes
[TRACE] File [/home/jenkins/jenkins-slave/workspace/PreCommit-OOZIE-Build/test-patch/tmp/FINDBUGS_DIFF/diff/findbugs-diff-0.1.0-all.jar] removed
[TRACE] File [/home/jenkins/jenkins-slave/workspace/PreCommit-OOZIE-Build/test-patch/tmp/FINDBUGS_DIFF/diff/findbugs-diff-0.1.0-all.jar.md5sum] removed
  Running test-patch task BACKWARDS_COMPATIBILITY
  Running test-patch task TESTS
  Running test-patch task DISTRO


Testing JIRA OOZIE-3365

Cleaning local git workspace

----------------------------

+1 PATCH_APPLIES
+1 CLEAN
+1 RAW_PATCH_ANALYSIS
    +1 the patch does not introduce any @author tags
    +1 the patch does not introduce any tabs
    +1 the patch does not introduce any trailing spaces
    +1 the patch does not introduce any star imports
    +1 the patch does not introduce any line longer than 132
    +1 the patch adds/modifies 1 testcase(s)
+1 RAT
    +1 the patch does not seem to introduce new RAT warnings
+1 JAVADOC
    +1 Javadoc generation succeeded with the patch
    +1 the patch does not seem to introduce new Javadoc warning(s)
    WARNING: the current HEAD has 100 Javadoc warning(s)
+1 COMPILE
    +1 HEAD compiles
    +1 patch compiles
    +1 the patch does not seem to introduce new javac warnings
+1 There are no new bugs found in total.
 +1 There are no new bugs found in [examples].
 +1 There are no new bugs found in [core].
 +1 There are no new bugs found in [sharelib/distcp].
 +1 There are no new bugs found in [sharelib/hive].
 +1 There are no new bugs found in [sharelib/pig].
 +1 There are no new bugs found in [sharelib/spark].
 +1 There are no new bugs found in [sharelib/hive2].
 +1 There are no new bugs found in [sharelib/hcatalog].
 +1 There are no new bugs found in [sharelib/sqoop].
 +1 There are no new bugs found in [sharelib/oozie].
 +1 There are no new bugs found in [sharelib/streaming].
 +1 There are no new bugs found in [sharelib/git].
 +1 There are no new bugs found in [webapp].
 +1 There are no new bugs found in [tools].
 +1 There are no new bugs found in [docs].
 +1 There are no new bugs found in [server].
 +1 There are no new bugs found in [fluent-job/fluent-job-api].
 +1 There are no new bugs found in [client].
+1 BACKWARDS_COMPATIBILITY
    +1 the patch does not change any JPA Entity/Colum/Basic/Lob/Transient annotations
    +1 the patch does not modify JPA files
+1 TESTS
    Tests run: 3057
    Tests failed at first run:
TestSubWorkflowActionExecutor#testSubWorkflowRerun
    For the complete list of flaky tests, see TEST-SUMMARY-FULL files.
+1 DISTRO
    +1 distro tarball builds with the patch 

----------------------------
+1 Overall result, good!, no -1s

 There is at least one warning, please check

The full output of the test-patch run is available at

 https://builds.apache.org/job/PreCommit-OOZIE-Build/885/

Adding comment to JIRA
  % Total    % Received % Xferd  Average Speed   Time    Time     Time  Current
                                 Dload  Upload   Total   Spent    Left  Speed
  0     0    0     0    0     0      0      0 --:--:-- --:--:-- --:--:--     0  0     0    0     0    0     0      0      0 --:--:-- --:--:-- --:--:--     0{"self":"https://issues.apache.org/jira/rest/api/2/issue/13191008/comment/16647095","id":"16647095","author":{"self":"https://issues.apache.org/jira/rest/api/2/user?username=hadoopqa","name":"hadoopqa","key":"hadoopqa","avatarUrls":{"48x48":"https://issues.apache.org/jira/secure/useravatar?ownerId=hadoopqa&avatarId=10393","24x24":"https://issues.apache.org/jira/secure/useravatar?size=small&ownerId=hadoopqa&avatarId=10393","16x16":"https://issues.apache.org/jira/secure/useravatar?size=xsmall&ownerId=hadoopqa&avatarId=10393","32x32":"https://issues.apache.org/jira/secure/useravatar?size=medium&ownerId=hadoopqa&avatarId=10393"},"displayName":"Hadoop QA","active":true,"timeZone":"Etc/UTC"},"body":"\nTesting JIRA OOZIE-3365\n\nCleaning local git workspace\n\n----------------------------\n\n{color:green}+1 PATCH_APPLIES{color}\n{color:green}+1 CLEAN{color}\n{color:green}+1 RAW_PATCH_ANALYSIS{color}\n.    {color:green}+1{color} the patch does not introduce any @author tags\n.    {color:green}+1{color} the patch does not introduce any tabs\n.    {color:green}+1{color} the patch does not introduce any trailing spaces\n.    {color:green}+1{color} the patch does not introduce any star imports\n.    {color:green}+1{color} the patch does not introduce any line longer than 132\n.    {color:green}+1{color} the patch adds/modifies 1 testcase(s)\n{color:green}+1 RAT{color}\n.    {color:green}+1{color} the patch does not seem to introduce new RAT warnings\n{color:green}+1 JAVADOC{color}\n.    {color:green}+1{color} Javadoc generation succeeded with the patch\n.    {color:green}+1{color} the patch does not seem to introduce new Javadoc warning(s)\n.    {color:orange}WARNING{color}: the current HEAD has 100 Javadoc warning(s)\n{color:green}+1 COMPILE{color}\n.    {color:green}+1{color} HEAD compiles\n.    {color:green}+1{color} patch compiles\n.    {color:green}+1{color} the patch does not seem to introduce new javac warnings\n{color:green}+1{color} There are no new bugs found in total.\n. {color:green}+1{color} There are no new bugs found in [examples].\n. {color:green}+1{color} There are no new bugs found in [core].\n. {color:green}+1{color} There are no new bugs found in [sharelib/distcp].\n. {color:green}+1{color} There are no new bugs found in [sharelib/hive].\n. {color:green}+1{color} There are no new bugs found in [sharelib/pig].\n. {color:green}+1{color} There are no new bugs found in [sharelib/spark].\n. {color:green}+1{color} There are no new bugs found in [sharelib/hive2].\n. {color:green}+1{color} There are no new bugs found in [sharelib/hcatalog].\n. {color:green}+1{color} There are no new bugs found in [sharelib/sqoop].\n. {color:green}+1{color} There are no new bugs found in [sharelib/oozie].\n. {color:green}+1{color} There are no new bugs found in [sharelib/streaming].\n. {color:green}+1{color} There are no new bugs found in [sharelib/git].\n. {color:green}+1{color} There are no new bugs found in [webapp].\n. {color:green}+1{color} There are no new bugs found in [tools].\n. {color:green}+1{color} There are no new bugs found in [docs].\n. {color:green}+1{color} There are no new bugs found in [server].\n. {color:green}+1{color} There are no new bugs found in [fluent-job/fluent-job-api].\n. {color:green}+1{color} There are no new bugs found in [client].\n{color:green}+1 BACKWARDS_COMPATIBILITY{color}\n.    {color:green}+1{color} the patch does not change any JPA Entity/Colum/Basic/Lob/Transient annotations\n.    {color:green}+1{color} the patch does not modify JPA files\n{color:green}+1 TESTS{color}\n.    Tests run: 3057\n.    {color:orange}Tests failed at first run:{color}\nTestSubWorkflowActionExecutor#testSubWorkflowRerun\n.    For the complete list of flaky tests, see TEST-SUMMARY-FULL files.\n{color:green}+1 DISTRO{color}\n.    {color:green}+1{color} distro tarball builds with the patch \n\n----------------------------\n{color:green}*+1 Overall result, good!, no -1s*{color}\n\n{color:red}. There is at least one warning, please check{color}\n\nThe full output of the test-patch run is available at\n\n. https://builds.apache.100  8262    0  4819  100  3443   7834   5597 --:--:-- --:--:-- --:--:--  7835
org/job/PreCommit-OOZIE-Build/885/\n\n","updateAuthor":{"self":"https://issues.apache.org/jira/rest/api/2/user?username=hadoopqa","name":"hadoopqa","key":"hadoopqa","avatarUrls":{"48x48":"https://issues.apache.org/jira/secure/useravatar?ownerId=hadoopqa&avatarId=10393","24x24":"https://issues.apache.org/jira/secure/useravatar?size=small&ownerId=hadoopqa&avatarId=10393","16x16":"https://issues.apache.org/jira/secure/useravatar?size=xsmall&ownerId=hadoopqa&avatarId=10393","32x32":"https://issues.apache.org/jira/secure/useravatar?size=medium&ownerId=hadoopqa&avatarId=10393"},"displayName":"Hadoop QA","active":true,"timeZone":"Etc/UTC"},"created":"2018-10-11T22:09:26.471+0000","updated":"2018-10-11T22:09:26.471+0000"}
test-patch exit code: 0

[description-setter] Description set: OOZIE-3365
Archiving artifacts
Recording test results
ERROR: Step ?Publish JUnit test result report? failed: No test report files were found. Configuration error?
Email was triggered for: Failure - Any
Sending email for trigger: Failure - Any



###################################################################################
############################## FAILED TESTS (if any) ##############################
No tests ran.