You are viewing a plain text version of this content. The canonical link for it is here.
Posted to dev@kafka.apache.org by Apache Jenkins Server <je...@builds.apache.org> on 2019/06/10 21:48:10 UTC
Build failed in Jenkins: kafka-2.0-jdk8 #275
See <https://builds.apache.org/job/kafka-2.0-jdk8/275/display/redirect?page=changes>
Changes:
[matthias] KAFKA-7315 DOCS update TOC internal links serdes all versions (#6875)
------------------------------------------
[...truncated 889.68 KB...]
kafka.controller.ReplicaStateMachineTest > testInvalidOfflineReplicaToNonexistentReplicaTransition PASSED
kafka.controller.ReplicaStateMachineTest > testInvalidOnlineReplicaToReplicaDeletionIneligibleTransition STARTED
kafka.controller.ReplicaStateMachineTest > testInvalidOnlineReplicaToReplicaDeletionIneligibleTransition PASSED
kafka.controller.ReplicaStateMachineTest > testInvalidReplicaDeletionSuccessfulToReplicaDeletionStartedTransition STARTED
kafka.controller.ReplicaStateMachineTest > testInvalidReplicaDeletionSuccessfulToReplicaDeletionStartedTransition PASSED
kafka.controller.ReplicaStateMachineTest > testInvalidNewReplicaToReplicaDeletionSuccessfulTransition STARTED
kafka.controller.ReplicaStateMachineTest > testInvalidNewReplicaToReplicaDeletionSuccessfulTransition PASSED
kafka.controller.ReplicaStateMachineTest > testInvalidReplicaDeletionIneligibleToReplicaDeletionStartedTransition STARTED
kafka.controller.ReplicaStateMachineTest > testInvalidReplicaDeletionIneligibleToReplicaDeletionStartedTransition PASSED
kafka.controller.ReplicaStateMachineTest > testInvalidReplicaDeletionStartedToOfflineReplicaTransition STARTED
kafka.controller.ReplicaStateMachineTest > testInvalidReplicaDeletionStartedToOfflineReplicaTransition PASSED
kafka.controller.ReplicaStateMachineTest > testInvalidNewReplicaToReplicaDeletionStartedTransition STARTED
kafka.controller.ReplicaStateMachineTest > testInvalidNewReplicaToReplicaDeletionStartedTransition PASSED
kafka.controller.ReplicaStateMachineTest > testOnlineReplicaToOnlineReplicaTransition STARTED
kafka.controller.ReplicaStateMachineTest > testOnlineReplicaToOnlineReplicaTransition PASSED
kafka.controller.ReplicaStateMachineTest > testInvalidNewReplicaToReplicaDeletionIneligibleTransition STARTED
kafka.controller.ReplicaStateMachineTest > testInvalidNewReplicaToReplicaDeletionIneligibleTransition PASSED
kafka.controller.ReplicaStateMachineTest > testInvalidNonexistentReplicaToOfflineReplicaTransition STARTED
kafka.controller.ReplicaStateMachineTest > testInvalidNonexistentReplicaToOfflineReplicaTransition PASSED
kafka.controller.ReplicaStateMachineTest > testReplicaDeletionStartedToReplicaDeletionSuccessfulTransition STARTED
kafka.controller.ReplicaStateMachineTest > testReplicaDeletionStartedToReplicaDeletionSuccessfulTransition PASSED
kafka.controller.ReplicaStateMachineTest > testInvalidNonexistentReplicaToOnlineReplicaTransition STARTED
kafka.controller.ReplicaStateMachineTest > testInvalidNonexistentReplicaToOnlineReplicaTransition PASSED
kafka.controller.ReplicaStateMachineTest > testInvalidOnlineReplicaToNewReplicaTransition STARTED
kafka.controller.ReplicaStateMachineTest > testInvalidOnlineReplicaToNewReplicaTransition PASSED
kafka.controller.ReplicaStateMachineTest > testReplicaDeletionStartedToReplicaDeletionIneligibleTransition STARTED
kafka.controller.ReplicaStateMachineTest > testReplicaDeletionStartedToReplicaDeletionIneligibleTransition PASSED
kafka.controller.ReplicaStateMachineTest > testInvalidReplicaDeletionSuccessfulToOfflineReplicaTransition STARTED
kafka.controller.ReplicaStateMachineTest > testInvalidReplicaDeletionSuccessfulToOfflineReplicaTransition PASSED
kafka.controller.ReplicaStateMachineTest > testInvalidReplicaDeletionIneligibleToNewReplicaTransition STARTED
kafka.controller.ReplicaStateMachineTest > testInvalidReplicaDeletionIneligibleToNewReplicaTransition PASSED
kafka.controller.ReplicaStateMachineTest > testReplicaDeletionIneligibleToOnlineReplicaTransition STARTED
kafka.controller.ReplicaStateMachineTest > testReplicaDeletionIneligibleToOnlineReplicaTransition PASSED
kafka.controller.ReplicaStateMachineTest > testInvalidReplicaDeletionStartedToNewReplicaTransition STARTED
kafka.controller.ReplicaStateMachineTest > testInvalidReplicaDeletionStartedToNewReplicaTransition PASSED
kafka.controller.ReplicaStateMachineTest > testInvalidNonexistentReplicaToReplicaDeletionSuccessfulTransition STARTED
kafka.controller.ReplicaStateMachineTest > testInvalidNonexistentReplicaToReplicaDeletionSuccessfulTransition PASSED
kafka.controller.ReplicaStateMachineTest > testNewReplicaToOnlineReplicaTransition STARTED
kafka.controller.ReplicaStateMachineTest > testNewReplicaToOnlineReplicaTransition PASSED
kafka.controller.ControllerFailoverTest > testHandleIllegalStateException STARTED
kafka.controller.ControllerFailoverTest > testHandleIllegalStateException PASSED
kafka.controller.ControllerEventManagerTest > testEventThatThrowsException STARTED
kafka.controller.ControllerEventManagerTest > testEventThatThrowsException PASSED
kafka.controller.ControllerEventManagerTest > testSuccessfulEvent STARTED
kafka.controller.ControllerEventManagerTest > testSuccessfulEvent PASSED
kafka.controller.PartitionStateMachineTest > testNonexistentPartitionToNewPartitionTransition STARTED
kafka.controller.PartitionStateMachineTest > testNonexistentPartitionToNewPartitionTransition PASSED
kafka.controller.PartitionStateMachineTest > testNewPartitionToOnlinePartitionTransitionErrorCodeFromCreateStates STARTED
kafka.controller.PartitionStateMachineTest > testNewPartitionToOnlinePartitionTransitionErrorCodeFromCreateStates PASSED
kafka.controller.PartitionStateMachineTest > testOfflinePartitionToNonexistentPartitionTransition STARTED
kafka.controller.PartitionStateMachineTest > testOfflinePartitionToNonexistentPartitionTransition PASSED
kafka.controller.PartitionStateMachineTest > testOnlinePartitionToOfflineTransition STARTED
kafka.controller.PartitionStateMachineTest > testOnlinePartitionToOfflineTransition PASSED
kafka.controller.PartitionStateMachineTest > testNewPartitionToOfflinePartitionTransition STARTED
kafka.controller.PartitionStateMachineTest > testNewPartitionToOfflinePartitionTransition PASSED
kafka.controller.PartitionStateMachineTest > testInvalidNonexistentPartitionToOnlinePartitionTransition STARTED
kafka.controller.PartitionStateMachineTest > testInvalidNonexistentPartitionToOnlinePartitionTransition PASSED
kafka.controller.PartitionStateMachineTest > testInvalidNonexistentPartitionToOfflinePartitionTransition STARTED
kafka.controller.PartitionStateMachineTest > testInvalidNonexistentPartitionToOfflinePartitionTransition PASSED
kafka.controller.PartitionStateMachineTest > testOnlinePartitionToOnlineTransition STARTED
kafka.controller.PartitionStateMachineTest > testOnlinePartitionToOnlineTransition PASSED
kafka.controller.PartitionStateMachineTest > testNewPartitionToOnlinePartitionTransitionZkUtilsExceptionFromCreateStates STARTED
kafka.controller.PartitionStateMachineTest > testNewPartitionToOnlinePartitionTransitionZkUtilsExceptionFromCreateStates PASSED
kafka.controller.PartitionStateMachineTest > testInvalidNewPartitionToNonexistentPartitionTransition STARTED
kafka.controller.PartitionStateMachineTest > testInvalidNewPartitionToNonexistentPartitionTransition PASSED
kafka.controller.PartitionStateMachineTest > testNewPartitionToOnlinePartitionTransition STARTED
kafka.controller.PartitionStateMachineTest > testNewPartitionToOnlinePartitionTransition PASSED
kafka.controller.PartitionStateMachineTest > testInvalidOnlinePartitionToNewPartitionTransition STARTED
kafka.controller.PartitionStateMachineTest > testInvalidOnlinePartitionToNewPartitionTransition PASSED
kafka.controller.PartitionStateMachineTest > testOfflinePartitionToOnlinePartitionTransitionErrorCodeFromStateLookup STARTED
kafka.controller.PartitionStateMachineTest > testOfflinePartitionToOnlinePartitionTransitionErrorCodeFromStateLookup PASSED
kafka.controller.PartitionStateMachineTest > testOnlinePartitionToOnlineTransitionForControlledShutdown STARTED
kafka.controller.PartitionStateMachineTest > testOnlinePartitionToOnlineTransitionForControlledShutdown PASSED
kafka.controller.PartitionStateMachineTest > testOfflinePartitionToOnlinePartitionTransitionZkUtilsExceptionFromStateLookup STARTED
kafka.controller.PartitionStateMachineTest > testOfflinePartitionToOnlinePartitionTransitionZkUtilsExceptionFromStateLookup PASSED
kafka.controller.PartitionStateMachineTest > testInvalidOnlinePartitionToNonexistentPartitionTransition STARTED
kafka.controller.PartitionStateMachineTest > testInvalidOnlinePartitionToNonexistentPartitionTransition PASSED
kafka.controller.PartitionStateMachineTest > testInvalidOfflinePartitionToNewPartitionTransition STARTED
kafka.controller.PartitionStateMachineTest > testInvalidOfflinePartitionToNewPartitionTransition PASSED
kafka.controller.PartitionStateMachineTest > testOfflinePartitionToOnlinePartitionTransition STARTED
kafka.controller.PartitionStateMachineTest > testOfflinePartitionToOnlinePartitionTransition PASSED
kafka.controller.PartitionLeaderElectionAlgorithmsTest > testPreferredReplicaPartitionLeaderElectionPreferredReplicaNotInIsrLive STARTED
kafka.controller.PartitionLeaderElectionAlgorithmsTest > testPreferredReplicaPartitionLeaderElectionPreferredReplicaNotInIsrLive PASSED
kafka.controller.PartitionLeaderElectionAlgorithmsTest > testControlledShutdownPartitionLeaderElectionLastIsrShuttingDown STARTED
kafka.controller.PartitionLeaderElectionAlgorithmsTest > testControlledShutdownPartitionLeaderElectionLastIsrShuttingDown PASSED
kafka.controller.PartitionLeaderElectionAlgorithmsTest > testControlledShutdownPartitionLeaderElection STARTED
kafka.controller.PartitionLeaderElectionAlgorithmsTest > testControlledShutdownPartitionLeaderElection PASSED
kafka.controller.PartitionLeaderElectionAlgorithmsTest > testPreferredReplicaPartitionLeaderElectionPreferredReplicaInIsrNotLive STARTED
kafka.controller.PartitionLeaderElectionAlgorithmsTest > testPreferredReplicaPartitionLeaderElectionPreferredReplicaInIsrNotLive PASSED
kafka.controller.PartitionLeaderElectionAlgorithmsTest > testReassignPartitionLeaderElectionWithNoLiveIsr STARTED
kafka.controller.PartitionLeaderElectionAlgorithmsTest > testReassignPartitionLeaderElectionWithNoLiveIsr PASSED
kafka.controller.PartitionLeaderElectionAlgorithmsTest > testReassignPartitionLeaderElection STARTED
kafka.controller.PartitionLeaderElectionAlgorithmsTest > testReassignPartitionLeaderElection PASSED
kafka.controller.PartitionLeaderElectionAlgorithmsTest > testOfflinePartitionLeaderElection STARTED
kafka.controller.PartitionLeaderElectionAlgorithmsTest > testOfflinePartitionLeaderElection PASSED
kafka.controller.PartitionLeaderElectionAlgorithmsTest > testPreferredReplicaPartitionLeaderElection STARTED
kafka.controller.PartitionLeaderElectionAlgorithmsTest > testPreferredReplicaPartitionLeaderElection PASSED
kafka.controller.PartitionLeaderElectionAlgorithmsTest > testReassignPartitionLeaderElectionWithEmptyIsr STARTED
kafka.controller.PartitionLeaderElectionAlgorithmsTest > testReassignPartitionLeaderElectionWithEmptyIsr PASSED
kafka.controller.PartitionLeaderElectionAlgorithmsTest > testControlledShutdownPartitionLeaderElectionAllIsrSimultaneouslyShutdown STARTED
kafka.controller.PartitionLeaderElectionAlgorithmsTest > testControlledShutdownPartitionLeaderElectionAllIsrSimultaneouslyShutdown PASSED
kafka.controller.PartitionLeaderElectionAlgorithmsTest > testOfflinePartitionLeaderElectionLastIsrOfflineUncleanLeaderElectionEnabled STARTED
kafka.controller.PartitionLeaderElectionAlgorithmsTest > testOfflinePartitionLeaderElectionLastIsrOfflineUncleanLeaderElectionEnabled PASSED
kafka.controller.PartitionLeaderElectionAlgorithmsTest > testPreferredReplicaPartitionLeaderElectionPreferredReplicaNotInIsrNotLive STARTED
kafka.controller.PartitionLeaderElectionAlgorithmsTest > testPreferredReplicaPartitionLeaderElectionPreferredReplicaNotInIsrNotLive PASSED
kafka.controller.PartitionLeaderElectionAlgorithmsTest > testOfflinePartitionLeaderElectionLastIsrOfflineUncleanLeaderElectionDisabled STARTED
kafka.controller.PartitionLeaderElectionAlgorithmsTest > testOfflinePartitionLeaderElectionLastIsrOfflineUncleanLeaderElectionDisabled PASSED
2057 tests completed, 1 failed, 4 skipped
> Task :kafka-2.0-jdk8:core:test FAILED
> Task :testScala_2_12 FAILED
FAILURE: Build failed with an exception.
* What went wrong:
Execution failed for task ':kafka-2.0-jdk8:core:test'.
> There were failing tests. See the report at: file://<https://builds.apache.org/job/kafka-2.0-jdk8/ws/core/build/reports/tests/test/index.html>
* Try:
Run with --stacktrace option to get the stack trace. Run with --info or --debug option to get more log output. Run with --scan to get full insights.
* Get more help at https://help.gradle.org
BUILD FAILED in 4h 7m 23s
26 actionable tasks: 4 executed, 22 up-to-date
Build step 'Execute shell' marked build as failure
[FINDBUGS] Collecting findbugs analysis files...
Setting GRADLE_4_8_1_HOME=/home/jenkins/tools/gradle/4.8.1
[FINDBUGS] Searching for all files in <https://builds.apache.org/job/kafka-2.0-jdk8/ws/> that match the pattern **/build/reports/findbugs/*.xml
[FINDBUGS] Parsing 2 files in <https://builds.apache.org/job/kafka-2.0-jdk8/ws/>
[FINDBUGS] Successfully parsed file <https://builds.apache.org/job/kafka-2.0-jdk8/ws/core/build/reports/findbugs/main.xml> with 0 unique warnings and 0 duplicates.
[FINDBUGS] Successfully parsed file <https://builds.apache.org/job/kafka-2.0-jdk8/ws/streams/streams-scala/build/reports/findbugs/main.xml> with 0 unique warnings and 0 duplicates.
Setting GRADLE_4_8_1_HOME=/home/jenkins/tools/gradle/4.8.1
No credentials specified
Setting GRADLE_4_8_1_HOME=/home/jenkins/tools/gradle/4.8.1
<Git Blamer> Using GitBlamer to create author and commit information for all warnings.
<Git Blamer> GIT_COMMIT=dd332b10ffe1ef68760705fa67951c756c5868e3, workspace=<https://builds.apache.org/job/kafka-2.0-jdk8/ws/>
[FINDBUGS] Computing warning deltas based on reference build #271
Recording test results
Setting GRADLE_4_8_1_HOME=/home/jenkins/tools/gradle/4.8.1
Setting GRADLE_4_8_1_HOME=/home/jenkins/tools/gradle/4.8.1
Jenkins build is back to normal : kafka-2.0-jdk8 #276
Posted by Apache Jenkins Server <je...@builds.apache.org>.
See <https://builds.apache.org/job/kafka-2.0-jdk8/276/display/redirect?page=changes>