You are viewing a plain text version of this content. The canonical link for it is here.
Posted to dev@jmeter.apache.org by Apache Jenkins Server <je...@builds.apache.org> on 2025/10/29 20:33:56 UTC

Build failed in Jenkins: JMeter » JMeter-analysis #548

See <https://ci-builds.apache.org/job/JMeter/job/JMeter-analysis/548/display/redirect>

Changes:


------------------------------------------
[...truncated 309.72 KiB...]
    user.dir=<https://ci-builds.apache.org/job/JMeter/job/JMeter-analysis/ws/src/protocol/http>
    user.language=en
    user.region=null
    user.country=US
    user.variant=
    Locale=en_US
    java.class.version=61.0
    java.awt.headless=null
    os.name=Linux
    os.version=5.15.0-157-generic
    os.arch=amd64
          2.4sec, org.apache.jmeter.protocol.http.control.TestCacheManagerHC4 > testCacheHttpClientBug51932()

> Task :src:dist:distTarSourceSha512
Checksum <https://ci-builds.apache.org/job/JMeter/job/JMeter-analysis/ws/src/dist/build/distributions/apache-jmeter-6.0.0-SNAPSHOT_src.tgz> to <https://ci-builds.apache.org/job/JMeter/job/JMeter-analysis/ws/src/dist/build/checksums/distTarSourceSha512/apache-jmeter-6.0.0-SNAPSHOT_src.tgz.sha512>

> Task :src:core:test
          3.3sec, org.apache.jmeter.report.processor.Top5ErrorsBySamplerConsumerTest > summary info data updated with non-controller failing sample()
          3.4sec,    4 completed,   0 failed,   0 skipped, org.apache.jmeter.report.processor.Top5ErrorsBySamplerConsumerTest
          1.7sec, org.apache.jmeter.testelement.AbstractTestElementTest > set outer properties as temporary when using a TestElementProperty()

JMeterTest > testSuccessWhenJmxExists() STANDARD_OUT
    Created the tree successfully using /tmp/testPlan17036674296694368111.jmx
    Starting standalone test @ 2025 Oct 29 20:32:34 UTC (1761769954545)
    Waiting for possible Shutdown/StopTestNow/HeapDump/ThreadDump message on port 4445

JMeterTest > testFailureWithMissingPlugin() STANDARD_OUT
    Error in NonGUIDriver java.lang.IllegalArgumentException: Problem loading XML from:'/tmp/testPlan8024198551420923006.jmx'. 
    Cause:
    kg.apc.jmeter.samplers.DummySampler

     Detail:com.thoughtworks.xstream.converters.ConversionException: 
    ---- Debugging information ----
    cause-exception     : com.thoughtworks.xstream.converters.ConversionException
    cause-message       : 
    first-jmeter-class  : org.apache.jmeter.save.converters.HashTreeConverter.unmarshal(HashTreeConverter.java:66)
    class               : org.apache.jmeter.save.ScriptWrapper
    required-type       : org.apache.jmeter.save.ScriptWrapper
    converter-type      : org.apache.jmeter.save.ScriptWrapperConverter
    path                : /jmeterTestPlan/hashTree/hashTree/hashTree/kg.apc.jmeter.samplers.DummySampler
    line number         : 16
    version             : not available
    -------------------------------
    Tidying up ...    @ 2025 Oct 29 20:32:34 UTC (1761769954682)
    ... end of run
          3.9sec,   18 completed,   0 failed,   0 skipped, org.apache.jmeter.samplers.TestSampleResult
          1.2sec, org.apache.jmeter.threads.openmodel.ThreadsInterruptAtFinishTest > openmodel interrupts sleep()

> Task :src:jorphan:test
          3.6sec, org.apache.jorphan.exec.TestKeyToolUtils > testIPBasedCert()
         25.7sec,    3 completed,   0 failed,   0 skipped, org.apache.jorphan.exec.TestKeyToolUtils
WARNING  33.7sec,  307 completed,   0 failed,   2 skipped, Gradle Test Run :src:jorphan:test

> Task :src:jorphan:check
> Task :src:jorphan:cleanLocalRepository
> Task :src:jorphan:generateMetadataFileForMavenJavaPublication

> Task :src:components:test
          2.0sec, org.apache.jmeter.visualizers.backend.influxdb.HttpMetricsSenderTest > emptyTokenIsNotSentAsAuthorizedHeader(String, WireMockServer)[1], [1] token="null"

> Task :src:jorphan:generatePomFileForMavenJavaPublication
> Task :src:jorphan:publishMavenJavaPublicationToTmp-mavenRepository
> Task :src:jorphan:publishAllPublicationsToTmp-mavenRepository
> Task :src:jorphan:assemble

> Task :src:protocol:http:test
          3.0sec, org.apache.jmeter.protocol.http.control.TestCacheManagerHC4 > testExpires()

> Task :src:core:test
WARNING  31.4sec,  380 completed,   0 failed,   2 skipped, Gradle Test Run :src:core:test

> Task :src:core:check
> Task :src:core:cleanLocalRepository

> Task :src:dist-check:test
         19.4sec, org.apache.jorphan.reflect.TestClassFinder > testFindClassesThatExtendStringArrayClassOfQArrayTrue()

> Task :src:core:generateMetadataFileForMavenJavaPublication
> Task :src:core:generatePomFileForMavenJavaPublication
> Task :src:core:publishMavenJavaPublicationToTmp-mavenRepository
> Task :src:core:publishAllPublicationsToTmp-mavenRepository
> Task :src:core:assemble

> Task :src:components:test
          2.0sec, org.apache.jmeter.visualizers.backend.influxdb.HttpMetricsSenderTest > emptyTokenIsNotSentAsAuthorizedHeader(String, WireMockServer)[2], [2] token=""
          2.0sec, org.apache.jmeter.visualizers.backend.influxdb.HttpMetricsSenderTest > emptyTokenIsNotSentAsAuthorizedHeader(String, WireMockServer)[3], [3] token=" "
          6.0sec,    3 completed,   0 failed,   0 skipped, org.apache.jmeter.visualizers.backend.influxdb.HttpMetricsSenderTest > emptyTokenIsNotSentAsAuthorizedHeader(String, WireMockServer)
          9.7sec,    4 completed,   0 failed,   0 skipped, org.apache.jmeter.visualizers.backend.influxdb.HttpMetricsSenderTest

OpenJDK 64-Bit Server VM warning: Sharing is only supported for boot loader classes because bootstrap classpath has been appended

> Task :src:protocol:http:test
          3.0sec, org.apache.jmeter.protocol.http.control.TestCacheManagerHC4 > testExpiresBug59962()

> Task :src:dist:distZip

> Task :src:dist:distZipSha512
Checksum <https://ci-builds.apache.org/job/JMeter/job/JMeter-analysis/ws/src/dist/build/distributions/apache-jmeter-6.0.0-SNAPSHOT.zip> to <https://ci-builds.apache.org/job/JMeter/job/JMeter-analysis/ws/src/dist/build/checksums/distZipSha512/apache-jmeter-6.0.0-SNAPSHOT.zip.sha512>

> Task :src:components:test
          1.9sec, org.apache.jmeter.control.RandomOrderControllerTest > next() is null if isDone() is true()
          1.3sec, org.apache.jmeter.visualizers.backend.graphite.PickleGraphiteMetricsSenderTest > destroy closes outputStreamPool()

> Task :src:dist:distZipSource

> Task :src:protocol:http:test
          2.9sec, org.apache.jmeter.protocol.http.control.TestCacheManagerHC4 > testCacheControl()

> Task :src:dist:distZipSourceSha512
Checksum <https://ci-builds.apache.org/job/JMeter/job/JMeter-analysis/ws/src/dist/build/distributions/apache-jmeter-6.0.0-SNAPSHOT_src.zip> to <https://ci-builds.apache.org/job/JMeter/job/JMeter-analysis/ws/src/dist/build/checksums/distZipSourceSha512/apache-jmeter-6.0.0-SNAPSHOT_src.zip.sha512>

> Task :src:dist:assemble

> Task :src:dist-check:test
          1.7sec, org.apache.jorphan.reflect.TestClassFinder > testFindAnnotatedInnerClasses()
         26.3sec,    9 completed,   0 failed,   0 skipped, org.apache.jorphan.reflect.TestClassFinder
          2.1sec,   98 completed,   0 failed,   0 skipped, org.apache.jmeter.functions.ComponentReferenceFunctionTest
          2.2sec,   83 completed,   0 failed,   0 skipped, org.apache.jmeter.gui.action.TestLoad > checkTestFile(String, File)
          2.2sec,   83 completed,   0 failed,   0 skipped, org.apache.jmeter.gui.action.TestLoad
          2.6sec,  140 completed,   0 failed,   0 skipped, org.apache.jmeter.junit.JMeterTest > runGUITitle(GuiComponentHolder)

> Task :src:components:test

DurationAssertionTest STANDARD_OUT
    Setting JMeterHome: <https://ci-builds.apache.org/job/JMeter/job/JMeter-analysis/ws/src/components/../../.>
    Initializing Properties: ../.././bin/jmeter.properties
    JMeterVersion=6.0.0-SNAPSHOT d5e1dd8
    java.version=17.0.12
    java.vm.name=OpenJDK 64-Bit Server VM
    java.vendor=Eclipse Adoptium
    java.home=/usr/local/asfpackages/java/adoptium-jdk-17.0.12+7
    file.encoding=UTF-8
    default encoding=UTF-8
    user.home=/home/jenkins
    user.dir=<https://ci-builds.apache.org/job/JMeter/job/JMeter-analysis/ws/src/components>
    user.language=en
    user.region=null
    user.country=US
    user.variant=
    Locale=en_US
    java.class.version=61.0
    java.awt.headless=null
    os.name=Linux
    os.version=5.15.0-157-generic
    os.arch=amd64
          2.2sec, org.apache.jmeter.threads.openmodel.OpenModelThreadGroupConfigElementJavaTest > ensure_thread_group_initializes_counter_only_once_for_each_thread()
          2.2sec,    1 completed,   0 failed,   0 skipped, org.apache.jmeter.threads.openmodel.OpenModelThreadGroupConfigElementJavaTest
          2.2sec, org.apache.jmeter.threads.openmodel.OpenModelThreadGroupConfigElementTest > ensure thread group initializes counter only once for each thread()
          2.2sec,    1 completed,   0 failed,   0 skipped, org.apache.jmeter.threads.openmodel.OpenModelThreadGroupConfigElementTest
WARNING  49.5sec,  549 completed,   0 failed,   3 skipped, Gradle Test Run :src:components:test

> Task :src:components:check
> Task :src:components:cleanLocalRepository
> Task :src:components:generateMetadataFileForMavenJavaPublication

> Task :src:protocol:http:test
          5.0sec, org.apache.jmeter.protocol.http.control.TestCacheManagerHC4 > testNoCacheControlNoMaxAgeNoExpire()
          3.0sec, org.apache.jmeter.protocol.http.control.TestCacheManagerHC4 > testPrivateCacheExpireNoMaxAge()

> Task :src:components:publishMavenJavaPublicationToTmp-mavenRepository
> Task :src:components:publishAllPublicationsToTmp-mavenRepository
> Task :src:components:assemble

> Task :src:dist-check:test

JMeterTest > runSerialTest(Serializable) STANDARD_ERROR
    Unable to instantiate org.apache.jmeter.gui.GlobalUndoableEdit for service interface java.io.Serializable, java.lang.NoSuchMethodException: org.apache.jmeter.gui.GlobalUndoableEdit.<init>()
    Unable to instantiate org.apache.jmeter.gui.JBooleanPropertyEditor for service interface java.io.Serializable, java.lang.NoSuchMethodException: org.apache.jmeter.gui.JBooleanPropertyEditor.<init>()
    Unable to instantiate org.apache.jmeter.gui.logging.LogEventObject for service interface java.io.Serializable, java.lang.NoSuchMethodException: org.apache.jmeter.gui.logging.LogEventObject.<init>()
    Unable to instantiate org.apache.jmeter.rmi.RMIServerSocketFactoryImpl for service interface java.io.Serializable, java.lang.NoSuchMethodException: org.apache.jmeter.rmi.RMIServerSocketFactoryImpl.<init>()
    Unable to instantiate org.apache.jmeter.rmi.SSLRMIServerSocketFactory for service interface java.io.Serializable, java.lang.NoSuchMethodException: org.apache.jmeter.rmi.SSLRMIServerSocketFactory.<init>()
    Unable to instantiate org.apache.jmeter.threads.RemoteThreadsListenerImpl for service interface java.io.Serializable, java.rmi.server.ExportException: Listen failed on port: 0; nested exception is: 
    	java.io.FileNotFoundException: rmi_keystore.jks (No such file or directory)
    Unable to instantiate org.apache.jmeter.threads.openmodel.ParserException for service interface java.io.Serializable, java.lang.NoSuchMethodException: org.apache.jmeter.threads.openmodel.ParserException.<init>()
    Unable to instantiate org.apache.jmeter.threads.openmodel.TokenizerException for service interface java.io.Serializable, java.lang.NoSuchMethodException: org.apache.jmeter.threads.openmodel.TokenizerException.<init>()
    Unable to instantiate org.apache.jmeter.util.LocaleChangeEvent for service interface java.io.Serializable, java.lang.NoSuchMethodException: org.apache.jmeter.util.LocaleChangeEvent.<init>()
WARNING  10.7sec, 1310 completed,   0 failed,   6 skipped, org.apache.jmeter.junit.JMeterTest
          2.3sec,  408 completed,   0 failed,   0 skipped, org.apache.jmeter.testbeans.gui.PackageTest > runTest(Class, Locale, ResourceBundle)
          2.3sec,  408 completed,   0 failed,   0 skipped, org.apache.jmeter.testbeans.gui.PackageTest
          1.9sec, org.apache.jmeter.gui.action.HtmlReportGeneratorTest > report generation fails when format does not match and error is reported()
          2.9sec, org.apache.jmeter.gui.action.HtmlReportGeneratorTest > check that report generation succeeds and statistic are generated()
          4.8sec,    7 completed,   0 failed,   0 skipped, org.apache.jmeter.gui.action.HtmlReportGeneratorTest
WARNING  63.5sec, 2107 completed,   0 failed,   6 skipped, Gradle Test Run :src:dist-check:test

> Task :src:dist-check:check
> Task :src:dist-check:assemble UP-TO-DATE

> Task :src:protocol:http:test
          5.0sec, org.apache.jmeter.protocol.http.control.TestCacheManagerHC4 > testPrivateCacheNoMaxAgeNoExpire()
          3.0sec, org.apache.jmeter.protocol.http.control.TestCacheManagerHC4 > testPrivateCache()
         27.4sec,   26 completed,   0 failed,   0 skipped, org.apache.jmeter.protocol.http.control.TestCacheManagerHC4
          3.0sec, org.apache.jmeter.protocol.http.control.TestCacheManagerUrlConnection > testCacheHttpClientBug51932()
          3.0sec, org.apache.jmeter.protocol.http.control.TestCacheManagerUrlConnection > testExpires()
          3.0sec, org.apache.jmeter.protocol.http.control.TestCacheManagerUrlConnection > testExpiresBug59962()
          2.9sec, org.apache.jmeter.protocol.http.control.TestCacheManagerUrlConnection > testCacheControl()
          5.0sec, org.apache.jmeter.protocol.http.control.TestCacheManagerUrlConnection > testNoCacheControlNoMaxAgeNoExpire()
          3.0sec, org.apache.jmeter.protocol.http.control.TestCacheManagerUrlConnection > testPrivateCacheExpireNoMaxAge()
          5.0sec, org.apache.jmeter.protocol.http.control.TestCacheManagerUrlConnection > testPrivateCacheNoMaxAgeNoExpire()
          3.0sec, org.apache.jmeter.protocol.http.control.TestCacheManagerUrlConnection > testPrivateCache()
         28.0sec,   25 completed,   0 failed,   0 skipped, org.apache.jmeter.protocol.http.control.TestCacheManagerUrlConnection
         11.2sec, org.apache.jmeter.protocol.http.sampler.TestSerializedHTTPSampler > checkThatFilesAreReadRelativeToBaseDir()
         11.2sec,    1 completed,   0 failed,   0 skipped, org.apache.jmeter.protocol.http.sampler.TestSerializedHTTPSampler
          1.3sec, org.apache.jmeter.protocol.http.HttpRequestInterruptTest > http request interrupts(String, WireMockRuntimeInfo)[1], [1] HttpClient4
          1.2sec, org.apache.jmeter.protocol.http.HttpRequestInterruptTest > http request interrupts(String, WireMockRuntimeInfo)[2], [2] HTTPSampler
          2.5sec,    2 completed,   0 failed,   0 skipped, org.apache.jmeter.protocol.http.HttpRequestInterruptTest > http request interrupts(String, WireMockRuntimeInfo)
          3.0sec,    2 completed,   0 failed,   0 skipped, org.apache.jmeter.protocol.http.HttpRequestInterruptTest
WARNING 101.3sec,  791 completed,   0 failed,   1 skipped, Gradle Test Run :src:protocol:http:test

> Task :src:protocol:http:check
> Task :src:protocol:http:cleanLocalRepository
> Task :src:protocol:http:generateMetadataFileForMavenJavaPublication
> Task :src:protocol:http:publishMavenJavaPublicationToTmp-mavenRepository
> Task :src:protocol:http:publishAllPublicationsToTmp-mavenRepository
> Task :src:protocol:http:assemble

> Task :sonarqube
Task 'sonarqube' is deprecated. Use 'sonar' instead.

> Task :sonarqube FAILED

[Incubating] Problems report is available at: file://<https://ci-builds.apache.org/job/JMeter/job/JMeter-analysis/ws/build/reports/problems/problems-report.html>

FAILURE: Build failed with an exception.

* What went wrong:
Execution failed for task ':sonarqube'.
> Project not found. Please check the 'sonar.projectKey' and 'sonar.organization' properties, the 'SONAR_TOKEN' environment variable, or contact the project administrator to check the permissions of the user the token belongs to

* Try:
> Run with --stacktrace option to get the stack trace.
> Run with --info or --debug option to get more log output.
> Get more help at https://help.gradle.org.

Deprecated Gradle features were used in this build, making it incompatible with Gradle 9.0.

You can use '--warning-mode all' to show the individual deprecation warnings and determine if they come from your own scripts or plugins.

For more on this, please refer to https://docs.gradle.org/8.14.3/userguide/command_line_interface.html#sec:command_line_warnings in the Gradle documentation.

BUILD FAILED in 2m 30s
649 actionable tasks: 141 executed, 508 up-to-date

See the profiling report at: file://<https://ci-builds.apache.org/job/JMeter/job/JMeter-analysis/ws/build/reports/profile/profile-2025-10-29-20-31-30.html>
A fine-grained performance profile is available: use the --scan option.
Build step 'Invoke Gradle script' changed build result to FAILURE
Build step 'Invoke Gradle script' marked build as failure
Xvfb stopping
Recording test results
[Checks API] No suitable checks publisher found.

Build failed in Jenkins: JMeter » JMeter-analysis #549

Posted by Apache Jenkins Server <je...@builds.apache.org>.
See <https://ci-builds.apache.org/job/JMeter/job/JMeter-analysis/549/display/redirect?page=changes>

Changes:

[Vladimir Sitnikov] fix(deps): update dependency org.jetbrains:annotations to v26

[Vladimir Sitnikov] fix(deps): update dependency nl.jqno.equalsverifier:equalsverifier to v4

[Vladimir Sitnikov] fix(deps): update org.apache.logging.log4j to v2.25.2


------------------------------------------
[...truncated 328.25 KiB...]
... end of run
No errors present in the logfile <https://ci-builds.apache.org/job/JMeter/job/JMeter-analysis/ws/bin/TestCookieManager.log> (the file is empty)

> Task :src:dist-check:batchTestHeaderManagerHttpClient4
2025-10-30T06:15:16.432613278Z main WARN The use of package scanning to locate Log4j plugins is deprecated.
Please remove the `packages` attribute from your configuration file.
See https://logging.apache.org/log4j/2.x/faq.html#package-scanning for details.
Creating summariser <summary>
Created the tree successfully using <https://ci-builds.apache.org/job/JMeter/job/JMeter-analysis/ws/bin/testfiles/TestHeaderManager.jmx>
Starting standalone test @ 2025 Oct 30 06:15:17 UTC (1761804917714)
Waiting for possible Shutdown/StopTestNow/HeapDump/ThreadDump message on port 4445
2025-10-30T06:15:18.136464811Z Thread Group 1-1 WARN The use of package scanning to locate Log4j plugins is deprecated.
Please remove the `packages` attribute from your configuration file.
See https://logging.apache.org/log4j/2.x/faq.html#package-scanning for details.
summary =      3 in 00:00:00 =    7.4/s Avg:    15 Min:     1 Max:    43 Err:     0 (0.00%)
Tidying up ...    @ 2025 Oct 30 06:15:18 UTC (1761804918364)
... end of run
No errors present in the logfile <https://ci-builds.apache.org/job/JMeter/job/JMeter-analysis/ws/bin/TestHeaderManager.log> (the file is empty)

> Task :src:dist-check:batchTestHeaderManagerJava
2025-10-30T06:15:20.891800202Z main WARN The use of package scanning to locate Log4j plugins is deprecated.
Please remove the `packages` attribute from your configuration file.
See https://logging.apache.org/log4j/2.x/faq.html#package-scanning for details.
Creating summariser <summary>
Created the tree successfully using <https://ci-builds.apache.org/job/JMeter/job/JMeter-analysis/ws/bin/testfiles/TestHeaderManager.jmx>
Starting standalone test @ 2025 Oct 30 06:15:22 UTC (1761804922047)
Waiting for possible Shutdown/StopTestNow/HeapDump/ThreadDump message on port 4445
summary =      3 in 00:00:00 =   13.6/s Avg:     5 Min:     1 Max:    15 Err:     0 (0.00%)
Tidying up ...    @ 2025 Oct 30 06:15:22 UTC (1761804922490)
... end of run
No errors present in the logfile <https://ci-builds.apache.org/job/JMeter/job/JMeter-analysis/ws/bin/TestHeaderManager.log> (the file is empty)

> Task :src:dist-check:batchTestKeepAlive SKIPPED
> Task :src:dist-check:batchTestRedirectionPolicies SKIPPED

> Task :src:dist-check:batchTestResultStatusAction
2025-10-30T06:15:25.020475820Z main WARN The use of package scanning to locate Log4j plugins is deprecated.
Please remove the `packages` attribute from your configuration file.
See https://logging.apache.org/log4j/2.x/faq.html#package-scanning for details.
Creating summariser <summary>
Created the tree successfully using <https://ci-builds.apache.org/job/JMeter/job/JMeter-analysis/ws/bin/testfiles/TestResultStatusAction.jmx>
Starting standalone test @ 2025 Oct 30 06:15:26 UTC (1761804926309)
Waiting for possible Shutdown/StopTestNow/HeapDump/ThreadDump message on port 4445
summary =    135 in 00:00:02 =   87.8/s Avg:     1 Min:     0 Max:   145 Err:    18 (13.33%)
Tidying up ...    @ 2025 Oct 30 06:15:28 UTC (1761804928526)
... end of run
No errors present in the logfile <https://ci-builds.apache.org/job/JMeter/job/JMeter-analysis/ws/bin/TestResultStatusAction.log> (the file is empty)

> Task :src:dist-check:batchTestSchedulerWithTimer
2025-10-30T06:15:31.044504180Z main WARN The use of package scanning to locate Log4j plugins is deprecated.
Please remove the `packages` attribute from your configuration file.
See https://logging.apache.org/log4j/2.x/faq.html#package-scanning for details.
Creating summariser <summary>
Created the tree successfully using <https://ci-builds.apache.org/job/JMeter/job/JMeter-analysis/ws/bin/testfiles/TestSchedulerWithTimer.jmx>
Starting standalone test @ 2025 Oct 30 06:15:32 UTC (1761804932156)
Waiting for possible Shutdown/StopTestNow/HeapDump/ThreadDump message on port 4445
summary +      1 in 00:00:01 =    0.9/s Avg:  1080 Min:  1080 Max:  1080 Err:     0 (0.00%) Active: 1 Started: 1 Finished: 0
summary +      4 in 00:00:05 =    0.7/s Avg:    90 Min:     5 Max:   346 Err:     0 (0.00%) Active: 0 Started: 1 Finished: 1
summary =      5 in 00:00:07 =    0.8/s Avg:   288 Min:     5 Max:  1080 Err:     0 (0.00%)
Tidying up ...    @ 2025 Oct 30 06:15:39 UTC (1761804939313)
... end of run
No errors present in the logfile <https://ci-builds.apache.org/job/JMeter/job/JMeter-analysis/ws/bin/TestSchedulerWithTimer.log> (the file is empty)

> Task :src:dist-check:batchTests
> Task :src:dist-check:compileTestKotlin
> Task :src:dist-check:compileTestJava
> Task :src:dist-check:testClasses
> Task :src:protocol:ftp:cleanLocalRepository
> Task :src:functions:cleanLocalRepository
> Task :src:protocol:junit:cleanLocalRepository
> Task :src:protocol:ldap:cleanLocalRepository
> Task :src:core:cleanLocalRepository
> Task :src:protocol:jms:cleanLocalRepository
> Task :src:protocol:jdbc:cleanLocalRepository
> Task :src:protocol:http:cleanLocalRepository
> Task :src:protocol:junit-sample:cleanLocalRepository
> Task :src:protocol:java:cleanLocalRepository
> Task :src:protocol:mongodb:cleanLocalRepository
> Task :src:protocol:bolt:cleanLocalRepository
> Task :src:config:cleanLocalRepository
> Task :src:launcher:cleanLocalRepository
> Task :src:bom-thirdparty:cleanLocalRepository
> Task :src:bom:cleanLocalRepository
> Task :src:bom-testing:cleanLocalRepository
> Task :src:jorphan:cleanLocalRepository
> Task :src:protocol:tcp:cleanLocalRepository
> Task :src:components:cleanLocalRepository
> Task :src:protocol:native:cleanLocalRepository
> Task :src:protocol:mail:cleanLocalRepository
> Task :src:bom-thirdparty:publishMavenJavaPlatformPublicationToTmp-mavenRepository
> Task :src:bom:publishMavenJavaPlatformPublicationToTmp-mavenRepository
> Task :src:bom:publishAllPublicationsToTmp-mavenRepository
> Task :src:bom-thirdparty:publishAllPublicationsToTmp-mavenRepository
> Task :src:bom-thirdparty:assemble
> Task :src:bom:assemble
> Task :src:protocol:mail:publishMavenJavaPublicationToTmp-mavenRepository
> Task :src:protocol:mail:publishAllPublicationsToTmp-mavenRepository
> Task :src:protocol:mail:assemble
> Task :src:protocol:ldap:publishMavenJavaPublicationToTmp-mavenRepository
> Task :src:protocol:ldap:publishAllPublicationsToTmp-mavenRepository
> Task :src:protocol:jms:publishMavenJavaPublicationToTmp-mavenRepository
> Task :src:protocol:ldap:assemble
> Task :src:protocol:jms:publishAllPublicationsToTmp-mavenRepository
> Task :src:protocol:jms:assemble
> Task :src:bom-testing:publishMavenJavaPlatformPublicationToTmp-mavenRepository
> Task :src:protocol:tcp:publishMavenJavaPublicationToTmp-mavenRepository
> Task :src:protocol:junit-sample:publishMavenJavaPublicationToTmp-mavenRepository
> Task :src:protocol:tcp:publishAllPublicationsToTmp-mavenRepository
> Task :src:protocol:junit-sample:publishAllPublicationsToTmp-mavenRepository
> Task :src:protocol:tcp:assemble
> Task :src:protocol:junit-sample:assemble
> Task :src:protocol:java:publishMavenJavaPublicationToTmp-mavenRepository
> Task :src:protocol:java:publishAllPublicationsToTmp-mavenRepository
> Task :src:protocol:ftp:publishMavenJavaPublicationToTmp-mavenRepository
> Task :src:protocol:java:assemble
> Task :src:protocol:ftp:publishAllPublicationsToTmp-mavenRepository
> Task :src:bom-testing:publishAllPublicationsToTmp-mavenRepository
> Task :src:protocol:ftp:assemble
> Task :src:functions:publishMavenJavaPublicationToTmp-mavenRepository
> Task :src:bom-testing:assemble
> Task :src:functions:publishAllPublicationsToTmp-mavenRepository
> Task :src:functions:assemble
> Task :src:protocol:jdbc:publishMavenJavaPublicationToTmp-mavenRepository
> Task :src:protocol:jdbc:publishAllPublicationsToTmp-mavenRepository
> Task :src:launcher:publishMavenJavaPublicationToTmp-mavenRepository
> Task :src:protocol:junit:publishMavenJavaPublicationToTmp-mavenRepository
> Task :src:protocol:jdbc:assemble
> Task :src:launcher:publishAllPublicationsToTmp-mavenRepository
> Task :src:protocol:junit:publishAllPublicationsToTmp-mavenRepository
> Task :src:launcher:assemble
> Task :src:protocol:junit:assemble
> Task :src:protocol:bolt:publishMavenJavaPublicationToTmp-mavenRepository
> Task :src:protocol:native:publishMavenJavaPublicationToTmp-mavenRepository
> Task :src:protocol:bolt:publishAllPublicationsToTmp-mavenRepository
> Task :src:protocol:bolt:assemble
> Task :src:protocol:mongodb:publishMavenJavaPublicationToTmp-mavenRepository
> Task :src:protocol:native:publishAllPublicationsToTmp-mavenRepository
> Task :src:protocol:native:assemble
> Task :src:protocol:mongodb:publishAllPublicationsToTmp-mavenRepository
> Task :src:protocol:mongodb:assemble
> Task :src:config:publishMavenJavaPublicationToTmp-mavenRepository
> Task :src:config:publishAllPublicationsToTmp-mavenRepository
> Task :src:config:assemble
> Task :src:protocol:http:publishMavenJavaPublicationToTmp-mavenRepository
> Task :src:protocol:http:publishAllPublicationsToTmp-mavenRepository
> Task :src:protocol:http:assemble
> Task :src:jorphan:publishMavenJavaPublicationToTmp-mavenRepository
> Task :src:jorphan:publishAllPublicationsToTmp-mavenRepository
> Task :src:jorphan:assemble
> Task :src:components:publishMavenJavaPublicationToTmp-mavenRepository
> Task :src:components:publishAllPublicationsToTmp-mavenRepository
> Task :src:components:assemble
> Task :src:core:publishMavenJavaPublicationToTmp-mavenRepository
> Task :src:core:publishAllPublicationsToTmp-mavenRepository
> Task :src:core:assemble

> Task :src:dist-check:test

ThreadGroupLoad STANDARD_ERROR
    2025-10-30T06:15:43.973716778Z ForkJoinPool-1-worker-1 WARN The use of package scanning to locate Log4j plugins is deprecated.
    Please remove the `packages` attribute from your configuration file.
    See https://logging.apache.org/log4j/2.x/faq.html#package-scanning for details.

ThreadGroupLoad STANDARD_OUT
    Setting JMeterHome: <https://ci-builds.apache.org/job/JMeter/job/JMeter-analysis/ws/src/dist-check/../../.>
    Initializing Properties: ../.././bin/jmeter.properties
    JMeterVersion=6.0.0-SNAPSHOT aa86d3f
    java.version=17.0.12
    java.vm.name=OpenJDK 64-Bit Server VM
    java.vendor=Eclipse Adoptium
    java.home=/usr/local/asfpackages/java/adoptium-jdk-17.0.12+7
    file.encoding=UTF-8
    default encoding=UTF-8
    user.home=/home/jenkins
    user.dir=<https://ci-builds.apache.org/job/JMeter/job/JMeter-analysis/ws/src/dist-check>
    user.language=en
    user.region=null
    user.country=US
    user.variant=
    Locale=en_US
    java.class.version=61.0
    java.awt.headless=null
    os.name=Linux
    os.version=5.15.0-157-generic
    os.arch=amd64

> Task :src:dist-check:spotbugsTest
SpotBugs ended with exit code 1

> Task :src:dist-check:test
         12.7sec, org.apache.jorphan.reflect.TestClassFinder > testFindClassesThatExtendStringArrayClassOfQArrayTrue()
          3.7sec, org.apache.jorphan.reflect.TestClassFinder > testFindAnnotatedClasses()
          1.5sec, org.apache.jorphan.reflect.TestClassFinder > testFindAnnotatedInnerClasses()
         19.0sec,    9 completed,   0 failed,   0 skipped, org.apache.jorphan.reflect.TestClassFinder
          2.8sec,  140 completed,   0 failed,   0 skipped, org.apache.jmeter.junit.JMeterTest > runGUITitle(GuiComponentHolder)

JMeterTest > runSerialTest(Serializable) STANDARD_ERROR
    Unable to instantiate org.apache.jmeter.gui.GlobalUndoableEdit for service interface java.io.Serializable, java.lang.NoSuchMethodException: org.apache.jmeter.gui.GlobalUndoableEdit.<init>()
    Unable to instantiate org.apache.jmeter.gui.JBooleanPropertyEditor for service interface java.io.Serializable, java.lang.NoSuchMethodException: org.apache.jmeter.gui.JBooleanPropertyEditor.<init>()
    Unable to instantiate org.apache.jmeter.gui.logging.LogEventObject for service interface java.io.Serializable, java.lang.NoSuchMethodException: org.apache.jmeter.gui.logging.LogEventObject.<init>()
    Unable to instantiate org.apache.jmeter.rmi.RMIServerSocketFactoryImpl for service interface java.io.Serializable, java.lang.NoSuchMethodException: org.apache.jmeter.rmi.RMIServerSocketFactoryImpl.<init>()
    Unable to instantiate org.apache.jmeter.rmi.SSLRMIServerSocketFactory for service interface java.io.Serializable, java.lang.NoSuchMethodException: org.apache.jmeter.rmi.SSLRMIServerSocketFactory.<init>()
    Unable to instantiate org.apache.jmeter.threads.RemoteThreadsListenerImpl for service interface java.io.Serializable, java.rmi.server.ExportException: Listen failed on port: 0; nested exception is: 
    	java.io.FileNotFoundException: rmi_keystore.jks (No such file or directory)
    Unable to instantiate org.apache.jmeter.threads.openmodel.ParserException for service interface java.io.Serializable, java.lang.NoSuchMethodException: org.apache.jmeter.threads.openmodel.ParserException.<init>()
    Unable to instantiate org.apache.jmeter.threads.openmodel.TokenizerException for service interface java.io.Serializable, java.lang.NoSuchMethodException: org.apache.jmeter.threads.openmodel.TokenizerException.<init>()
    Unable to instantiate org.apache.jmeter.util.LocaleChangeEvent for service interface java.io.Serializable, java.lang.NoSuchMethodException: org.apache.jmeter.util.LocaleChangeEvent.<init>()
WARNING  10.5sec, 1310 completed,   0 failed,   6 skipped, org.apache.jmeter.junit.JMeterTest
          2.2sec,  408 completed,   0 failed,   0 skipped, org.apache.jmeter.testbeans.gui.PackageTest > runTest(Class, Locale, ResourceBundle)
          2.2sec,  408 completed,   0 failed,   0 skipped, org.apache.jmeter.testbeans.gui.PackageTest
          1.7sec, org.apache.jmeter.gui.action.HtmlReportGeneratorTest > report generation fails when format does not match and error is reported()
          2.7sec, org.apache.jmeter.gui.action.HtmlReportGeneratorTest > check that report generation succeeds and statistic are generated()
          4.4sec,    7 completed,   0 failed,   0 skipped, org.apache.jmeter.gui.action.HtmlReportGeneratorTest
WARNING  44.8sec, 2107 completed,   0 failed,   6 skipped, Gradle Test Run :src:dist-check:test

> Task :src:dist-check:check

> Task :sonarqube FAILED
Task 'sonarqube' is deprecated. Use 'sonar' instead.

[Incubating] Problems report is available at: file://<https://ci-builds.apache.org/job/JMeter/job/JMeter-analysis/ws/build/reports/problems/problems-report.html>

FAILURE: Build failed with an exception.

* What went wrong:
Execution failed for task ':sonarqube'.
> Project not found. Please check the 'sonar.projectKey' and 'sonar.organization' properties, the 'SONAR_TOKEN' environment variable, or contact the project administrator to check the permissions of the user the token belongs to

* Try:
> Run with --stacktrace option to get the stack trace.
> Run with --info or --debug option to get more log output.
> Get more help at https://help.gradle.org.

Deprecated Gradle features were used in this build, making it incompatible with Gradle 9.0.

You can use '--warning-mode all' to show the individual deprecation warnings and determine if they come from your own scripts or plugins.

For more on this, please refer to https://docs.gradle.org/8.14.3/userguide/command_line_interface.html#sec:command_line_warnings in the Gradle documentation.

BUILD FAILED in 11m 59s
649 actionable tasks: 355 executed, 294 up-to-date

See the profiling report at: file://<https://ci-builds.apache.org/job/JMeter/job/JMeter-analysis/ws/build/reports/profile/profile-2025-10-30-06-04-39.html>
A fine-grained performance profile is available: use the --scan option.
Build step 'Invoke Gradle script' changed build result to FAILURE
Build step 'Invoke Gradle script' marked build as failure
Xvfb stopping
Recording test results
[Checks API] No suitable checks publisher found.