You are viewing a plain text version of this content. The canonical link for it is here.
Posted to builds@solr.apache.org by Policeman Jenkins Server via builds <bu...@solr.apache.org> on 2026/04/14 02:24:56 UTC
[JENKINS] Solr-main-Linux (64bit/hotspot/jdk-23.0.2) - Build # 32781 - Unstable!
Build: https://jenkins.thetaphi.de/job/Solr-main-Linux/32781/
Java: 64bit/hotspot/jdk-23.0.2 -XX:+UseCompressedOops -XX:+UseZGC
14 tests failed.
FAILED: org.apache.solr.s3.S3IncrementalBackupTest.testSimple
Error Message:
java.lang.AssertionError: expected:<93> but was:<75>
Stack Trace:
java.lang.AssertionError: expected:<93> but was:<75>
at org.junit.Assert.fail(Assert.java:89)
at org.junit.Assert.failNotEquals(Assert.java:835)
at org.junit.Assert.assertEquals(Assert.java:647)
at org.junit.Assert.assertEquals(Assert.java:633)
at org.apache.solr.cloud.api.collections.AbstractIncrementalBackupTest.testSimple(AbstractIncrementalBackupTest.java:192)
at java.base/jdk.internal.reflect.DirectMethodHandleAccessor.invoke(DirectMethodHandleAccessor.java:103)
at java.base/java.lang.reflect.Method.invoke(Method.java:580)
at com.carrotsearch.randomizedtesting.RandomizedRunner.invoke(RandomizedRunner.java:1763)
at com.carrotsearch.randomizedtesting.RandomizedRunner$8.evaluate(RandomizedRunner.java:946)
at com.carrotsearch.randomizedtesting.RandomizedRunner$9.evaluate(RandomizedRunner.java:982)
at com.carrotsearch.randomizedtesting.RandomizedRunner$10.evaluate(RandomizedRunner.java:996)
at com.carrotsearch.randomizedtesting.rules.SystemPropertiesRestoreRule$1.evaluate(SystemPropertiesRestoreRule.java:80)
at org.junit.rules.RunRules.evaluate(RunRules.java:20)
at org.apache.lucene.tests.util.TestRuleSetupTeardownChained$1.evaluate(TestRuleSetupTeardownChained.java:48)
at org.apache.lucene.tests.util.AbstractBeforeAfterRule$1.evaluate(AbstractBeforeAfterRule.java:43)
at org.apache.lucene.tests.util.TestRuleThreadAndTestName$1.evaluate(TestRuleThreadAndTestName.java:45)
at org.apache.lucene.tests.util.TestRuleIgnoreAfterMaxFailures$1.evaluate(TestRuleIgnoreAfterMaxFailures.java:60)
at org.apache.lucene.tests.util.TestRuleMarkFailure$1.evaluate(TestRuleMarkFailure.java:44)
at org.junit.rules.RunRules.evaluate(RunRules.java:20)
at com.carrotsearch.randomizedtesting.rules.StatementAdapter.evaluate(StatementAdapter.java:36)
at com.carrotsearch.randomizedtesting.ThreadLeakControl$StatementRunner.run(ThreadLeakControl.java:390)
at com.carrotsearch.randomizedtesting.ThreadLeakControl.forkTimeoutingTask(ThreadLeakControl.java:843)
at com.carrotsearch.randomizedtesting.ThreadLeakControl$3.evaluate(ThreadLeakControl.java:490)
at com.carrotsearch.randomizedtesting.RandomizedRunner.runSingleTest(RandomizedRunner.java:955)
at com.carrotsearch.randomizedtesting.RandomizedRunner$5.evaluate(RandomizedRunner.java:840)
at com.carrotsearch.randomizedtesting.RandomizedRunner$6.evaluate(RandomizedRunner.java:891)
at com.carrotsearch.randomizedtesting.RandomizedRunner$7.evaluate(RandomizedRunner.java:902)
at com.adobe.testing.s3mock.junit4.S3MockRule$1.evaluate(S3MockRule.java:70)
at com.carrotsearch.randomizedtesting.rules.StatementAdapter.evaluate(StatementAdapter.java:36)
at com.carrotsearch.randomizedtesting.rules.StatementAdapter.evaluate(StatementAdapter.java:36)
at org.apache.lucene.tests.util.AbstractBeforeAfterRule$1.evaluate(AbstractBeforeAfterRule.java:43)
at com.carrotsearch.randomizedtesting.rules.SystemPropertiesRestoreRule$1.evaluate(SystemPropertiesRestoreRule.java:80)
at org.junit.rules.RunRules.evaluate(RunRules.java:20)
at org.apache.lucene.tests.util.AbstractBeforeAfterRule$1.evaluate(AbstractBeforeAfterRule.java:43)
at com.carrotsearch.randomizedtesting.rules.StatementAdapter.evaluate(StatementAdapter.java:36)
at org.apache.lucene.tests.util.TestRuleStoreClassName$1.evaluate(TestRuleStoreClassName.java:38)
at com.carrotsearch.randomizedtesting.rules.NoShadowingOrOverridesOnMethodsRule$1.evaluate(NoShadowingOrOverridesOnMethodsRule.java:40)
at com.carrotsearch.randomizedtesting.rules.NoShadowingOrOverridesOnMethodsRule$1.evaluate(NoShadowingOrOverridesOnMethodsRule.java:40)
at com.carrotsearch.randomizedtesting.rules.StatementAdapter.evaluate(StatementAdapter.java:36)
at com.carrotsearch.randomizedtesting.rules.StatementAdapter.evaluate(StatementAdapter.java:36)
at org.apache.lucene.tests.util.TestRuleAssertionsRequired$1.evaluate(TestRuleAssertionsRequired.java:53)
at org.apache.lucene.tests.util.AbstractBeforeAfterRule$1.evaluate(AbstractBeforeAfterRule.java:43)
at org.apache.lucene.tests.util.TestRuleMarkFailure$1.evaluate(TestRuleMarkFailure.java:44)
at org.apache.lucene.tests.util.TestRuleIgnoreAfterMaxFailures$1.evaluate(TestRuleIgnoreAfterMaxFailures.java:60)
at org.apache.lucene.tests.util.TestRuleIgnoreTestSuites$1.evaluate(TestRuleIgnoreTestSuites.java:47)
at org.junit.rules.RunRules.evaluate(RunRules.java:20)
at com.carrotsearch.randomizedtesting.rules.StatementAdapter.evaluate(StatementAdapter.java:36)
at com.carrotsearch.randomizedtesting.ThreadLeakControl$StatementRunner.run(ThreadLeakControl.java:390)
at com.carrotsearch.randomizedtesting.ThreadLeakControl.lambda$forkTimeoutingTask$0(ThreadLeakControl.java:850)
at java.base/java.lang.Thread.run(Thread.java:1575)
FAILED: org.apache.solr.update.SolrIndexFingerprintTest.classMethod
Error Message:
java.lang.Exception: Suite timeout exceeded (>= 7200000 msec).
Stack Trace:
java.lang.Exception: Suite timeout exceeded (>= 7200000 msec).
at __randomizedtesting.SeedInfo.seed([F0D8AD91BBBB4B57]:0)
FAILED: org.apache.solr.update.SolrIndexFingerprintTest.classMethod
Error Message:
java.lang.AssertionError: ObjectTracker found 1 object(s) that were not released!!! [MockDirectoryWrapper]
org.apache.lucene.tests.store.MockDirectoryWrapper:org.apache.solr.common.util.ObjectReleaseTracker$ObjectTrackerException: org.apache.lucene.tests.store.MockDirectoryWrapper@41095762
at org.apache.solr.common.util.ObjectReleaseTracker.track(ObjectReleaseTracker.java:57)
at org.apache.solr.core.CachingDirectoryFactory.get(CachingDirectoryFactory.java:405)
at org.apache.solr.update.SolrIndexWriter.create(SolrIndexWriter.java:115)
at org.apache.solr.core.SolrCore.initIndex(SolrCore.java:911)
at org.apache.solr.core.SolrCore.<init>(SolrCore.java:1133)
at org.apache.solr.core.SolrCore.<init>(SolrCore.java:1061)
at org.apache.solr.core.CoreContainer.createFromDescriptor(CoreContainer.java:1676)
at org.apache.solr.core.CoreContainer.lambda$loadInternal$6(CoreContainer.java:995)
at org.apache.solr.util.stats.OtelInstrumentedExecutorService$InstrumentedRunnable.run(OtelInstrumentedExecutorService.java:256)
at org.apache.solr.common.util.ExecutorUtil$MDCAwareThreadPoolExecutor.lambda$execute$0(ExecutorUtil.java:381)
at java.base/java.util.concurrent.ThreadPoolExecutor.runWorker(ThreadPoolExecutor.java:1144)
at java.base/java.util.concurrent.ThreadPoolExecutor$Worker.run(ThreadPoolExecutor.java:642)
at java.base/java.lang.Thread.run(Thread.java:1575)
Caused by: java.lang.Exception: Submitter stack trace
at org.apache.solr.common.util.ExecutorUtil$MDCAwareThreadPoolExecutor.execute(ExecutorUtil.java:348)
at org.apache.solr.util.stats.OtelInstrumentedExecutorService.execute(OtelInstrumentedExecutorService.java:156)
at org.apache.solr.core.CoreContainer.loadInternal(CoreContainer.java:984)
at org.apache.solr.core.CoreContainer.load(CoreContainer.java:753)
at org.apache.solr.util.TestHarness.<init>(TestHarness.java:171)
at org.apache.solr.util.TestHarness.<init>(TestHarness.java:139)
at org.apache.solr.util.TestHarness.<init>(TestHarness.java:147)
at org.apache.solr.util.TestHarness.<init>(TestHarness.java:91)
at org.apache.solr.SolrTestCaseJ4.createCore(SolrTestCaseJ4.java:705)
at org.apache.solr.SolrTestCaseJ4.initCore(SolrTestCaseJ4.java:695)
at org.apache.solr.SolrTestCaseJ4.initCore(SolrTestCaseJ4.java:558)
at org.apache.solr.SolrTestCaseJ4.initCore(SolrTestCaseJ4.java:545)
at org.apache.solr.update.SolrIndexFingerprintTest.beforeTests(SolrIndexFingerprintTest.java:32)
at java.base/jdk.internal.reflect.DirectMethodHandleAccessor.invoke(DirectMethodHandleAccessor.java:103)
at java.base/java.lang.reflect.Method.invoke(Method.java:580)
at com.carrotsearch.randomizedtesting.RandomizedRunner.invoke(RandomizedRunner.java:1763)
at com.carrotsearch.randomizedtesting.RandomizedRunner$6.evaluate(RandomizedRunner.java:886)
at com.carrotsearch.randomizedtesting.RandomizedRunner$7.evaluate(RandomizedRunner.java:902)
at com.carrotsearch.randomizedtesting.rules.StatementAdapter.evaluate(StatementAdapter.java:36)
at com.carrotsearch.randomizedtesting.rules.StatementAdapter.evaluate(StatementAdapter.java:36)
at org.apache.lucene.tests.util.AbstractBeforeAfterRule$1.evaluate(AbstractBeforeAfterRule.java:43)
at com.carrotsearch.randomizedtesting.rules.SystemPropertiesRestoreRule$1.evaluate(SystemPropertiesRestoreRule.java:80)
at org.junit.rules.RunRules.evaluate(RunRules.java:20)
at org.apache.lucene.tests.util.AbstractBeforeAfterRule$1.evaluate(AbstractBeforeAfterRule.java:43)
at com.carrotsearch.randomizedtesting.rules.StatementAdapter.evaluate(StatementAdapter.java:36)
at org.apache.lucene.tests.util.TestRuleStoreClassName$1.evaluate(TestRuleStoreClassName.java:38)
at com.carrotsearch.randomizedtesting.rules.NoShadowingOrOverridesOnMethodsRule$1.evaluate(NoShadowingOrOverridesOnMethodsRule.java:40)
at com.carrotsearch.randomizedtesting.rules.NoShadowingOrOverridesOnMethodsRule$1.evaluate(NoShadowingOrOverridesOnMethodsRule.java:40)
at com.carrotsearch.randomizedtesting.rules.StatementAdapter.evaluate(StatementAdapter.java:36)
at com.carrotsearch.randomizedtesting.rules.StatementAdapter.evaluate(StatementAdapter.java:36)
at org.apache.lucene.tests.util.TestRuleAssertionsRequired$1.evaluate(TestRuleAssertionsRequired.java:53)
at org.apache.lucene.tests.util.AbstractBeforeAfterRule$1.evaluate(AbstractBeforeAfterRule.java:43)
at org.apache.lucene.tests.util.TestRuleMarkFailure$1.evaluate(TestRuleMarkFailure.java:44)
at org.apache.lucene.tests.util.TestRuleIgnoreAfterMaxFailures$1.evaluate(TestRuleIgnoreAfterMaxFailures.java:60)
at org.apache.lucene.tests.util.TestRuleIgnoreTestSuites$1.evaluate(TestRuleIgnoreTestSuites.java:47)
at org.junit.rules.RunRules.evaluate(RunRules.java:20)
at com.carrotsearch.randomizedtesting.rules.StatementAdapter.evaluate(StatementAdapter.java:36)
at com.carrotsearch.randomizedtesting.ThreadLeakControl$StatementRunner.run(ThreadLeakControl.java:390)
at com.carrotsearch.randomizedtesting.ThreadLeakControl.lambda$forkTimeoutingTask$0(ThreadLeakControl.java:850)
... 1 more
expected null, but was:<ObjectTracker found 1 object(s) that were not released!!! [MockDirectoryWrapper]
org.apache.lucene.tests.store.MockDirectoryWrapper:org.apache.solr.common.util.ObjectReleaseTracker$ObjectTrackerException: org.apache.lucene.tests.store.MockDirectoryWrapper@41095762
at org.apache.solr.common.util.ObjectReleaseTracker.track(ObjectReleaseTracker.java:57)
at org.apache.solr.core.CachingDirectoryFactory.get(CachingDirectoryFactory.java:405)
at org.apache.solr.update.SolrIndexWriter.create(SolrIndexWriter.java:115)
at org.apache.solr.core.SolrCore.initIndex(SolrCore.java:911)
at org.apache.solr.core.SolrCore.<init>(SolrCore.java:1133)
at org.apache.solr.core.SolrCore.<init>(SolrCore.java:1061)
at org.apache.solr.core.CoreContainer.createFromDescriptor(CoreContainer.java:1676)
at org.apache.solr.core.CoreContainer.lambda$loadInternal$6(CoreContainer.java:995)
at org.apache.solr.util.stats.OtelInstrumentedExecutorService$InstrumentedRunnable.run(OtelInstrumentedExecutorService.java:256)
at org.apache.solr.common.util.ExecutorUtil$MDCAwareThreadPoolExecutor.lambda$execute$0(ExecutorUtil.java:381)
at java.base/java.util.concurrent.ThreadPoolExecutor.runWorker(ThreadPoolExecutor.java:1144)
at java.base/java.util.concurrent.ThreadPoolExecutor$Worker.run(ThreadPoolExecutor.java:642)
at java.base/java.lang.Thread.run(Thread.java:1575)
Caused by: java.lang.Exception: Submitter stack trace
at org.apache.solr.common.util.ExecutorUtil$MDCAwareThreadPoolExecutor.execute(ExecutorUtil.java:348)
at org.apache.solr.util.stats.OtelInstrumentedExecutorService.execute(OtelInstrumentedExecutorService.java:156)
at org.apache.solr.core.CoreContainer.loadInternal(CoreContainer.java:984)
at org.apache.solr.core.CoreContainer.load(CoreContainer.java:753)
at org.apache.solr.util.TestHarness.<init>(TestHarness.java:171)
at org.apache.solr.util.TestHarness.<init>(TestHarness.java:139)
at org.apache.solr.util.TestHarness.<init>(TestHarness.java:147)
at org.apache.solr.util.TestHarness.<init>(TestHarness.java:91)
at org.apache.solr.SolrTestCaseJ4.createCore(SolrTestCaseJ4.java:705)
at org.apache.solr.SolrTestCaseJ4.initCore(SolrTestCaseJ4.java:695)
at org.apache.solr.SolrTestCaseJ4.initCore(SolrTestCaseJ4.java:558)
at org.apache.solr.SolrTestCaseJ4.initCore(SolrTestCaseJ4.java:545)
at org.apache.solr.update.SolrIndexFingerprintTest.beforeTests(SolrIndexFingerprintTest.java:32)
at java.base/jdk.internal.reflect.DirectMethodHandleAccessor.invoke(DirectMethodHandleAccessor.java:103)
at java.base/java.lang.reflect.Method.invoke(Method.java:580)
at com.carrotsearch.randomizedtesting.RandomizedRunner.invoke(RandomizedRunner.java:1763)
at com.carrotsearch.randomizedtesting.RandomizedRunner$6.evaluate(RandomizedRunner.java:886)
at com.carrotsearch.randomizedtesting.RandomizedRunner$7.evaluate(RandomizedRunner.java:902)
at com.carrotsearch.randomizedtesting.rules.StatementAdapter.evaluate(StatementAdapter.java:36)
at com.carrotsearch.randomizedtesting.rules.StatementAdapter.evaluate(StatementAdapter.java:36)
at org.apache.lucene.tests.util.AbstractBeforeAfterRule$1.evaluate(AbstractBeforeAfterRule.java:43)
at com.carrotsearch.randomizedtesting.rules.SystemPropertiesRestoreRule$1.evaluate(SystemPropertiesRestoreRule.java:80)
at org.junit.rules.RunRules.evaluate(RunRules.java:20)
at org.apache.lucene.tests.util.AbstractBeforeAfterRule$1.evaluate(AbstractBeforeAfterRule.java:43)
at com.carrotsearch.randomizedtesting.rules.StatementAdapter.evaluate(StatementAdapter.java:36)
at org.apache.lucene.tests.util.TestRuleStoreClassName$1.evaluate(TestRuleStoreClassName.java:38)
at com.carrotsearch.randomizedtesting.rules.NoShadowingOrOverridesOnMethodsRule$1.evaluate(NoShadowingOrOverridesOnMethodsRule.java:40)
at com.carrotsearch.randomizedtesting.rules.NoShadowingOrOverridesOnMethodsRule$1.evaluate(NoShadowingOrOverridesOnMethodsRule.java:40)
at com.carrotsearch.randomizedtesting.rules.StatementAdapter.evaluate(StatementAdapter.java:36)
at com.carrotsearch.randomizedtesting.rules.StatementAdapter.evaluate(StatementAdapter.java:36)
at org.apache.lucene.tests.util.TestRuleAssertionsRequired$1.evaluate(TestRuleAssertionsRequired.java:53)
at org.apache.lucene.tests.util.AbstractBeforeAfterRule$1.evaluate(AbstractBeforeAfterRule.java:43)
at org.apache.lucene.tests.util.TestRuleMarkFailure$1.evaluate(TestRuleMarkFailure.java:44)
at org.apache.lucene.tests.util.TestRuleIgnoreAfterMaxFailures$1.evaluate(TestRuleIgnoreAfterMaxFailures.java:60)
at org.apache.lucene.tests.util.TestRuleIgnoreTestSuites$1.evaluate(TestRuleIgnoreTestSuites.java:47)
at org.junit.rules.RunRules.evaluate(RunRules.java:20)
at com.carrotsearch.randomizedtesting.rules.StatementAdapter.evaluate(StatementAdapter.java:36)
at com.carrotsearch.randomizedtesting.ThreadLeakControl$StatementRunner.run(ThreadLeakControl.java:390)
at com.carrotsearch.randomizedtesting.ThreadLeakControl.lambda$forkTimeoutingTask$0(ThreadLeakControl.java:850)
... 1 more
>
Stack Trace:
java.lang.AssertionError: ObjectTracker found 1 object(s) that were not released!!! [MockDirectoryWrapper]
org.apache.lucene.tests.store.MockDirectoryWrapper:org.apache.solr.common.util.ObjectReleaseTracker$ObjectTrackerException: org.apache.lucene.tests.store.MockDirectoryWrapper@41095762
at org.apache.solr.common.util.ObjectReleaseTracker.track(ObjectReleaseTracker.java:57)
at org.apache.solr.core.CachingDirectoryFactory.get(CachingDirectoryFactory.java:405)
at org.apache.solr.update.SolrIndexWriter.create(SolrIndexWriter.java:115)
at org.apache.solr.core.SolrCore.initIndex(SolrCore.java:911)
at org.apache.solr.core.SolrCore.<init>(SolrCore.java:1133)
at org.apache.solr.core.SolrCore.<init>(SolrCore.java:1061)
at org.apache.solr.core.CoreContainer.createFromDescriptor(CoreContainer.java:1676)
at org.apache.solr.core.CoreContainer.lambda$loadInternal$6(CoreContainer.java:995)
at org.apache.solr.util.stats.OtelInstrumentedExecutorService$InstrumentedRunnable.run(OtelInstrumentedExecutorService.java:256)
at org.apache.solr.common.util.ExecutorUtil$MDCAwareThreadPoolExecutor.lambda$execute$0(ExecutorUtil.java:381)
at java.base/java.util.concurrent.ThreadPoolExecutor.runWorker(ThreadPoolExecutor.java:1144)
at java.base/java.util.concurrent.ThreadPoolExecutor$Worker.run(ThreadPoolExecutor.java:642)
at java.base/java.lang.Thread.run(Thread.java:1575)
Caused by: java.lang.Exception: Submitter stack trace
at org.apache.solr.common.util.ExecutorUtil$MDCAwareThreadPoolExecutor.execute(ExecutorUtil.java:348)
at org.apache.solr.util.stats.OtelInstrumentedExecutorService.execute(OtelInstrumentedExecutorService.java:156)
at org.apache.solr.core.CoreContainer.loadInternal(CoreContainer.java:984)
at org.apache.solr.core.CoreContainer.load(CoreContainer.java:753)
at org.apache.solr.util.TestHarness.<init>(TestHarness.java:171)
at org.apache.solr.util.TestHarness.<init>(TestHarness.java:139)
at org.apache.solr.util.TestHarness.<init>(TestHarness.java:147)
at org.apache.solr.util.TestHarness.<init>(TestHarness.java:91)
at org.apache.solr.SolrTestCaseJ4.createCore(SolrTestCaseJ4.java:705)
at org.apache.solr.SolrTestCaseJ4.initCore(SolrTestCaseJ4.java:695)
at org.apache.solr.SolrTestCaseJ4.initCore(SolrTestCaseJ4.java:558)
at org.apache.solr.SolrTestCaseJ4.initCore(SolrTestCaseJ4.java:545)
at org.apache.solr.update.SolrIndexFingerprintTest.beforeTests(SolrIndexFingerprintTest.java:32)
at java.base/jdk.internal.reflect.DirectMethodHandleAccessor.invoke(DirectMethodHandleAccessor.java:103)
at java.base/java.lang.reflect.Method.invoke(Method.java:580)
at com.carrotsearch.randomizedtesting.RandomizedRunner.invoke(RandomizedRunner.java:1763)
at com.carrotsearch.randomizedtesting.RandomizedRunner$6.evaluate(RandomizedRunner.java:886)
at com.carrotsearch.randomizedtesting.RandomizedRunner$7.evaluate(RandomizedRunner.java:902)
at com.carrotsearch.randomizedtesting.rules.StatementAdapter.evaluate(StatementAdapter.java:36)
at com.carrotsearch.randomizedtesting.rules.StatementAdapter.evaluate(StatementAdapter.java:36)
at org.apache.lucene.tests.util.AbstractBeforeAfterRule$1.evaluate(AbstractBeforeAfterRule.java:43)
at com.carrotsearch.randomizedtesting.rules.SystemPropertiesRestoreRule$1.evaluate(SystemPropertiesRestoreRule.java:80)
at org.junit.rules.RunRules.evaluate(RunRules.java:20)
at org.apache.lucene.tests.util.AbstractBeforeAfterRule$1.evaluate(AbstractBeforeAfterRule.java:43)
at com.carrotsearch.randomizedtesting.rules.StatementAdapter.evaluate(StatementAdapter.java:36)
at org.apache.lucene.tests.util.TestRuleStoreClassName$1.evaluate(TestRuleStoreClassName.java:38)
at com.carrotsearch.randomizedtesting.rules.NoShadowingOrOverridesOnMethodsRule$1.evaluate(NoShadowingOrOverridesOnMethodsRule.java:40)
at com.carrotsearch.randomizedtesting.rules.NoShadowingOrOverridesOnMethodsRule$1.evaluate(NoShadowingOrOverridesOnMethodsRule.java:40)
at com.carrotsearch.randomizedtesting.rules.StatementAdapter.evaluate(StatementAdapter.java:36)
at com.carrotsearch.randomizedtesting.rules.StatementAdapter.evaluate(StatementAdapter.java:36)
at org.apache.lucene.tests.util.TestRuleAssertionsRequired$1.evaluate(TestRuleAssertionsRequired.java:53)
at org.apache.lucene.tests.util.AbstractBeforeAfterRule$1.evaluate(AbstractBeforeAfterRule.java:43)
at org.apache.lucene.tests.util.TestRuleMarkFailure$1.evaluate(TestRuleMarkFailure.java:44)
at org.apache.lucene.tests.util.TestRuleIgnoreAfterMaxFailures$1.evaluate(TestRuleIgnoreAfterMaxFailures.java:60)
at org.apache.lucene.tests.util.TestRuleIgnoreTestSuites$1.evaluate(TestRuleIgnoreTestSuites.java:47)
at org.junit.rules.RunRules.evaluate(RunRules.java:20)
at com.carrotsearch.randomizedtesting.rules.StatementAdapter.evaluate(StatementAdapter.java:36)
at com.carrotsearch.randomizedtesting.ThreadLeakControl$StatementRunner.run(ThreadLeakControl.java:390)
at com.carrotsearch.randomizedtesting.ThreadLeakControl.lambda$forkTimeoutingTask$0(ThreadLeakControl.java:850)
... 1 more
expected null, but was:<ObjectTracker found 1 object(s) that were not released!!! [MockDirectoryWrapper]
org.apache.lucene.tests.store.MockDirectoryWrapper:org.apache.solr.common.util.ObjectReleaseTracker$ObjectTrackerException: org.apache.lucene.tests.store.MockDirectoryWrapper@41095762
at org.apache.solr.common.util.ObjectReleaseTracker.track(ObjectReleaseTracker.java:57)
at org.apache.solr.core.CachingDirectoryFactory.get(CachingDirectoryFactory.java:405)
at org.apache.solr.update.SolrIndexWriter.create(SolrIndexWriter.java:115)
at org.apache.solr.core.SolrCore.initIndex(SolrCore.java:911)
at org.apache.solr.core.SolrCore.<init>(SolrCore.java:1133)
at org.apache.solr.core.SolrCore.<init>(SolrCore.java:1061)
at org.apache.solr.core.CoreContainer.createFromDescriptor(CoreContainer.java:1676)
at org.apache.solr.core.CoreContainer.lambda$loadInternal$6(CoreContainer.java:995)
at org.apache.solr.util.stats.OtelInstrumentedExecutorService$InstrumentedRunnable.run(OtelInstrumentedExecutorService.java:256)
at org.apache.solr.common.util.ExecutorUtil$MDCAwareThreadPoolExecutor.lambda$execute$0(ExecutorUtil.java:381)
at java.base/java.util.concurrent.ThreadPoolExecutor.runWorker(ThreadPoolExecutor.java:1144)
at java.base/java.util.concurrent.ThreadPoolExecutor$Worker.run(ThreadPoolExecutor.java:642)
at java.base/java.lang.Thread.run(Thread.java:1575)
Caused by: java.lang.Exception: Submitter stack trace
at org.apache.solr.common.util.ExecutorUtil$MDCAwareThreadPoolExecutor.execute(ExecutorUtil.java:348)
at org.apache.solr.util.stats.OtelInstrumentedExecutorService.execute(OtelInstrumentedExecutorService.java:156)
at org.apache.solr.core.CoreContainer.loadInternal(CoreContainer.java:984)
at org.apache.solr.core.CoreContainer.load(CoreContainer.java:753)
at org.apache.solr.util.TestHarness.<init>(TestHarness.java:171)
at org.apache.solr.util.TestHarness.<init>(TestHarness.java:139)
at org.apache.solr.util.TestHarness.<init>(TestHarness.java:147)
at org.apache.solr.util.TestHarness.<init>(TestHarness.java:91)
at org.apache.solr.SolrTestCaseJ4.createCore(SolrTestCaseJ4.java:705)
at org.apache.solr.SolrTestCaseJ4.initCore(SolrTestCaseJ4.java:695)
at org.apache.solr.SolrTestCaseJ4.initCore(SolrTestCaseJ4.java:558)
at org.apache.solr.SolrTestCaseJ4.initCore(SolrTestCaseJ4.java:545)
at org.apache.solr.update.SolrIndexFingerprintTest.beforeTests(SolrIndexFingerprintTest.java:32)
at java.base/jdk.internal.reflect.DirectMethodHandleAccessor.invoke(DirectMethodHandleAccessor.java:103)
at java.base/java.lang.reflect.Method.invoke(Method.java:580)
at com.carrotsearch.randomizedtesting.RandomizedRunner.invoke(RandomizedRunner.java:1763)
at com.carrotsearch.randomizedtesting.RandomizedRunner$6.evaluate(RandomizedRunner.java:886)
at com.carrotsearch.randomizedtesting.RandomizedRunner$7.evaluate(RandomizedRunner.java:902)
at com.carrotsearch.randomizedtesting.rules.StatementAdapter.evaluate(StatementAdapter.java:36)
at com.carrotsearch.randomizedtesting.rules.StatementAdapter.evaluate(StatementAdapter.java:36)
at org.apache.lucene.tests.util.AbstractBeforeAfterRule$1.evaluate(AbstractBeforeAfterRule.java:43)
at com.carrotsearch.randomizedtesting.rules.SystemPropertiesRestoreRule$1.evaluate(SystemPropertiesRestoreRule.java:80)
at org.junit.rules.RunRules.evaluate(RunRules.java:20)
at org.apache.lucene.tests.util.AbstractBeforeAfterRule$1.evaluate(AbstractBeforeAfterRule.java:43)
at com.carrotsearch.randomizedtesting.rules.StatementAdapter.evaluate(StatementAdapter.java:36)
at org.apache.lucene.tests.util.TestRuleStoreClassName$1.evaluate(TestRuleStoreClassName.java:38)
at com.carrotsearch.randomizedtesting.rules.NoShadowingOrOverridesOnMethodsRule$1.evaluate(NoShadowingOrOverridesOnMethodsRule.java:40)
at com.carrotsearch.randomizedtesting.rules.NoShadowingOrOverridesOnMethodsRule$1.evaluate(NoShadowingOrOverridesOnMethodsRule.java:40)
at com.carrotsearch.randomizedtesting.rules.StatementAdapter.evaluate(StatementAdapter.java:36)
at com.carrotsearch.randomizedtesting.rules.StatementAdapter.evaluate(StatementAdapter.java:36)
at org.apache.lucene.tests.util.TestRuleAssertionsRequired$1.evaluate(TestRuleAssertionsRequired.java:53)
at org.apache.lucene.tests.util.AbstractBeforeAfterRule$1.evaluate(AbstractBeforeAfterRule.java:43)
at org.apache.lucene.tests.util.TestRuleMarkFailure$1.evaluate(TestRuleMarkFailure.java:44)
at org.apache.lucene.tests.util.TestRuleIgnoreAfterMaxFailures$1.evaluate(TestRuleIgnoreAfterMaxFailures.java:60)
at org.apache.lucene.tests.util.TestRuleIgnoreTestSuites$1.evaluate(TestRuleIgnoreTestSuites.java:47)
at org.junit.rules.RunRules.evaluate(RunRules.java:20)
at com.carrotsearch.randomizedtesting.rules.StatementAdapter.evaluate(StatementAdapter.java:36)
at com.carrotsearch.randomizedtesting.ThreadLeakControl$StatementRunner.run(ThreadLeakControl.java:390)
at com.carrotsearch.randomizedtesting.ThreadLeakControl.lambda$forkTimeoutingTask$0(ThreadLeakControl.java:850)
... 1 more
>
at __randomizedtesting.SeedInfo.seed([F0D8AD91BBBB4B57]:0)
at org.junit.Assert.fail(Assert.java:89)
at org.junit.Assert.failNotNull(Assert.java:756)
at org.junit.Assert.assertNull(Assert.java:738)
at org.apache.solr.SolrTestCase$1.afterIfSuccessful(SolrTestCase.java:100)
at com.carrotsearch.randomizedtesting.rules.TestRuleAdapter$1.afterIfSuccessful(TestRuleAdapter.java:36)
at com.carrotsearch.randomizedtesting.rules.StatementAdapter.evaluate(StatementAdapter.java:37)
at com.carrotsearch.randomizedtesting.rules.StatementAdapter.evaluate(StatementAdapter.java:36)
at org.apache.lucene.tests.util.AbstractBeforeAfterRule$1.evaluate(AbstractBeforeAfterRule.java:43)
at com.carrotsearch.randomizedtesting.rules.SystemPropertiesRestoreRule$1.evaluate(SystemPropertiesRestoreRule.java:80)
at org.junit.rules.RunRules.evaluate(RunRules.java:20)
at org.apache.lucene.tests.util.AbstractBeforeAfterRule$1.evaluate(AbstractBeforeAfterRule.java:43)
at com.carrotsearch.randomizedtesting.rules.StatementAdapter.evaluate(StatementAdapter.java:36)
at org.apache.lucene.tests.util.TestRuleStoreClassName$1.evaluate(TestRuleStoreClassName.java:38)
at com.carrotsearch.randomizedtesting.rules.NoShadowingOrOverridesOnMethodsRule$1.evaluate(NoShadowingOrOverridesOnMethodsRule.java:40)
at com.carrotsearch.randomizedtesting.rules.NoShadowingOrOverridesOnMethodsRule$1.evaluate(NoShadowingOrOverridesOnMethodsRule.java:40)
at com.carrotsearch.randomizedtesting.rules.StatementAdapter.evaluate(StatementAdapter.java:36)
at com.carrotsearch.randomizedtesting.rules.StatementAdapter.evaluate(StatementAdapter.java:36)
at org.apache.lucene.tests.util.TestRuleAssertionsRequired$1.evaluate(TestRuleAssertionsRequired.java:53)
at org.apache.lucene.tests.util.AbstractBeforeAfterRule$1.evaluate(AbstractBeforeAfterRule.java:43)
at org.apache.lucene.tests.util.TestRuleMarkFailure$1.evaluate(TestRuleMarkFailure.java:44)
at org.apache.lucene.tests.util.TestRuleIgnoreAfterMaxFailures$1.evaluate(TestRuleIgnoreAfterMaxFailures.java:60)
at org.apache.lucene.tests.util.TestRuleIgnoreTestSuites$1.evaluate(TestRuleIgnoreTestSuites.java:47)
at org.junit.rules.RunRules.evaluate(RunRules.java:20)
at com.carrotsearch.randomizedtesting.rules.StatementAdapter.evaluate(StatementAdapter.java:36)
at com.carrotsearch.randomizedtesting.ThreadLeakControl$StatementRunner.run(ThreadLeakControl.java:390)
at com.carrotsearch.randomizedtesting.ThreadLeakControl.lambda$forkTimeoutingTask$0(ThreadLeakControl.java:850)
at java.base/java.lang.Thread.run(Thread.java:1575)
FAILED: org.apache.solr.update.SolrIndexFingerprintTest.classMethod
Error Message:
java.lang.OutOfMemoryError: Java heap space
Stack Trace:
java.lang.OutOfMemoryError: Java heap space
at java.base/java.util.Arrays.copyOf(Arrays.java:3540)
at java.base/java.lang.AbstractStringBuilder.ensureCapacityInternal(AbstractStringBuilder.java:245)
at java.base/java.lang.AbstractStringBuilder.append(AbstractStringBuilder.java:590)
at java.base/java.lang.StringBuffer.append(StringBuffer.java:313)
at java.base/java.io.StringWriter.write(StringWriter.java:106)
at java.base/java.io.PrintWriter.implNewLine(PrintWriter.java:657)
at java.base/java.io.PrintWriter.newLine(PrintWriter.java:649)
at java.base/java.io.PrintWriter.println(PrintWriter.java:808)
at java.base/java.io.PrintWriter.println(PrintWriter.java:1034)
at java.base/java.lang.Throwable$WrappedPrintWriter.println(Throwable.java:829)
at java.base/java.lang.Throwable.lockedPrintStackTrace(Throwable.java:712)
at java.base/java.lang.Throwable.printStackTrace(Throwable.java:701)
at java.base/java.lang.Throwable.printStackTrace(Throwable.java:777)
at org.apache.solr.common.util.ObjectReleaseTracker.checkEmpty(ObjectReleaseTracker.java:103)
at org.apache.solr.common.util.ObjectReleaseTracker.clearObjectTrackerAndCheckEmpty(ObjectReleaseTracker.java:150)
at org.apache.solr.SolrTestCase$1.afterIfSuccessful(SolrTestCase.java:99)
at com.carrotsearch.randomizedtesting.rules.TestRuleAdapter$1.afterIfSuccessful(TestRuleAdapter.java:36)
at com.carrotsearch.randomizedtesting.rules.StatementAdapter.evaluate(StatementAdapter.java:37)
at com.carrotsearch.randomizedtesting.rules.StatementAdapter.evaluate(StatementAdapter.java:36)
at org.apache.lucene.tests.util.AbstractBeforeAfterRule$1.evaluate(AbstractBeforeAfterRule.java:43)
at com.carrotsearch.randomizedtesting.rules.SystemPropertiesRestoreRule$1.evaluate(SystemPropertiesRestoreRule.java:80)
at org.junit.rules.RunRules.evaluate(RunRules.java:20)
at org.apache.lucene.tests.util.AbstractBeforeAfterRule$1.evaluate(AbstractBeforeAfterRule.java:43)
at com.carrotsearch.randomizedtesting.rules.StatementAdapter.evaluate(StatementAdapter.java:36)
at org.apache.lucene.tests.util.TestRuleStoreClassName$1.evaluate(TestRuleStoreClassName.java:38)
at com.carrotsearch.randomizedtesting.rules.NoShadowingOrOverridesOnMethodsRule$1.evaluate(NoShadowingOrOverridesOnMethodsRule.java:40)
at com.carrotsearch.randomizedtesting.rules.NoShadowingOrOverridesOnMethodsRule$1.evaluate(NoShadowingOrOverridesOnMethodsRule.java:40)
at com.carrotsearch.randomizedtesting.rules.StatementAdapter.evaluate(StatementAdapter.java:36)
at com.carrotsearch.randomizedtesting.rules.StatementAdapter.evaluate(StatementAdapter.java:36)
at org.apache.lucene.tests.util.TestRuleAssertionsRequired$1.evaluate(TestRuleAssertionsRequired.java:53)
at org.apache.lucene.tests.util.AbstractBeforeAfterRule$1.evaluate(AbstractBeforeAfterRule.java:43)
at org.apache.lucene.tests.util.TestRuleMarkFailure$1.evaluate(TestRuleMarkFailure.java:44)
FAILED: org.apache.solr.update.SolrIndexFingerprintTest.classMethod
Error Message:
java.lang.AssertionError: 1
Stack Trace:
java.lang.AssertionError: 1
at __randomizedtesting.SeedInfo.seed([F0D8AD91BBBB4B57]:0)
at org.apache.solr.core.CachingDirectoryFactory.close(CachingDirectoryFactory.java:199)
at org.apache.solr.core.SolrCore.doClose(SolrCore.java:1909)
at org.apache.solr.core.SolrCore.close(SolrCore.java:1771)
at org.apache.solr.core.SolrCores.lambda$close$0(SolrCores.java:119)
at org.apache.solr.common.util.ExecutorUtil$MDCAwareThreadPoolExecutor.lambda$execute$0(ExecutorUtil.java:381)
at java.base/java.util.concurrent.ThreadPoolExecutor.runWorker(ThreadPoolExecutor.java:1144)
at java.base/java.util.concurrent.ThreadPoolExecutor$Worker.run(ThreadPoolExecutor.java:642)
at java.base/java.lang.Thread.run(Thread.java:1575)
FAILED: org.apache.solr.update.SolrIndexFingerprintTest.classMethod
Error Message:
com.carrotsearch.randomizedtesting.UncaughtExceptionError: Captured an uncaught exception in thread: Thread[id=69, name=IndexFingerprintPool-5-thread-10, state=RUNNABLE, group=TGRP-SolrIndexFingerprintTest]
Stack Trace:
com.carrotsearch.randomizedtesting.UncaughtExceptionError: Captured an uncaught exception in thread: Thread[id=69, name=IndexFingerprintPool-5-thread-10, state=RUNNABLE, group=TGRP-SolrIndexFingerprintTest]
Caused by: java.lang.OutOfMemoryError: Java heap space
at __randomizedtesting.SeedInfo.seed([F0D8AD91BBBB4B57]:0)
at java.base/java.lang.ThreadLocal.createMap(ThreadLocal.java:317)
at java.base/java.lang.ThreadLocal.set(ThreadLocal.java:267)
at java.base/java.lang.ThreadLocal.set(ThreadLocal.java:251)
at org.apache.solr.common.util.ExecutorUtil$MDCAwareThreadPoolExecutor.lambda$execute$0(ExecutorUtil.java:364)
at org.apache.solr.common.util.ExecutorUtil$MDCAwareThreadPoolExecutor$$Lambda/0x000078422b5259e8.run(Unknown Source)
at java.base/java.util.concurrent.ThreadPoolExecutor.runWorker(ThreadPoolExecutor.java:1144)
at java.base/java.util.concurrent.ThreadPoolExecutor$Worker.run(ThreadPoolExecutor.java:642)
at java.base/java.lang.Thread.runWith(Thread.java:1588)
at java.base/java.lang.Thread.run(Thread.java:1575)
FAILED: org.apache.solr.update.SolrIndexFingerprintTest.testSequentialVsParallelFingerprint
Error Message:
java.lang.OutOfMemoryError: Java heap space
Stack Trace:
java.lang.OutOfMemoryError: Java heap space
at __randomizedtesting.SeedInfo.seed([F0D8AD91BBBB4B57:90AD8E15ED09B94A]:0)
at java.base/jdk.internal.misc.Unsafe.allocateUninitializedArray(Unsafe.java:1381)
at java.base/java.lang.StringConcatHelper.newArray(StringConcatHelper.java:451)
at java.base/java.lang.invoke.DirectMethodHandle$Holder.invokeStatic(DirectMethodHandle$Holder)
at java.base/java.lang.invoke.LambdaForm$MH/0x000078de4332b800.invoke(LambdaForm$MH)
at java.base/java.lang.invoke.Invokers$Holder.linkToTargetMethod(Invokers$Holder)
at org.apache.lucene.util.FileDeleter.incRef(FileDeleter.java:86)
at org.apache.lucene.index.IndexFileDeleter.incRef(IndexFileDeleter.java:616)
at org.apache.lucene.index.IndexFileDeleter.checkpoint(IndexFileDeleter.java:571)
at org.apache.lucene.index.IndexWriter.finishCommit(IndexWriter.java:4214)
at org.apache.lucene.index.IndexWriter.commitInternal(IndexWriter.java:4168)
at org.apache.lucene.index.IndexWriter.commit(IndexWriter.java:4122)
at org.apache.solr.update.DirectUpdateHandler2.commit(DirectUpdateHandler2.java:871)
at org.apache.solr.update.processor.RunUpdateProcessorFactory$RunUpdateProcessor.processCommit(RunUpdateProcessorFactory.java:100)
at org.apache.solr.update.processor.UpdateRequestProcessor.processCommit(UpdateRequestProcessor.java:66)
at org.apache.solr.update.processor.UpdateRequestProcessor.processCommit(UpdateRequestProcessor.java:66)
at org.apache.solr.update.processor.DistributedUpdateProcessor.doLocalCommit(DistributedUpdateProcessor.java:1174)
at org.apache.solr.update.processor.DistributedUpdateProcessor.processCommit(DistributedUpdateProcessor.java:1160)
at org.apache.solr.update.processor.LogUpdateProcessorFactory$LogUpdateProcessor.processCommit(LogUpdateProcessorFactory.java:173)
at org.apache.solr.handler.loader.XMLLoader.processUpdate(XMLLoader.java:214)
at org.apache.solr.handler.loader.XMLLoader.load(XMLLoader.java:120)
at org.apache.solr.handler.UpdateRequestHandler$1.load(UpdateRequestHandler.java:101)
at org.apache.solr.handler.ContentStreamHandlerBase.handleRequestBody(ContentStreamHandlerBase.java:99)
at org.apache.solr.handler.RequestHandlerBase.handleRequest(RequestHandlerBase.java:251)
at org.apache.solr.core.SolrCore.execute(SolrCore.java:2921)
at org.apache.solr.client.solrj.embedded.EmbeddedSolrServer.request(EmbeddedSolrServer.java:227)
at org.apache.solr.client.solrj.SolrClient.request(SolrClient.java:1195)
at org.apache.solr.util.TestHarness.update(TestHarness.java:272)
at org.apache.solr.util.BaseTestHarness.checkUpdateStatus(BaseTestHarness.java:270)
at org.apache.solr.util.BaseTestHarness.validateUpdate(BaseTestHarness.java:238)
at org.apache.solr.SolrTestCaseJ4.checkUpdateU(SolrTestCaseJ4.java:840)
at org.apache.solr.SolrTestCaseJ4.assertU(SolrTestCaseJ4.java:822)
at org.apache.solr.SolrTestCaseJ4.assertU(SolrTestCaseJ4.java:817)
FAILED: org.apache.solr.update.SolrIndexFingerprintTest.testSequentialVsParallelFingerprint
Error Message:
java.lang.OutOfMemoryError: Java heap space
Stack Trace:
java.lang.OutOfMemoryError: Java heap space
at __randomizedtesting.SeedInfo.seed([F0D8AD91BBBB4B57:90AD8E15ED09B94A]:0)
at java.base/java.util.HashMap.resize(HashMap.java:711)
at java.base/java.util.HashMap.putVal(HashMap.java:670)
at java.base/java.util.HashMap.put(HashMap.java:619)
at java.base/java.util.HashSet.add(HashSet.java:230)
at org.apache.lucene.index.ReaderPool.noDups(ReaderPool.java:450)
at org.apache.lucene.index.ReaderPool.get(ReaderPool.java:427)
at org.apache.lucene.index.IndexWriter.writeReaderPool(IndexWriter.java:4039)
at org.apache.lucene.index.IndexWriter.getReader(IndexWriter.java:602)
at org.apache.lucene.index.StandardDirectoryReader.doOpenFromWriter(StandardDirectoryReader.java:469)
at org.apache.lucene.index.StandardDirectoryReader.doOpenIfChanged(StandardDirectoryReader.java:441)
at org.apache.lucene.index.DirectoryReader.openIfChanged(DirectoryReader.java:402)
at org.apache.solr.core.SolrCore.openNewSearcher(SolrCore.java:2362)
at org.apache.solr.core.SolrCore.getSearcher(SolrCore.java:2615)
at org.apache.solr.core.SolrCore.getSearcher(SolrCore.java:2304)
at org.apache.solr.update.DirectUpdateHandler2.commit(DirectUpdateHandler2.java:900)
at org.apache.solr.update.processor.RunUpdateProcessorFactory$RunUpdateProcessor.processCommit(RunUpdateProcessorFactory.java:100)
at org.apache.solr.update.processor.UpdateRequestProcessor.processCommit(UpdateRequestProcessor.java:66)
at org.apache.solr.update.processor.UpdateRequestProcessor.processCommit(UpdateRequestProcessor.java:66)
at org.apache.solr.update.processor.DistributedUpdateProcessor.doLocalCommit(DistributedUpdateProcessor.java:1174)
at org.apache.solr.update.processor.DistributedUpdateProcessor.processCommit(DistributedUpdateProcessor.java:1160)
at org.apache.solr.update.processor.LogUpdateProcessorFactory$LogUpdateProcessor.processCommit(LogUpdateProcessorFactory.java:173)
at org.apache.solr.handler.loader.XMLLoader.processUpdate(XMLLoader.java:214)
at org.apache.solr.handler.loader.XMLLoader.load(XMLLoader.java:120)
at org.apache.solr.handler.UpdateRequestHandler$1.load(UpdateRequestHandler.java:101)
at org.apache.solr.handler.ContentStreamHandlerBase.handleRequestBody(ContentStreamHandlerBase.java:99)
at org.apache.solr.handler.RequestHandlerBase.handleRequest(RequestHandlerBase.java:251)
at org.apache.solr.core.SolrCore.execute(SolrCore.java:2921)
at org.apache.solr.client.solrj.embedded.EmbeddedSolrServer.request(EmbeddedSolrServer.java:227)
at org.apache.solr.client.solrj.SolrClient.request(SolrClient.java:1195)
at org.apache.solr.util.TestHarness.update(TestHarness.java:272)
at org.apache.solr.util.BaseTestHarness.checkUpdateStatus(BaseTestHarness.java:270)
at org.apache.solr.util.BaseTestHarness.validateUpdate(BaseTestHarness.java:238)
FAILED: org.apache.solr.update.SolrIndexFingerprintTest.testSequentialVsParallelFingerprint
Error Message:
java.lang.Exception: Test abandoned because suite timeout was reached.
Stack Trace:
java.lang.Exception: Test abandoned because suite timeout was reached.
at __randomizedtesting.SeedInfo.seed([F0D8AD91BBBB4B57]:0)
FAILED: org.apache.solr.update.SolrIndexFingerprintTest.testSequentialVsParallelFingerprint
Error Message:
java.lang.OutOfMemoryError: Java heap space
Stack Trace:
java.lang.OutOfMemoryError: Java heap space
at __randomizedtesting.SeedInfo.seed([F0D8AD91BBBB4B57:90AD8E15ED09B94A]:0)
at org.apache.lucene.index.FieldInfo.putAttribute(FieldInfo.java:674)
at org.apache.lucene.index.FieldInfos$Builder.lambda$add$0(FieldInfos.java:777)
at org.apache.lucene.index.FieldInfos$Builder$$Lambda/0x00007467337aa000.accept(Unknown Source)
at java.base/java.util.TreeMap.forEach(TreeMap.java:1320)
at java.base/java.util.Collections$UnmodifiableMap.forEach(Collections.java:1708)
at org.apache.lucene.index.FieldInfos$Builder.add(FieldInfos.java:777)
at org.apache.lucene.index.FieldInfos$Builder.add(FieldInfos.java:747)
at org.apache.lucene.index.FieldInfos.getMergedFieldInfos(FieldInfos.java:214)
at org.apache.solr.index.SlowCompositeReaderWrapper.<init>(SlowCompositeReaderWrapper.java:120)
at org.apache.solr.index.SlowCompositeReaderWrapper.wrap(SlowCompositeReaderWrapper.java:89)
at org.apache.solr.search.SolrIndexSearcher.<init>(SolrIndexSearcher.java:399)
at org.apache.solr.core.SolrCore.openNewSearcher(SolrCore.java:2406)
at org.apache.solr.core.SolrCore.getSearcher(SolrCore.java:2615)
at org.apache.solr.core.SolrCore.getSearcher(SolrCore.java:2304)
at org.apache.solr.update.DirectUpdateHandler2.commit(DirectUpdateHandler2.java:900)
at org.apache.solr.update.processor.RunUpdateProcessorFactory$RunUpdateProcessor.processCommit(RunUpdateProcessorFactory.java:100)
at org.apache.solr.update.processor.UpdateRequestProcessor.processCommit(UpdateRequestProcessor.java:66)
at org.apache.solr.update.processor.UpdateRequestProcessor.processCommit(UpdateRequestProcessor.java:66)
at org.apache.solr.update.processor.DistributedUpdateProcessor.doLocalCommit(DistributedUpdateProcessor.java:1174)
at org.apache.solr.update.processor.DistributedUpdateProcessor.processCommit(DistributedUpdateProcessor.java:1160)
at org.apache.solr.update.processor.LogUpdateProcessorFactory$LogUpdateProcessor.processCommit(LogUpdateProcessorFactory.java:173)
at org.apache.solr.handler.loader.XMLLoader.processUpdate(XMLLoader.java:214)
at org.apache.solr.handler.loader.XMLLoader.load(XMLLoader.java:120)
at org.apache.solr.handler.UpdateRequestHandler$1.load(UpdateRequestHandler.java:101)
at org.apache.solr.handler.ContentStreamHandlerBase.handleRequestBody(ContentStreamHandlerBase.java:99)
at org.apache.solr.handler.RequestHandlerBase.handleRequest(RequestHandlerBase.java:251)
at org.apache.solr.core.SolrCore.execute(SolrCore.java:2921)
at org.apache.solr.client.solrj.embedded.EmbeddedSolrServer.request(EmbeddedSolrServer.java:227)
at org.apache.solr.client.solrj.SolrClient.request(SolrClient.java:1195)
at org.apache.solr.util.TestHarness.update(TestHarness.java:272)
at org.apache.solr.util.BaseTestHarness.checkUpdateStatus(BaseTestHarness.java:270)
at org.apache.solr.util.BaseTestHarness.validateUpdate(BaseTestHarness.java:238)
FAILED: org.apache.solr.update.TestInPlaceUpdatesDistrib.classMethod
Error Message:
com.carrotsearch.randomizedtesting.ThreadLeakError: There are still zombie threads that couldn't be terminated:
1) Thread[id=20100, name=httpShardExecutor-11794-thread-2, state=TIMED_WAITING, group=TGRP-TestInPlaceUpdatesDistrib]
at java.base/jdk.internal.misc.Unsafe.park(Native Method)
at java.base/java.util.concurrent.locks.LockSupport.parkNanos(LockSupport.java:410)
at java.base/java.util.concurrent.LinkedTransferQueue$DualNode.await(LinkedTransferQueue.java:452)
at java.base/java.util.concurrent.SynchronousQueue$Transferer.xferLifo(SynchronousQueue.java:194)
at java.base/java.util.concurrent.SynchronousQueue.xfer(SynchronousQueue.java:235)
at java.base/java.util.concurrent.SynchronousQueue.poll(SynchronousQueue.java:338)
at java.base/java.util.concurrent.ThreadPoolExecutor.getTask(ThreadPoolExecutor.java:1069)
at java.base/java.util.concurrent.ThreadPoolExecutor.runWorker(ThreadPoolExecutor.java:1130)
at java.base/java.util.concurrent.ThreadPoolExecutor$Worker.run(ThreadPoolExecutor.java:642)
at java.base/java.lang.Thread.run(Thread.java:1575)
2) Thread[id=20099, name=httpShardExecutor-11794-thread-1, state=TIMED_WAITING, group=TGRP-TestInPlaceUpdatesDistrib]
at java.base/jdk.internal.misc.Unsafe.park(Native Method)
at java.base/java.util.concurrent.locks.LockSupport.parkNanos(LockSupport.java:410)
at java.base/java.util.concurrent.LinkedTransferQueue$DualNode.await(LinkedTransferQueue.java:452)
at java.base/java.util.concurrent.SynchronousQueue$Transferer.xferLifo(SynchronousQueue.java:194)
at java.base/java.util.concurrent.SynchronousQueue.xfer(SynchronousQueue.java:235)
at java.base/java.util.concurrent.SynchronousQueue.poll(SynchronousQueue.java:338)
at java.base/java.util.concurrent.ThreadPoolExecutor.getTask(ThreadPoolExecutor.java:1069)
at java.base/java.util.concurrent.ThreadPoolExecutor.runWorker(ThreadPoolExecutor.java:1130)
at java.base/java.util.concurrent.ThreadPoolExecutor$Worker.run(ThreadPoolExecutor.java:642)
at java.base/java.lang.Thread.run(Thread.java:1575)
Stack Trace:
com.carrotsearch.randomizedtesting.ThreadLeakError: There are still zombie threads that couldn't be terminated:
1) Thread[id=20100, name=httpShardExecutor-11794-thread-2, state=TIMED_WAITING, group=TGRP-TestInPlaceUpdatesDistrib]
at java.base/jdk.internal.misc.Unsafe.park(Native Method)
at java.base/java.util.concurrent.locks.LockSupport.parkNanos(LockSupport.java:410)
at java.base/java.util.concurrent.LinkedTransferQueue$DualNode.await(LinkedTransferQueue.java:452)
at java.base/java.util.concurrent.SynchronousQueue$Transferer.xferLifo(SynchronousQueue.java:194)
at java.base/java.util.concurrent.SynchronousQueue.xfer(SynchronousQueue.java:235)
at java.base/java.util.concurrent.SynchronousQueue.poll(SynchronousQueue.java:338)
at java.base/java.util.concurrent.ThreadPoolExecutor.getTask(ThreadPoolExecutor.java:1069)
at java.base/java.util.concurrent.ThreadPoolExecutor.runWorker(ThreadPoolExecutor.java:1130)
at java.base/java.util.concurrent.ThreadPoolExecutor$Worker.run(ThreadPoolExecutor.java:642)
at java.base/java.lang.Thread.run(Thread.java:1575)
2) Thread[id=20099, name=httpShardExecutor-11794-thread-1, state=TIMED_WAITING, group=TGRP-TestInPlaceUpdatesDistrib]
at java.base/jdk.internal.misc.Unsafe.park(Native Method)
at java.base/java.util.concurrent.locks.LockSupport.parkNanos(LockSupport.java:410)
at java.base/java.util.concurrent.LinkedTransferQueue$DualNode.await(LinkedTransferQueue.java:452)
at java.base/java.util.concurrent.SynchronousQueue$Transferer.xferLifo(SynchronousQueue.java:194)
at java.base/java.util.concurrent.SynchronousQueue.xfer(SynchronousQueue.java:235)
at java.base/java.util.concurrent.SynchronousQueue.poll(SynchronousQueue.java:338)
at java.base/java.util.concurrent.ThreadPoolExecutor.getTask(ThreadPoolExecutor.java:1069)
at java.base/java.util.concurrent.ThreadPoolExecutor.runWorker(ThreadPoolExecutor.java:1130)
at java.base/java.util.concurrent.ThreadPoolExecutor$Worker.run(ThreadPoolExecutor.java:642)
at java.base/java.lang.Thread.run(Thread.java:1575)
at __randomizedtesting.SeedInfo.seed([F0D8AD91BBBB4B57]:0)
FAILED: org.apache.solr.update.TestInPlaceUpdatesDistrib.classMethod
Error Message:
java.lang.OutOfMemoryError: Java heap space
Stack Trace:
java.lang.OutOfMemoryError: Java heap space
FAILED: org.apache.solr.update.TestInPlaceUpdatesDistrib.classMethod
Error Message:
com.carrotsearch.randomizedtesting.ThreadLeakError: 2 threads leaked from SUITE scope at org.apache.solr.update.TestInPlaceUpdatesDistrib:
1) Thread[id=20100, name=httpShardExecutor-11794-thread-2, state=TIMED_WAITING, group=TGRP-TestInPlaceUpdatesDistrib]
at java.base/jdk.internal.misc.Unsafe.park(Native Method)
at java.base/java.util.concurrent.locks.LockSupport.parkNanos(LockSupport.java:410)
at java.base/java.util.concurrent.LinkedTransferQueue$DualNode.await(LinkedTransferQueue.java:452)
at java.base/java.util.concurrent.SynchronousQueue$Transferer.xferLifo(SynchronousQueue.java:194)
at java.base/java.util.concurrent.SynchronousQueue.xfer(SynchronousQueue.java:235)
at java.base/java.util.concurrent.SynchronousQueue.poll(SynchronousQueue.java:338)
at java.base/java.util.concurrent.ThreadPoolExecutor.getTask(ThreadPoolExecutor.java:1069)
at java.base/java.util.concurrent.ThreadPoolExecutor.runWorker(ThreadPoolExecutor.java:1130)
at java.base/java.util.concurrent.ThreadPoolExecutor$Worker.run(ThreadPoolExecutor.java:642)
at java.base/java.lang.Thread.run(Thread.java:1575)
2) Thread[id=20099, name=httpShardExecutor-11794-thread-1, state=TIMED_WAITING, group=TGRP-TestInPlaceUpdatesDistrib]
at java.base/jdk.internal.misc.Unsafe.park(Native Method)
at java.base/java.util.concurrent.locks.LockSupport.parkNanos(LockSupport.java:410)
at java.base/java.util.concurrent.LinkedTransferQueue$DualNode.await(LinkedTransferQueue.java:452)
at java.base/java.util.concurrent.SynchronousQueue$Transferer.xferLifo(SynchronousQueue.java:194)
at java.base/java.util.concurrent.SynchronousQueue.xfer(SynchronousQueue.java:235)
at java.base/java.util.concurrent.SynchronousQueue.poll(SynchronousQueue.java:338)
at java.base/java.util.concurrent.ThreadPoolExecutor.getTask(ThreadPoolExecutor.java:1069)
at java.base/java.util.concurrent.ThreadPoolExecutor.runWorker(ThreadPoolExecutor.java:1130)
at java.base/java.util.concurrent.ThreadPoolExecutor$Worker.run(ThreadPoolExecutor.java:642)
at java.base/java.lang.Thread.run(Thread.java:1575)
Stack Trace:
com.carrotsearch.randomizedtesting.ThreadLeakError: 2 threads leaked from SUITE scope at org.apache.solr.update.TestInPlaceUpdatesDistrib:
1) Thread[id=20100, name=httpShardExecutor-11794-thread-2, state=TIMED_WAITING, group=TGRP-TestInPlaceUpdatesDistrib]
at java.base/jdk.internal.misc.Unsafe.park(Native Method)
at java.base/java.util.concurrent.locks.LockSupport.parkNanos(LockSupport.java:410)
at java.base/java.util.concurrent.LinkedTransferQueue$DualNode.await(LinkedTransferQueue.java:452)
at java.base/java.util.concurrent.SynchronousQueue$Transferer.xferLifo(SynchronousQueue.java:194)
at java.base/java.util.concurrent.SynchronousQueue.xfer(SynchronousQueue.java:235)
at java.base/java.util.concurrent.SynchronousQueue.poll(SynchronousQueue.java:338)
at java.base/java.util.concurrent.ThreadPoolExecutor.getTask(ThreadPoolExecutor.java:1069)
at java.base/java.util.concurrent.ThreadPoolExecutor.runWorker(ThreadPoolExecutor.java:1130)
at java.base/java.util.concurrent.ThreadPoolExecutor$Worker.run(ThreadPoolExecutor.java:642)
at java.base/java.lang.Thread.run(Thread.java:1575)
2) Thread[id=20099, name=httpShardExecutor-11794-thread-1, state=TIMED_WAITING, group=TGRP-TestInPlaceUpdatesDistrib]
at java.base/jdk.internal.misc.Unsafe.park(Native Method)
at java.base/java.util.concurrent.locks.LockSupport.parkNanos(LockSupport.java:410)
at java.base/java.util.concurrent.LinkedTransferQueue$DualNode.await(LinkedTransferQueue.java:452)
at java.base/java.util.concurrent.SynchronousQueue$Transferer.xferLifo(SynchronousQueue.java:194)
at java.base/java.util.concurrent.SynchronousQueue.xfer(SynchronousQueue.java:235)
at java.base/java.util.concurrent.SynchronousQueue.poll(SynchronousQueue.java:338)
at java.base/java.util.concurrent.ThreadPoolExecutor.getTask(ThreadPoolExecutor.java:1069)
at java.base/java.util.concurrent.ThreadPoolExecutor.runWorker(ThreadPoolExecutor.java:1130)
at java.base/java.util.concurrent.ThreadPoolExecutor$Worker.run(ThreadPoolExecutor.java:642)
at java.base/java.lang.Thread.run(Thread.java:1575)
at __randomizedtesting.SeedInfo.seed([F0D8AD91BBBB4B57]:0)
FAILED: org.apache.solr.update.TestInPlaceUpdatesDistrib.test
Error Message:
java.lang.OutOfMemoryError: Java heap space
Stack Trace:
java.lang.OutOfMemoryError: Java heap space