You are viewing a plain text version of this content. The canonical link for it is here.
Posted to notifications@maven.apache.org by Apache Jenkins Server <je...@builds.apache.org> on 2019/10/01 09:05:10 UTC
Build failed in Jenkins: Maven TLP » maven-surefire » deployment #13
See https://builds.apache.org/job/maven-box/job/maven-surefire/job/deployment/13/
Changes:
* Apply Maven 3.6.2
* H29 has checkout issues...
* Issues with H28 too
* Seems like Maven 3.6.2 is not available on all Linux nodes yet
* Java 13 released: drop 12 + include 14 (-ea)
1 tests failed.
FAILED: org.apache.maven.surefire.its.JUnitPlatformEnginesIT.platform[1.4.0-SNAPSHOT]
Error Message:
Expected: <[\[DEBUG\] test\(compact\) classpath: test-classes classes junit-jupiter-engine-5\.4\.0-SNAPSHOT\.jar apiguardian-api-1\.0\.0\.jar junit-platform-engine-1\.4\.0-SNAPSHOT\.jar junit-platform-commons-1\.4\.0-SNAPSHOT\.jar opentest4j-1\.1\.1\.jar junit-jupiter-api-5\.4\.0-SNAPSHOT\.jar]>
but: was <[[DEBUG] test(compact) classpath: test-classes classes junit-jupiter-engine-5.4.0-SNAPSHOT.jar apiguardian-api-1.0.0.jar junit-platform-engine-1.4.0-SNAPSHOT.jar opentest4j-1.1.1.jar junit-platform-commons-1.4.0-SNAPSHOT.jar junit-jupiter-api-5.4.0-SNAPSHOT.jar]>
Stack Trace:
java.lang.AssertionError:
Expected: <[\[DEBUG\] test\(compact\) classpath: test-classes classes junit-jupiter-engine-5\.4\.0-SNAPSHOT\.jar apiguardian-api-1\.0\.0\.jar junit-platform-engine-1\.4\.0-SNAPSHOT\.jar junit-platform-commons-1\.4\.0-SNAPSHOT\.jar opentest4j-1\.1\.1\.jar junit-jupiter-api-5\.4\.0-SNAPSHOT\.jar]>
but: was <[[DEBUG] test(compact) classpath: test-classes classes junit-jupiter-engine-5.4.0-SNAPSHOT.jar apiguardian-api-1.0.0.jar junit-platform-engine-1.4.0-SNAPSHOT.jar opentest4j-1.1.1.jar junit-platform-commons-1.4.0-SNAPSHOT.jar junit-jupiter-api-5.4.0-SNAPSHOT.jar]>
at org.apache.maven.surefire.its.JUnitPlatformEnginesIT.platform(JUnitPlatformEnginesIT.java:111)
Build log:
[...truncated 47121 lines...]
[2019-10-01T08:57:52.857Z] [INFO] ------------------------------------------------------------------------
[2019-10-01T08:57:52.857Z] [ERROR] Failed to execute goal org.apache.maven.plugins:maven-failsafe-plugin:3.0.0-M3:verify (default) on project surefire-its: There are test failures.
[2019-10-01T08:57:52.857Z] [ERROR]
[2019-10-01T08:57:52.857Z] [ERROR] Please refer to C:\Users\jenkins\AppData\Local\Temp\3\jenkins-maven-box-maven-surefire-deployment-13\surefire-its\target\failsafe-reports for the individual test results.
[2019-10-01T08:57:52.857Z] [ERROR] Please refer to dump files (if any exist) [date].dump, [date]-jvmRun[N].dump and [date].dumpstream.
[2019-10-01T08:57:52.857Z] [ERROR] -> [Help 1]
[2019-10-01T08:57:52.857Z] org.apache.maven.lifecycle.LifecycleExecutionException: Failed to execute goal org.apache.maven.plugins:maven-failsafe-plugin:3.0.0-M3:verify (default) on project surefire-its: There are test failures.
[2019-10-01T08:57:52.857Z]
[2019-10-01T08:57:52.857Z] Please refer to C:\Users\jenkins\AppData\Local\Temp\3\jenkins-maven-box-maven-surefire-deployment-13\surefire-its\target\failsafe-reports for the individual test results.
[2019-10-01T08:57:52.857Z] Please refer to dump files (if any exist) [date].dump, [date]-jvmRun[N].dump and [date].dumpstream.
[2019-10-01T08:57:52.857Z] at org.apache.maven.lifecycle.internal.MojoExecutor.execute (MojoExecutor.java:215)
[2019-10-01T08:57:52.857Z] at org.apache.maven.lifecycle.internal.MojoExecutor.execute (MojoExecutor.java:156)
[2019-10-01T08:57:52.857Z] at org.apache.maven.lifecycle.internal.MojoExecutor.execute (MojoExecutor.java:148)
[2019-10-01T08:57:52.857Z] at org.apache.maven.lifecycle.internal.LifecycleModuleBuilder.buildProject (LifecycleModuleBuilder.java:117)
[2019-10-01T08:57:52.857Z] at org.apache.maven.lifecycle.internal.LifecycleModuleBuilder.buildProject (LifecycleModuleBuilder.java:81)
[2019-10-01T08:57:52.857Z] at org.apache.maven.lifecycle.internal.builder.singlethreaded.SingleThreadedBuilder.build (SingleThreadedBuilder.java:56)
[2019-10-01T08:57:52.857Z] at org.apache.maven.lifecycle.internal.LifecycleStarter.execute (LifecycleStarter.java:128)
[2019-10-01T08:57:52.857Z] at org.apache.maven.DefaultMaven.doExecute (DefaultMaven.java:305)
[2019-10-01T08:57:52.857Z] at org.apache.maven.DefaultMaven.doExecute (DefaultMaven.java:192)
[2019-10-01T08:57:52.857Z] at org.apache.maven.DefaultMaven.execute (DefaultMaven.java:105)
[2019-10-01T08:57:52.857Z] at org.apache.maven.cli.MavenCli.execute (MavenCli.java:956)
[2019-10-01T08:57:52.857Z] at org.apache.maven.cli.MavenCli.doMain (MavenCli.java:288)
[2019-10-01T08:57:52.857Z] at org.apache.maven.cli.MavenCli.main (MavenCli.java:192)
[2019-10-01T08:57:52.857Z] at sun.reflect.NativeMethodAccessorImpl.invoke0 (Native Method)
[2019-10-01T08:57:52.857Z] at sun.reflect.NativeMethodAccessorImpl.invoke (NativeMethodAccessorImpl.java:62)
[2019-10-01T08:57:52.857Z] at sun.reflect.DelegatingMethodAccessorImpl.invoke (DelegatingMethodAccessorImpl.java:43)
[2019-10-01T08:57:52.857Z] at java.lang.reflect.Method.invoke (Method.java:498)
[2019-10-01T08:57:52.857Z] at org.codehaus.plexus.classworlds.launcher.Launcher.launchEnhanced (Launcher.java:282)
[2019-10-01T08:57:52.857Z] at org.codehaus.plexus.classworlds.launcher.Launcher.launch (Launcher.java:225)
[2019-10-01T08:57:52.857Z] at org.codehaus.plexus.classworlds.launcher.Launcher.mainWithExitCode (Launcher.java:406)
[2019-10-01T08:57:52.857Z] at org.codehaus.plexus.classworlds.launcher.Launcher.main (Launcher.java:347)
[2019-10-01T08:57:52.857Z] Caused by: org.apache.maven.plugin.MojoFailureException: There are test failures.
[2019-10-01T08:57:52.857Z]
[2019-10-01T08:57:52.857Z] Please refer to C:\Users\jenkins\AppData\Local\Temp\3\jenkins-maven-box-maven-surefire-deployment-13\surefire-its\target\failsafe-reports for the individual test results.
[2019-10-01T08:57:52.857Z] Please refer to dump files (if any exist) [date].dump, [date]-jvmRun[N].dump and [date].dumpstream.
[2019-10-01T08:57:52.857Z] at org.apache.maven.plugin.surefire.SurefireHelper.throwException (SurefireHelper.java:271)
[2019-10-01T08:57:52.857Z] at org.apache.maven.plugin.surefire.SurefireHelper.reportExecution (SurefireHelper.java:159)
[2019-10-01T08:57:52.857Z] at org.apache.maven.plugin.failsafe.VerifyMojo.execute (VerifyMojo.java:192)
[2019-10-01T08:57:52.857Z] at org.apache.maven.plugin.DefaultBuildPluginManager.executeMojo (DefaultBuildPluginManager.java:137)
[2019-10-01T08:57:52.857Z] at org.apache.maven.lifecycle.internal.MojoExecutor.execute (MojoExecutor.java:210)
[2019-10-01T08:57:52.857Z] at org.apache.maven.lifecycle.internal.MojoExecutor.execute (MojoExecutor.java:156)
[2019-10-01T08:57:52.857Z] at org.apache.maven.lifecycle.internal.MojoExecutor.execute (MojoExecutor.java:148)
[2019-10-01T08:57:52.857Z] at org.apache.maven.lifecycle.internal.LifecycleModuleBuilder.buildProject (LifecycleModuleBuilder.java:117)
[2019-10-01T08:57:52.858Z] at org.apache.maven.lifecycle.internal.LifecycleModuleBuilder.buildProject (LifecycleModuleBuilder.java:81)
[2019-10-01T08:57:52.858Z] at org.apache.maven.lifecycle.internal.builder.singlethreaded.SingleThreadedBuilder.build (SingleThreadedBuilder.java:56)
[2019-10-01T08:57:52.858Z] at org.apache.maven.lifecycle.internal.LifecycleStarter.execute (LifecycleStarter.java:128)
[2019-10-01T08:57:52.858Z] at org.apache.maven.DefaultMaven.doExecute (DefaultMaven.java:305)
[2019-10-01T08:57:52.858Z] at org.apache.maven.DefaultMaven.doExecute (DefaultMaven.java:192)
[2019-10-01T08:57:52.858Z] at org.apache.maven.DefaultMaven.execute (DefaultMaven.java:105)
[2019-10-01T08:57:52.858Z] at org.apache.maven.cli.MavenCli.execute (MavenCli.java:956)
[2019-10-01T08:57:52.858Z] at org.apache.maven.cli.MavenCli.doMain (MavenCli.java:288)
[2019-10-01T08:57:52.858Z] at org.apache.maven.cli.MavenCli.main (MavenCli.java:192)
[2019-10-01T08:57:52.858Z] at sun.reflect.NativeMethodAccessorImpl.invoke0 (Native Method)
[2019-10-01T08:57:52.858Z] at sun.reflect.NativeMethodAccessorImpl.invoke (NativeMethodAccessorImpl.java:62)
[2019-10-01T08:57:52.858Z] at sun.reflect.DelegatingMethodAccessorImpl.invoke (DelegatingMethodAccessorImpl.java:43)
[2019-10-01T08:57:52.858Z] at java.lang.reflect.Method.invoke (Method.java:498)
[2019-10-01T08:57:52.858Z] at org.codehaus.plexus.classworlds.launcher.Launcher.launchEnhanced (Launcher.java:282)
[2019-10-01T08:57:52.858Z] at org.codehaus.plexus.classworlds.launcher.Launcher.launch (Launcher.java:225)
[2019-10-01T08:57:52.858Z] at org.codehaus.plexus.classworlds.launcher.Launcher.mainWithExitCode (Launcher.java:406)
[2019-10-01T08:57:52.858Z] at org.codehaus.plexus.classworlds.launcher.Launcher.main (Launcher.java:347)
[2019-10-01T08:57:52.858Z] [ERROR]
[2019-10-01T08:57:52.858Z] [ERROR] Re-run Maven using the -X switch to enable full debug logging.
[2019-10-01T08:57:52.858Z] [ERROR]
[2019-10-01T08:57:52.858Z] [ERROR] For more information about the errors and possible solutions, please read the following articles:
[2019-10-01T08:57:52.858Z] [ERROR] [Help 1] http://cwiki.apache.org/confluence/display/MAVEN/MojoFailureException
[2019-10-01T08:57:52.858Z] [ERROR]
[2019-10-01T08:57:52.858Z] [ERROR] After correcting the problems, you can resume the build with the command
[2019-10-01T08:57:52.858Z] [ERROR] mvn <args> -rf :surefire-its
[Pipeline] }
[Pipeline] // withEnv
[Pipeline] }
[Pipeline] // stage
[Pipeline] fileExists
[Pipeline] zip
[2019-10-01T08:57:53.009Z] Writing zip file of C:\Users\jenkins\AppData\Local\Temp\3\jenkins-maven-box-maven-surefire-deployment-13\maven-failsafe-plugin\target\it to C:\Users\jenkins\AppData\Local\Temp\3\jenkins-maven-box-maven-surefire-deployment-13\maven-failsafe-plugin--windows-jdk8-maven3.6.x.zip
[2019-10-01T08:57:53.148Z] Zipped 78 entries.
[2019-10-01T08:57:53.148Z] Archiving C:\Users\jenkins\AppData\Local\Temp\3\jenkins-maven-box-maven-surefire-deployment-13\maven-failsafe-plugin--windows-jdk8-maven3.6.x.zip
[2019-10-01T08:57:53.148Z] [Fast Archiver] No prior successful build to compare, so performing full copy of artifacts
[Pipeline] fileExists
[Pipeline] zip
[2019-10-01T08:57:53.220Z] Writing zip file of C:\Users\jenkins\AppData\Local\Temp\3\jenkins-maven-box-maven-surefire-deployment-13\surefire-its\target to C:\Users\jenkins\AppData\Local\Temp\3\jenkins-maven-box-maven-surefire-deployment-13\surefire-its--windows-jdk8-maven3.6.x.zip
[2019-10-01T08:57:53.485Z] [INFO] Tests run: 1, Failures: 0, Errors: 0, Skipped: 0, Time elapsed: 5.084 s - in org.apache.maven.surefire.its.jiras.Surefire697NiceSummaryIT
[2019-10-01T08:57:53.485Z] [INFO] Running org.apache.maven.surefire.its.jiras.Surefire705ParallelForkTimeoutIT
[2019-10-01T08:58:01.717Z] [INFO] Tests run: 1, Failures: 0, Errors: 0, Skipped: 0, Time elapsed: 8.975 s - in org.apache.maven.surefire.its.jiras.Surefire705ParallelForkTimeoutIT
[2019-10-01T08:58:01.717Z] [INFO] Running org.apache.maven.surefire.its.jiras.Surefire733AllOverrridesCapturedIT
[2019-10-01T08:58:05.992Z] [INFO] Tests run: 1, Failures: 0, Errors: 0, Skipped: 0, Time elapsed: 4.235 s - in org.apache.maven.surefire.its.jiras.Surefire733AllOverrridesCapturedIT
[2019-10-01T08:58:05.992Z] [INFO] Running org.apache.maven.surefire.its.jiras.Surefire735ForkFailWithRedirectConsoleOutputIT
[2019-10-01T08:58:06.684Z] Zipped 15945 entries.
[2019-10-01T08:58:06.684Z] Archiving C:\Users\jenkins\AppData\Local\Temp\3\jenkins-maven-box-maven-surefire-deployment-13\surefire-its--windows-jdk8-maven3.6.x.zip
[2019-10-01T08:58:06.685Z] [Fast Archiver] No prior successful build to compare, so performing full copy of artifacts
[Pipeline] archiveArtifacts
[2019-10-01T08:58:08.220Z] Archiving artifacts
[2019-10-01T08:58:08.230Z] [Fast Archiver] No prior successful build to compare, so performing full copy of artifacts
[Pipeline] cleanWs
[2019-10-01T08:58:09.711Z] [WS-CLEANUP] Deleting project workspace...
[2019-10-01T08:58:09.711Z] [WS-CLEANUP] Deferred wipeout is used...
[2019-10-01T08:58:09.838Z] [WS-CLEANUP] done
[Pipeline] }
[Pipeline] // ws
[Pipeline] }
[Pipeline] // timestamps
[Pipeline] }
[Pipeline] // node
[Pipeline] }
[2019-10-01T08:58:16.082Z] [INFO] Tests run: 2, Failures: 0, Errors: 0, Skipped: 0, Time elapsed: 9.315 s - in org.apache.maven.surefire.its.jiras.Surefire735ForkFailWithRedirectConsoleOutputIT
[2019-10-01T08:58:16.082Z] [INFO] Running org.apache.maven.surefire.its.jiras.Surefire740TruncatedCommaIT
[2019-10-01T08:58:21.709Z] [INFO] Tests run: 1, Failures: 0, Errors: 0, Skipped: 0, Time elapsed: 6.223 s - in org.apache.maven.surefire.its.jiras.Surefire740TruncatedCommaIT
[2019-10-01T08:58:21.709Z] [INFO] Running org.apache.maven.surefire.its.jiras.Surefire747MethodParallelWithSuiteCountIT
[2019-10-01T08:58:44.731Z] [INFO] Tests run: 2, Failures: 0, Errors: 0, Skipped: 0, Time elapsed: 22.511 s - in org.apache.maven.surefire.its.jiras.Surefire747MethodParallelWithSuiteCountIT
[2019-10-01T08:58:44.731Z] [INFO] Running org.apache.maven.surefire.its.jiras.Surefire772BothReportsIT
[2019-10-01T08:58:52.953Z] [INFO] Tests run: 3, Failures: 0, Errors: 0, Skipped: 0, Time elapsed: 8.633 s - in org.apache.maven.surefire.its.jiras.Surefire772BothReportsIT
[2019-10-01T08:58:52.953Z] [INFO] Running org.apache.maven.surefire.its.jiras.Surefire772NoFailsafeReportsIT
[2019-10-01T08:59:05.834Z] [INFO] Tests run: 4, Failures: 0, Errors: 0, Skipped: 0, Time elapsed: 11.776 s - in org.apache.maven.surefire.its.jiras.Surefire772NoFailsafeReportsIT
[2019-10-01T08:59:05.834Z] [INFO] Running org.apache.maven.surefire.its.jiras.Surefire772NoSurefireReportsIT
[2019-10-01T08:59:18.161Z] [INFO] Tests run: 4, Failures: 0, Errors: 0, Skipped: 0, Time elapsed: 11.854 s - in org.apache.maven.surefire.its.jiras.Surefire772NoSurefireReportsIT
[2019-10-01T08:59:18.161Z] [INFO] Running org.apache.maven.surefire.its.jiras.Surefire772SpecifiedReportsIT
[2019-10-01T08:59:26.395Z] [INFO] Tests run: 3, Failures: 0, Errors: 0, Skipped: 0, Time elapsed: 8.743 s - in org.apache.maven.surefire.its.jiras.Surefire772SpecifiedReportsIT
[2019-10-01T08:59:26.395Z] [INFO] Running org.apache.maven.surefire.its.jiras.Surefire801ForkModeNoneClassLoaderIT
[2019-10-01T08:59:28.988Z] [INFO] Tests run: 1, Failures: 0, Errors: 0, Skipped: 0, Time elapsed: 3.656 s - in org.apache.maven.surefire.its.jiras.Surefire801ForkModeNoneClassLoaderIT
[2019-10-01T08:59:28.988Z] [INFO] Running org.apache.maven.surefire.its.jiras.Surefire803MultiFailsafeExecsIT
[2019-10-01T08:59:51.211Z] [INFO] Tests run: 2, Failures: 0, Errors: 0, Skipped: 0, Time elapsed: 19.339 s - in org.apache.maven.surefire.its.jiras.Surefire803MultiFailsafeExecsIT
[2019-10-01T08:59:51.211Z] [INFO] Running org.apache.maven.surefire.its.jiras.Surefire806SpecifiedTestControlsIT
[2019-10-01T08:59:53.165Z] [WARNING] Tests run: 3, Failures: 0, Errors: 0, Skipped: 2, Time elapsed: 5.051 s - in org.apache.maven.surefire.its.jiras.Surefire806SpecifiedTestControlsIT
[2019-10-01T08:59:53.165Z] [INFO] Running org.apache.maven.surefire.its.jiras.Surefire809GroupExpressionsIT
[2019-10-01T09:00:32.046Z] [INFO] Tests run: 6, Failures: 0, Errors: 0, Skipped: 0, Time elapsed: 32.848 s - in org.apache.maven.surefire.its.jiras.Surefire809GroupExpressionsIT
[2019-10-01T09:00:32.046Z] [INFO] Running org.apache.maven.surefire.its.jiras.Surefire812Log4JClassLoaderIT
[2019-10-01T09:00:32.046Z] [INFO] Tests run: 1, Failures: 0, Errors: 0, Skipped: 0, Time elapsed: 5.687 s - in org.apache.maven.surefire.its.jiras.Surefire812Log4JClassLoaderIT
[2019-10-01T09:00:32.046Z] [INFO] Running org.apache.maven.surefire.its.jiras.Surefire817SystemExitIT
[2019-10-01T09:00:37.399Z] [INFO] Tests run: 1, Failures: 0, Errors: 0, Skipped: 0, Time elapsed: 5.127 s - in org.apache.maven.surefire.its.jiras.Surefire817SystemExitIT
[2019-10-01T09:00:37.399Z] [INFO] Running org.apache.maven.surefire.its.jiras.Surefire818NpeIgnoresTestsIT
[2019-10-01T09:00:44.097Z] [INFO] Tests run: 1, Failures: 0, Errors: 0, Skipped: 0, Time elapsed: 6.76 s - in org.apache.maven.surefire.its.jiras.Surefire818NpeIgnoresTestsIT
[2019-10-01T09:00:44.097Z] [INFO] Running org.apache.maven.surefire.its.jiras.Surefire828EmptyGroupExprIT
[2019-10-01T09:01:10.824Z] [INFO] Tests run: 4, Failures: 0, Errors: 0, Skipped: 0, Time elapsed: 25.864 s - in org.apache.maven.surefire.its.jiras.Surefire828EmptyGroupExprIT
[2019-10-01T09:01:10.824Z] [INFO] Running org.apache.maven.surefire.its.jiras.Surefire832ProviderSelectionIT
[2019-10-01T09:01:16.207Z] [INFO] Tests run: 1, Failures: 0, Errors: 0, Skipped: 0, Time elapsed: 5.967 s - in org.apache.maven.surefire.its.jiras.Surefire832ProviderSelectionIT
[2019-10-01T09:01:16.207Z] [INFO] Running org.apache.maven.surefire.its.jiras.Surefire839TestWithoutCategoriesIT
[2019-10-01T09:01:28.546Z] [INFO] Tests run: 2, Failures: 0, Errors: 0, Skipped: 0, Time elapsed: 11.076 s - in org.apache.maven.surefire.its.jiras.Surefire839TestWithoutCategoriesIT
[2019-10-01T09:01:28.546Z] [INFO] Running org.apache.maven.surefire.its.jiras.Surefire847AdditionalFailureIT
[2019-10-01T09:01:35.409Z] [INFO] Tests run: 1, Failures: 0, Errors: 0, Skipped: 0, Time elapsed: 8.028 s - in org.apache.maven.surefire.its.jiras.Surefire847AdditionalFailureIT
[2019-10-01T09:01:35.409Z] [INFO] Running org.apache.maven.surefire.its.jiras.Surefire855AllowFailsafeUseArtifactFileIT
[2019-10-01T09:02:44.121Z] [INFO] Tests run: 4, Failures: 0, Errors: 0, Skipped: 0, Time elapsed: 62.371 s - in org.apache.maven.surefire.its.jiras.Surefire855AllowFailsafeUseArtifactFileIT
[2019-10-01T09:02:44.121Z] [INFO] Running org.apache.maven.surefire.its.jiras.Surefire901MIssingResultfileWhenNoTestsIT
[2019-10-01T09:02:44.121Z] [INFO] Tests run: 1, Failures: 0, Errors: 0, Skipped: 0, Time elapsed: 4.114 s - in org.apache.maven.surefire.its.jiras.Surefire901MIssingResultfileWhenNoTestsIT
[2019-10-01T09:02:44.121Z] [INFO] Running org.apache.maven.surefire.its.jiras.Surefire907PerThreadWithoutThreadCountIT
[2019-10-01T09:02:45.544Z] [INFO] Tests run: 1, Failures: 0, Errors: 0, Skipped: 0, Time elapsed: 4.028 s - in org.apache.maven.surefire.its.jiras.Surefire907PerThreadWithoutThreadCountIT
[2019-10-01T09:02:45.544Z] [INFO] Running org.apache.maven.surefire.its.jiras.Surefire920TestFailureIgnoreWithTimeoutIT
[2019-10-01T09:03:00.552Z] [INFO] Tests run: 2, Failures: 0, Errors: 0, Skipped: 0, Time elapsed: 13.152 s - in org.apache.maven.surefire.its.jiras.Surefire920TestFailureIgnoreWithTimeoutIT
[2019-10-01T09:03:00.552Z] [INFO] Running org.apache.maven.surefire.its.jiras.Surefire926FailureWith2ProvidersIT
[2019-10-01T09:03:05.910Z] [INFO] Tests run: 1, Failures: 0, Errors: 0, Skipped: 0, Time elapsed: 7.128 s - in org.apache.maven.surefire.its.jiras.Surefire926FailureWith2ProvidersIT
[2019-10-01T09:03:05.910Z] [INFO] Running org.apache.maven.surefire.its.jiras.Surefire930TestNgSuiteXmlIT
[2019-10-01T09:03:14.134Z] [INFO] Tests run: 1, Failures: 0, Errors: 0, Skipped: 0, Time elapsed: 7.969 s - in org.apache.maven.surefire.its.jiras.Surefire930TestNgSuiteXmlIT
[2019-10-01T09:03:14.134Z] [INFO] Running org.apache.maven.surefire.its.jiras.Surefire943ReportContentIT
[2019-10-01T09:03:46.381Z] [INFO] Tests run: 2, Failures: 0, Errors: 0, Skipped: 0, Time elapsed: 28.212 s - in org.apache.maven.surefire.its.jiras.Surefire943ReportContentIT
[2019-10-01T09:03:46.382Z] [INFO] Running org.apache.maven.surefire.its.jiras.Surefire946KillMainProcessInReusableForkIT
[2019-10-01T09:04:08.465Z] [INFO] Tests run: 3, Failures: 0, Errors: 0, Skipped: 0, Time elapsed: 22.59 s - in org.apache.maven.surefire.its.jiras.Surefire946KillMainProcessInReusableForkIT
[2019-10-01T09:04:08.465Z] [INFO] Running org.apache.maven.surefire.its.jiras.Surefire972BizarreNoClassDefIT
[2019-10-01T09:04:15.123Z] [INFO] Tests run: 1, Failures: 0, Errors: 0, Skipped: 0, Time elapsed: 9.536 s - in org.apache.maven.surefire.its.jiras.Surefire972BizarreNoClassDefIT
[2019-10-01T09:04:15.123Z] [INFO] Running org.apache.maven.surefire.its.jiras.Surefire975DefaultVMEncodingIT
[2019-10-01T09:04:22.897Z] [INFO] Tests run: 1, Failures: 0, Errors: 0, Skipped: 0, Time elapsed: 6.262 s - in org.apache.maven.surefire.its.jiras.Surefire975DefaultVMEncodingIT
[2019-10-01T09:04:22.897Z] [INFO] Running org.apache.maven.surefire.its.jiras.Surefire979WrongClassLoaderIT
[2019-10-01T09:04:25.492Z] [INFO] Tests run: 1, Failures: 0, Errors: 0, Skipped: 0, Time elapsed: 4.745 s - in org.apache.maven.surefire.its.jiras.Surefire979WrongClassLoaderIT
[2019-10-01T09:04:25.492Z] [INFO] Running org.apache.maven.surefire.its.jiras.Surefire985ParameterizedRunnerAndCategoriesIT
[2019-10-01T09:04:29.761Z] [INFO] Tests run: 1, Failures: 0, Errors: 0, Skipped: 0, Time elapsed: 4.144 s - in org.apache.maven.surefire.its.jiras.Surefire985ParameterizedRunnerAndCategoriesIT
[2019-10-01T09:04:29.761Z] [INFO] Running org.apache.maven.surefire.its.jiras.Surefire995CategoryInheritanceIT
[2019-10-01T09:04:52.612Z] [INFO] Tests run: 5, Failures: 0, Errors: 0, Skipped: 0, Time elapsed: 19.417 s - in org.apache.maven.surefire.its.jiras.Surefire995CategoryInheritanceIT
[2019-10-01T09:04:52.612Z] [INFO]
[2019-10-01T09:04:52.612Z] [INFO] Results:
[2019-10-01T09:04:52.612Z] [INFO]
[2019-10-01T09:04:52.612Z] [WARNING] Tests run: 788, Failures: 0, Errors: 0, Skipped: 169
[2019-10-01T09:04:52.612Z] [INFO]
[2019-10-01T09:04:52.612Z] [INFO]
[2019-10-01T09:04:52.612Z] [INFO] --- maven-checkstyle-plugin:3.0.0:check (checkstyle-check) @ surefire-its ---
[2019-10-01T09:04:52.612Z] [INFO]
[2019-10-01T09:04:52.612Z] [INFO] --- maven-failsafe-plugin:3.0.0-M3:verify (default) @ surefire-its ---
[2019-10-01T09:04:52.612Z] [INFO] Failsafe report directory: C:\Users\jenkins\AppData\Local\Temp\3\jenkins-maven-box-maven-surefire-deployment-13@2\surefire-its\target\failsafe-reports
[2019-10-01T09:04:52.612Z] [INFO]
[2019-10-01T09:04:52.612Z] [INFO] --- maven-install-plugin:2.5.2:install (default-install) @ surefire-its ---
[2019-10-01T09:04:52.612Z] [INFO] Skipping artifact installation
[2019-10-01T09:04:52.612Z] [INFO] ------------------------------------------------------------------------
[2019-10-01T09:04:52.612Z] [INFO] Reactor Summary for Apache Maven Surefire 3.0.0-M4-SNAPSHOT:
[2019-10-01T09:04:52.612Z] [INFO]
[2019-10-01T09:04:52.612Z] [INFO] Apache Maven Surefire .............................. SUCCESS [01:09 min]
[2019-10-01T09:04:52.612Z] [INFO] SureFire Logger API ................................ SUCCESS [ 10.911 s]
[2019-10-01T09:04:52.612Z] [INFO] SureFire API ....................................... SUCCESS [ 20.294 s]
[2019-10-01T09:04:52.612Z] [INFO] SureFire Booter .................................... SUCCESS [ 24.249 s]
[2019-10-01T09:04:52.612Z] [INFO] Maven Surefire Test-Grouping Support ............... SUCCESS [ 12.784 s]
[2019-10-01T09:04:52.612Z] [INFO] SureFire Providers ................................. SUCCESS [ 1.061 s]
[2019-10-01T09:04:52.612Z] [INFO] Shared JUnit3 Provider Code ........................ SUCCESS [ 6.102 s]
[2019-10-01T09:04:52.612Z] [INFO] Shared Java 5 Provider Base ........................ SUCCESS [ 7.153 s]
[2019-10-01T09:04:52.612Z] [INFO] Shared JUnit4 Provider Code ........................ SUCCESS [ 7.548 s]
[2019-10-01T09:04:52.612Z] [INFO] Shared JUnit48 Provider Code ....................... SUCCESS [ 8.168 s]
[2019-10-01T09:04:52.612Z] [INFO] SureFire JUnit Runner .............................. SUCCESS [ 5.790 s]
[2019-10-01T09:04:52.613Z] [INFO] SureFire JUnit4 Runner ............................. SUCCESS [ 35.696 s]
[2019-10-01T09:04:52.613Z] [INFO] Maven Surefire Common .............................. SUCCESS [ 38.004 s]
[2019-10-01T09:04:52.613Z] [INFO] SureFire JUnitCore Runner .......................... SUCCESS [02:22 min]
[2019-10-01T09:04:52.613Z] [INFO] SureFire JUnit Platform Runner ..................... SUCCESS [ 12.832 s]
[2019-10-01T09:04:52.613Z] [INFO] SureFire TestNG Utils .............................. SUCCESS [ 5.883 s]
[2019-10-01T09:04:52.613Z] [INFO] SureFire TestNG Runner ............................. SUCCESS [ 7.198 s]
[2019-10-01T09:04:52.613Z] [INFO] ShadeFire JUnit3 Provider .......................... SUCCESS [ 4.661 s]
[2019-10-01T09:04:52.613Z] [INFO] Surefire Report Parser ............................. SUCCESS [ 8.817 s]
[2019-10-01T09:04:52.613Z] [INFO] Maven Surefire Plugin .............................. SUCCESS [ 18.223 s]
[2019-10-01T09:04:52.613Z] [INFO] Maven Failsafe Plugin .............................. SUCCESS [02:03 min]
[2019-10-01T09:04:52.613Z] [INFO] Maven Surefire Report Plugin ....................... SUCCESS [ 21.064 s]
[2019-10-01T09:04:52.613Z] [INFO] Maven Surefire Integration Tests ................... SUCCESS [ 01:07 h]
[2019-10-01T09:04:52.613Z] [INFO] ------------------------------------------------------------------------
[2019-10-01T09:04:52.613Z] [INFO] BUILD SUCCESS
[2019-10-01T09:04:52.613Z] [INFO] ------------------------------------------------------------------------
[2019-10-01T09:04:52.613Z] [INFO] Total time: 01:17 h
[2019-10-01T09:04:52.613Z] [INFO] Finished at: 2019-10-01T02:04:50-07:00
[2019-10-01T09:04:52.613Z] [INFO] ------------------------------------------------------------------------
[Pipeline] }
[Pipeline] // withEnv
[Pipeline] }
[Pipeline] // stage
[Pipeline] fileExists
[Pipeline] zip
[2019-10-01T09:04:52.811Z] Writing zip file of C:\Users\jenkins\AppData\Local\Temp\3\jenkins-maven-box-maven-surefire-deployment-13@2\maven-failsafe-plugin\target\it to C:\Users\jenkins\AppData\Local\Temp\3\jenkins-maven-box-maven-surefire-deployment-13@2\maven-failsafe-plugin--windows-jdk7-maven3.6.x.zip
[2019-10-01T09:04:52.934Z] Zipped 78 entries.
[2019-10-01T09:04:52.934Z] Archiving C:\Users\jenkins\AppData\Local\Temp\3\jenkins-maven-box-maven-surefire-deployment-13@2\maven-failsafe-plugin--windows-jdk7-maven3.6.x.zip
[2019-10-01T09:04:52.934Z] [Fast Archiver] No prior successful build to compare, so performing full copy of artifacts
[Pipeline] fileExists
[Pipeline] zip
[2019-10-01T09:04:53.004Z] Writing zip file of C:\Users\jenkins\AppData\Local\Temp\3\jenkins-maven-box-maven-surefire-deployment-13@2\surefire-its\target to C:\Users\jenkins\AppData\Local\Temp\3\jenkins-maven-box-maven-surefire-deployment-13@2\surefire-its--windows-jdk7-maven3.6.x.zip
[2019-10-01T09:05:07.057Z] Zipped 15820 entries.
[2019-10-01T09:05:07.057Z] Archiving C:\Users\jenkins\AppData\Local\Temp\3\jenkins-maven-box-maven-surefire-deployment-13@2\surefire-its--windows-jdk7-maven3.6.x.zip
[2019-10-01T09:05:07.057Z] [Fast Archiver] No prior successful build to compare, so performing full copy of artifacts
[Pipeline] archiveArtifacts
[2019-10-01T09:05:08.369Z] Archiving artifacts
[2019-10-01T09:05:08.388Z] [Fast Archiver] No prior successful build to compare, so performing full copy of artifacts
[Pipeline] cleanWs
[2019-10-01T09:05:09.439Z] [WS-CLEANUP] Deleting project workspace...
[2019-10-01T09:05:09.439Z] [WS-CLEANUP] Deferred wipeout is used...
[2019-10-01T09:05:09.564Z] [WS-CLEANUP] done
[Pipeline] }
[Pipeline] // ws
[Pipeline] }
[Pipeline] // timestamps
[Pipeline] }
[Pipeline] // node
[Pipeline] }
[Pipeline] // parallel
[Pipeline] echo
Build result: FAILURE
[Pipeline] jiraIssueSelector
[Pipeline] echo
The authors of changes [rfscholte].
[Pipeline] echo
Sending email ...
[Pipeline] emailext
Build failed in Jenkins: Maven TLP » maven-surefire » deployment #15
Posted by Apache Jenkins Server <je...@builds.apache.org>.
See https://builds.apache.org/job/maven-box/job/maven-surefire/job/deployment/15/
Changes:
* [INFRA-19273] Maven 3.6.0 dropped, update to 3.6.2
1 tests failed.
FAILED: org.apache.maven.surefire.its.JUnitPlatformEnginesIT.platform[1.4.0-SNAPSHOT]
Error Message:
Expected: <[\[DEBUG\] test\(compact\) classpath: test-classes classes junit-jupiter-engine-5\.4\.0-SNAPSHOT\.jar apiguardian-api-1\.0\.0\.jar junit-platform-engine-1\.4\.0-SNAPSHOT\.jar junit-platform-commons-1\.4\.0-SNAPSHOT\.jar opentest4j-1\.1\.1\.jar junit-jupiter-api-5\.4\.0-SNAPSHOT\.jar]>
but: was <[[DEBUG] test(compact) classpath: test-classes classes junit-jupiter-engine-5.4.0-SNAPSHOT.jar apiguardian-api-1.0.0.jar junit-platform-engine-1.4.0-SNAPSHOT.jar opentest4j-1.1.1.jar junit-platform-commons-1.4.0-SNAPSHOT.jar junit-jupiter-api-5.4.0-SNAPSHOT.jar]>
Stack Trace:
java.lang.AssertionError:
Expected: <[\[DEBUG\] test\(compact\) classpath: test-classes classes junit-jupiter-engine-5\.4\.0-SNAPSHOT\.jar apiguardian-api-1\.0\.0\.jar junit-platform-engine-1\.4\.0-SNAPSHOT\.jar junit-platform-commons-1\.4\.0-SNAPSHOT\.jar opentest4j-1\.1\.1\.jar junit-jupiter-api-5\.4\.0-SNAPSHOT\.jar]>
but: was <[[DEBUG] test(compact) classpath: test-classes classes junit-jupiter-engine-5.4.0-SNAPSHOT.jar apiguardian-api-1.0.0.jar junit-platform-engine-1.4.0-SNAPSHOT.jar opentest4j-1.1.1.jar junit-platform-commons-1.4.0-SNAPSHOT.jar junit-jupiter-api-5.4.0-SNAPSHOT.jar]>
at org.apache.maven.surefire.its.JUnitPlatformEnginesIT.platform(JUnitPlatformEnginesIT.java:111)
Build log:
[...truncated 44917 lines...]
[2019-10-26T17:22:32.151Z] [INFO] Downloaded from central: https://repo.maven.apache.org/maven2/org/apache/maven/shared/maven-script-interpreter/1.2/maven-script-interpreter-1.2.pom (4.0 kB at 91 kB/s)
[2019-10-26T17:22:32.432Z] [INFO] Downloading from central: https://repo.maven.apache.org/maven2/org/apache/ant/ant/1.8.1/ant-1.8.1.pom
[2019-10-26T17:22:32.432Z] [INFO] Downloaded from central: https://repo.maven.apache.org/maven2/org/apache/ant/ant/1.8.1/ant-1.8.1.pom (8.8 kB at 62 kB/s)
[2019-10-26T17:22:32.432Z] [INFO] Downloading from central: https://repo.maven.apache.org/maven2/org/apache/ant/ant-parent/1.8.1/ant-parent-1.8.1.pom
[2019-10-26T17:22:32.714Z] [INFO] Downloaded from central: https://repo.maven.apache.org/maven2/org/apache/ant/ant-parent/1.8.1/ant-parent-1.8.1.pom (4.3 kB at 91 kB/s)
[2019-10-26T17:22:32.714Z] [INFO] Downloading from central: https://repo.maven.apache.org/maven2/org/apache/maven/doxia/doxia-sink-api/1.7/doxia-sink-api-1.7.pom
[2019-10-26T17:22:32.714Z] [INFO] Downloaded from central: https://repo.maven.apache.org/maven2/org/apache/maven/doxia/doxia-sink-api/1.7/doxia-sink-api-1.7.pom (1.5 kB at 39 kB/s)
[2019-10-26T17:22:32.714Z] [INFO] Downloading from central: https://repo.maven.apache.org/maven2/org/apache/maven/doxia/doxia/1.7/doxia-1.7.pom
[2019-10-26T17:22:32.714Z] [INFO] Downloaded from central: https://repo.maven.apache.org/maven2/org/apache/maven/doxia/doxia/1.7/doxia-1.7.pom (15 kB at 347 kB/s)
[2019-10-26T17:22:32.714Z] [INFO] Downloading from central: https://repo.maven.apache.org/maven2/org/apache/maven/doxia/doxia-logging-api/1.7/doxia-logging-api-1.7.pom
[2019-10-26T17:22:32.714Z] [INFO] Downloaded from central: https://repo.maven.apache.org/maven2/org/apache/maven/doxia/doxia-logging-api/1.7/doxia-logging-api-1.7.pom (1.5 kB at 38 kB/s)
[2019-10-26T17:22:32.714Z] [INFO] Downloading from central: https://repo.maven.apache.org/maven2/org/apache/maven/doxia/doxia-site-renderer/1.7.4/doxia-site-renderer-1.7.4.pom
[2019-10-26T17:22:32.995Z] [INFO] Downloaded from central: https://repo.maven.apache.org/maven2/org/apache/maven/doxia/doxia-site-renderer/1.7.4/doxia-site-renderer-1.7.4.pom (6.7 kB at 159 kB/s)
[2019-10-26T17:22:32.995Z] [INFO] Downloading from central: https://repo.maven.apache.org/maven2/org/apache/maven/doxia/doxia-sitetools/1.7.4/doxia-sitetools-1.7.4.pom
[2019-10-26T17:22:32.995Z] [INFO] Downloaded from central: https://repo.maven.apache.org/maven2/org/apache/maven/doxia/doxia-sitetools/1.7.4/doxia-sitetools-1.7.4.pom (14 kB at 210 kB/s)
[2019-10-26T17:22:32.995Z] [INFO] Downloading from central: https://repo.maven.apache.org/maven2/org/apache/maven/doxia/doxia-core/1.7/doxia-core-1.7.pom
[2019-10-26T17:22:32.995Z] [INFO] Downloaded from central: https://repo.maven.apache.org/maven2/org/apache/maven/doxia/doxia-core/1.7/doxia-core-1.7.pom (4.1 kB at 90 kB/s)
[2019-10-26T17:22:32.995Z] [INFO] Downloading from central: https://repo.maven.apache.org/maven2/org/apache/maven/doxia/doxia-decoration-model/1.7.4/doxia-decoration-model-1.7.4.pom
[2019-10-26T17:22:32.995Z] [INFO] Downloaded from central: https://repo.maven.apache.org/maven2/org/apache/maven/doxia/doxia-decoration-model/1.7.4/doxia-decoration-model-1.7.4.pom (3.4 kB at 79 kB/s)
[2019-10-26T17:22:33.278Z] [INFO] Downloading from central: https://repo.maven.apache.org/maven2/org/apache/maven/doxia/doxia-skin-model/1.7.4/doxia-skin-model-1.7.4.pom
[2019-10-26T17:22:33.278Z] [INFO] Downloaded from central: https://repo.maven.apache.org/maven2/org/apache/maven/doxia/doxia-skin-model/1.7.4/doxia-skin-model-1.7.4.pom (3.0 kB at 72 kB/s)
[2019-10-26T17:22:33.278Z] [INFO] Downloading from central: https://repo.maven.apache.org/maven2/org/apache/maven/doxia/doxia-module-xhtml/1.7/doxia-module-xhtml-1.7.pom
[2019-10-26T17:22:33.278Z] [INFO] Downloaded from central: https://repo.maven.apache.org/maven2/org/apache/maven/doxia/doxia-module-xhtml/1.7/doxia-module-xhtml-1.7.pom (1.6 kB at 37 kB/s)
[2019-10-26T17:22:33.278Z] [INFO] Downloading from central: https://repo.maven.apache.org/maven2/org/apache/maven/doxia/doxia-modules/1.7/doxia-modules-1.7.pom
[2019-10-26T17:22:33.278Z] [INFO] Downloaded from central: https://repo.maven.apache.org/maven2/org/apache/maven/doxia/doxia-modules/1.7/doxia-modules-1.7.pom (2.6 kB at 61 kB/s)
[2019-10-26T17:22:33.278Z] [INFO] Downloading from central: https://repo.maven.apache.org/maven2/org/codehaus/groovy/groovy-all/2.4.8/groovy-all-2.4.8.pom
[2019-10-26T17:22:33.555Z] [INFO] Downloaded from central: https://repo.maven.apache.org/maven2/org/codehaus/groovy/groovy-all/2.4.8/groovy-all-2.4.8.pom (21 kB at 427 kB/s)
[2019-10-26T17:22:33.555Z] [INFO] Downloading from central: https://repo.maven.apache.org/maven2/org/apache/maven/shared/maven-invoker/3.0.1/maven-invoker-3.0.1.jar
[2019-10-26T17:22:33.555Z] [INFO] Downloading from central: https://repo.maven.apache.org/maven2/commons-digester/commons-digester/1.8.1/commons-digester-1.8.1.jar
[2019-10-26T17:22:33.555Z] [INFO] Downloading from central: https://repo.maven.apache.org/maven2/commons-beanutils/commons-beanutils/1.8.3/commons-beanutils-1.8.3.jar
[2019-10-26T17:22:33.555Z] [INFO] Downloading from central: https://repo.maven.apache.org/maven2/commons-validator/commons-validator/1.4.1/commons-validator-1.4.1.jar
[2019-10-26T17:22:33.555Z] [INFO] Downloading from central: https://repo.maven.apache.org/maven2/org/apache/maven/reporting/maven-reporting-impl/2.4/maven-reporting-impl-2.4.jar
[2019-10-26T17:22:33.555Z] [INFO] Downloaded from central: https://repo.maven.apache.org/maven2/org/apache/maven/shared/maven-invoker/3.0.1/maven-invoker-3.0.1.jar (33 kB at 718 kB/s)
[2019-10-26T17:22:33.555Z] [INFO] Downloaded from central: https://repo.maven.apache.org/maven2/org/apache/maven/reporting/maven-reporting-impl/2.4/maven-reporting-impl-2.4.jar (20 kB at 433 kB/s)
[2019-10-26T17:22:33.555Z] [INFO] Downloading from central: https://repo.maven.apache.org/maven2/commons-logging/commons-logging/1.2/commons-logging-1.2.jar
[2019-10-26T17:22:33.555Z] [INFO] Downloading from central: https://repo.maven.apache.org/maven2/org/apache/maven/shared/maven-script-interpreter/1.2/maven-script-interpreter-1.2.jar
[2019-10-26T17:22:33.555Z] [INFO] Downloaded from central: https://repo.maven.apache.org/maven2/commons-beanutils/commons-beanutils/1.8.3/commons-beanutils-1.8.3.jar (232 kB at 2.9 MB/s)
[2019-10-26T17:22:33.555Z] [INFO] Downloading from central: https://repo.maven.apache.org/maven2/org/apache/ant/ant/1.8.1/ant-1.8.1.jar
[2019-10-26T17:22:33.555Z] [INFO] Downloaded from central: https://repo.maven.apache.org/maven2/commons-logging/commons-logging/1.2/commons-logging-1.2.jar (62 kB at 637 kB/s)
[2019-10-26T17:22:33.555Z] [INFO] Downloading from central: https://repo.maven.apache.org/maven2/org/apache/maven/doxia/doxia-sink-api/1.7/doxia-sink-api-1.7.jar
[2019-10-26T17:22:33.555Z] [INFO] Downloaded from central: https://repo.maven.apache.org/maven2/commons-validator/commons-validator/1.4.1/commons-validator-1.4.1.jar (190 kB at 1.8 MB/s)
[2019-10-26T17:22:33.555Z] [INFO] Downloading from central: https://repo.maven.apache.org/maven2/org/apache/maven/doxia/doxia-logging-api/1.7/doxia-logging-api-1.7.jar
[2019-10-26T17:22:33.833Z] [INFO] Downloaded from central: https://repo.maven.apache.org/maven2/org/apache/maven/doxia/doxia-sink-api/1.7/doxia-sink-api-1.7.jar (11 kB at 57 kB/s)
[2019-10-26T17:22:33.833Z] [INFO] Downloading from central: https://repo.maven.apache.org/maven2/org/apache/maven/doxia/doxia-site-renderer/1.7.4/doxia-site-renderer-1.7.4.jar
[2019-10-26T17:22:33.833Z] [INFO] Downloaded from central: https://repo.maven.apache.org/maven2/org/apache/maven/shared/maven-script-interpreter/1.2/maven-script-interpreter-1.2.jar (22 kB at 102 kB/s)
[2019-10-26T17:22:33.833Z] [INFO] Downloading from central: https://repo.maven.apache.org/maven2/org/apache/maven/doxia/doxia-decoration-model/1.7.4/doxia-decoration-model-1.7.4.jar
[2019-10-26T17:22:33.833Z] [INFO] Downloaded from central: https://repo.maven.apache.org/maven2/org/apache/maven/doxia/doxia-logging-api/1.7/doxia-logging-api-1.7.jar (12 kB at 52 kB/s)
[2019-10-26T17:22:33.833Z] [INFO] Downloading from central: https://repo.maven.apache.org/maven2/org/apache/maven/doxia/doxia-skin-model/1.7.4/doxia-skin-model-1.7.4.jar
[2019-10-26T17:22:33.833Z] [INFO] Downloaded from central: https://repo.maven.apache.org/maven2/org/apache/maven/doxia/doxia-site-renderer/1.7.4/doxia-site-renderer-1.7.4.jar (64 kB at 253 kB/s)
[2019-10-26T17:22:33.833Z] [INFO] Downloading from central: https://repo.maven.apache.org/maven2/org/apache/maven/doxia/doxia-module-xhtml/1.7/doxia-module-xhtml-1.7.jar
[2019-10-26T17:22:33.833Z] [INFO] Downloaded from central: https://repo.maven.apache.org/maven2/org/apache/maven/doxia/doxia-decoration-model/1.7.4/doxia-decoration-model-1.7.4.jar (61 kB at 224 kB/s)
[2019-10-26T17:22:33.833Z] [INFO] Downloading from central: https://repo.maven.apache.org/maven2/org/codehaus/groovy/groovy-all/2.4.8/groovy-all-2.4.8.jar
[2019-10-26T17:22:33.833Z] [INFO] Downloaded from central: https://repo.maven.apache.org/maven2/commons-digester/commons-digester/1.8.1/commons-digester-1.8.1.jar (146 kB at 407 kB/s)
[2019-10-26T17:22:33.833Z] [INFO] Downloaded from central: https://repo.maven.apache.org/maven2/org/apache/maven/doxia/doxia-skin-model/1.7.4/doxia-skin-model-1.7.4.jar (16 kB at 43 kB/s)
[2019-10-26T17:22:33.833Z] [INFO] Downloaded from central: https://repo.maven.apache.org/maven2/org/apache/maven/doxia/doxia-module-xhtml/1.7/doxia-module-xhtml-1.7.jar (17 kB at 46 kB/s)
[2019-10-26T17:22:34.110Z] [INFO] Downloaded from central: https://repo.maven.apache.org/maven2/org/apache/ant/ant/1.8.1/ant-1.8.1.jar (1.5 MB at 2.6 MB/s)
[2019-10-26T17:22:35.529Z] [INFO] Downloaded from central: https://repo.maven.apache.org/maven2/org/codehaus/groovy/groovy-all/2.4.8/groovy-all-2.4.8.jar (7.0 MB at 3.7 MB/s)
[2019-10-26T17:22:37.487Z] [INFO] Installing C:\Users\jenkins\AppData\Local\Temp\2\jenkins-maven-box-maven-surefire-deployment-15\maven-surefire-common\dependency-reduced-pom.xml to C:\Users\jenkins\AppData\Local\Temp\2\jenkins-maven-box-maven-surefire-deployment-15\maven-failsafe-plugin\target\local-repo\org\apache\maven\surefire\maven-surefire-common\3.0.0-M4-SNAPSHOT\maven-surefire-common-3.0.0-M4-SNAPSHOT.pom
[2019-10-26T17:22:37.501Z] [INFO] Tests run: 8, Failures: 0, Errors: 0, Skipped: 0, Time elapsed: 54.892 s - in org.apache.maven.surefire.its.CheckTestNgListenerReporterIT
[2019-10-26T17:22:37.501Z] [INFO] Running org.apache.maven.surefire.its.CheckTestNgListenersIT
[2019-10-26T17:22:37.783Z] [INFO] Installing C:\Users\jenkins\AppData\Local\Temp\2\jenkins-maven-box-maven-surefire-deployment-15\maven-surefire-common\target\maven-surefire-common-3.0.0-M4-SNAPSHOT.jar to C:\Users\jenkins\AppData\Local\Temp\2\jenkins-maven-box-maven-surefire-deployment-15\maven-failsafe-plugin\target\local-repo\org\apache\maven\surefire\maven-surefire-common\3.0.0-M4-SNAPSHOT\maven-surefire-common-3.0.0-M4-SNAPSHOT.jar
[2019-10-26T17:22:37.783Z] [INFO] Installing C:\Users\jenkins\AppData\Local\Temp\2\jenkins-maven-box-maven-surefire-deployment-15\maven-surefire-common\dependency-reduced-pom.xml to C:\Users\jenkins\AppData\Local\Temp\2\jenkins-maven-box-maven-surefire-deployment-15\maven-failsafe-plugin\target\local-repo\org\apache\maven\surefire\maven-surefire-common\3.0.0-M4-SNAPSHOT\maven-surefire-common-3.0.0-M4-SNAPSHOT.pom
[2019-10-26T17:22:37.783Z] [INFO] Installing C:\Users\jenkins\AppData\Local\Temp\2\jenkins-maven-box-maven-surefire-deployment-15\pom.xml to C:\Users\jenkins\AppData\Local\Temp\2\jenkins-maven-box-maven-surefire-deployment-15\maven-failsafe-plugin\target\local-repo\org\apache\maven\surefire\surefire\3.0.0-M4-SNAPSHOT\surefire-3.0.0-M4-SNAPSHOT.pom
[2019-10-26T17:22:37.783Z] [INFO] Installing C:\Users\jenkins\AppData\Local\Temp\2\jenkins-maven-box-maven-surefire-deployment-15\surefire-booter\dependency-reduced-pom.xml to C:\Users\jenkins\AppData\Local\Temp\2\jenkins-maven-box-maven-surefire-deployment-15\maven-failsafe-plugin\target\local-repo\org\apache\maven\surefire\surefire-booter\3.0.0-M4-SNAPSHOT\surefire-booter-3.0.0-M4-SNAPSHOT.pom
[2019-10-26T17:22:37.783Z] [INFO] Installing C:\Users\jenkins\AppData\Local\Temp\2\jenkins-maven-box-maven-surefire-deployment-15\surefire-booter\target\surefire-booter-3.0.0-M4-SNAPSHOT.jar to C:\Users\jenkins\AppData\Local\Temp\2\jenkins-maven-box-maven-surefire-deployment-15\maven-failsafe-plugin\target\local-repo\org\apache\maven\surefire\surefire-booter\3.0.0-M4-SNAPSHOT\surefire-booter-3.0.0-M4-SNAPSHOT.jar
[2019-10-26T17:22:38.062Z] [INFO] Installing C:\Users\jenkins\AppData\Local\Temp\2\jenkins-maven-box-maven-surefire-deployment-15\surefire-booter\dependency-reduced-pom.xml to C:\Users\jenkins\AppData\Local\Temp\2\jenkins-maven-box-maven-surefire-deployment-15\maven-failsafe-plugin\target\local-repo\org\apache\maven\surefire\surefire-booter\3.0.0-M4-SNAPSHOT\surefire-booter-3.0.0-M4-SNAPSHOT.pom
[2019-10-26T17:22:38.062Z] [INFO] Installing C:\Users\jenkins\AppData\Local\Temp\2\jenkins-maven-box-maven-surefire-deployment-15\surefire-api\dependency-reduced-pom.xml to C:\Users\jenkins\AppData\Local\Temp\2\jenkins-maven-box-maven-surefire-deployment-15\maven-failsafe-plugin\target\local-repo\org\apache\maven\surefire\surefire-api\3.0.0-M4-SNAPSHOT\surefire-api-3.0.0-M4-SNAPSHOT.pom
[2019-10-26T17:22:38.062Z] [INFO] Installing C:\Users\jenkins\AppData\Local\Temp\2\jenkins-maven-box-maven-surefire-deployment-15\surefire-api\target\surefire-api-3.0.0-M4-SNAPSHOT.jar to C:\Users\jenkins\AppData\Local\Temp\2\jenkins-maven-box-maven-surefire-deployment-15\maven-failsafe-plugin\target\local-repo\org\apache\maven\surefire\surefire-api\3.0.0-M4-SNAPSHOT\surefire-api-3.0.0-M4-SNAPSHOT.jar
[2019-10-26T17:22:38.062Z] [INFO] Installing C:\Users\jenkins\AppData\Local\Temp\2\jenkins-maven-box-maven-surefire-deployment-15\surefire-api\dependency-reduced-pom.xml to C:\Users\jenkins\AppData\Local\Temp\2\jenkins-maven-box-maven-surefire-deployment-15\maven-failsafe-plugin\target\local-repo\org\apache\maven\surefire\surefire-api\3.0.0-M4-SNAPSHOT\surefire-api-3.0.0-M4-SNAPSHOT.pom
[2019-10-26T17:22:38.062Z] [INFO] Installing C:\Users\jenkins\AppData\Local\Temp\2\jenkins-maven-box-maven-surefire-deployment-15\surefire-logger-api\pom.xml to C:\Users\jenkins\AppData\Local\Temp\2\jenkins-maven-box-maven-surefire-deployment-15\maven-failsafe-plugin\target\local-repo\org\apache\maven\surefire\surefire-logger-api\3.0.0-M4-SNAPSHOT\surefire-logger-api-3.0.0-M4-SNAPSHOT.pom
[2019-10-26T17:22:38.349Z] [INFO] Installing C:\Users\jenkins\AppData\Local\Temp\2\jenkins-maven-box-maven-surefire-deployment-15\surefire-logger-api\target\surefire-logger-api-3.0.0-M4-SNAPSHOT.jar to C:\Users\jenkins\AppData\Local\Temp\2\jenkins-maven-box-maven-surefire-deployment-15\maven-failsafe-plugin\target\local-repo\org\apache\maven\surefire\surefire-logger-api\3.0.0-M4-SNAPSHOT\surefire-logger-api-3.0.0-M4-SNAPSHOT.jar
[2019-10-26T17:22:38.642Z] [INFO] Installing C:\Users\jenkins\AppData\Local\Temp\2\jenkins-maven-box-maven-surefire-deployment-15\surefire-logger-api\pom.xml to C:\Users\jenkins\AppData\Local\Temp\2\jenkins-maven-box-maven-surefire-deployment-15\maven-failsafe-plugin\target\local-repo\org\apache\maven\surefire\surefire-logger-api\3.0.0-M4-SNAPSHOT\surefire-logger-api-3.0.0-M4-SNAPSHOT.pom
[2019-10-26T17:22:38.642Z] [INFO] Installing C:\Users\jenkins\AppData\Local\Temp\2\jenkins-maven-box-maven-surefire-deployment-15\maven-surefire-plugin\pom.xml to C:\Users\jenkins\AppData\Local\Temp\2\jenkins-maven-box-maven-surefire-deployment-15\maven-failsafe-plugin\target\local-repo\org\apache\maven\plugins\maven-surefire-plugin\3.0.0-M4-SNAPSHOT\maven-surefire-plugin-3.0.0-M4-SNAPSHOT.pom
[2019-10-26T17:22:38.642Z] [INFO] Installing C:\Users\jenkins\AppData\Local\Temp\2\jenkins-maven-box-maven-surefire-deployment-15\maven-surefire-plugin\target\maven-surefire-plugin-3.0.0-M4-SNAPSHOT.jar to C:\Users\jenkins\AppData\Local\Temp\2\jenkins-maven-box-maven-surefire-deployment-15\maven-failsafe-plugin\target\local-repo\org\apache\maven\plugins\maven-surefire-plugin\3.0.0-M4-SNAPSHOT\maven-surefire-plugin-3.0.0-M4-SNAPSHOT.jar
[2019-10-26T17:22:38.642Z] [INFO] Installing C:\Users\jenkins\AppData\Local\Temp\2\jenkins-maven-box-maven-surefire-deployment-15\maven-surefire-plugin\pom.xml to C:\Users\jenkins\AppData\Local\Temp\2\jenkins-maven-box-maven-surefire-deployment-15\maven-failsafe-plugin\target\local-repo\org\apache\maven\plugins\maven-surefire-plugin\3.0.0-M4-SNAPSHOT\maven-surefire-plugin-3.0.0-M4-SNAPSHOT.pom
[2019-10-26T17:22:38.932Z] [INFO] Installing C:\Users\jenkins\AppData\Local\Temp\2\jenkins-maven-box-maven-surefire-deployment-15\maven-surefire-plugin\target\maven-surefire-plugin-3.0.0-M4-SNAPSHOT-site-source.zip to C:\Users\jenkins\AppData\Local\Temp\2\jenkins-maven-box-maven-surefire-deployment-15\maven-failsafe-plugin\target\local-repo\org\apache\maven\plugins\maven-surefire-plugin\3.0.0-M4-SNAPSHOT\maven-surefire-plugin-3.0.0-M4-SNAPSHOT-site-source.zip
[2019-10-26T17:22:38.932Z] [INFO] Installing C:\Users\jenkins\AppData\Local\Temp\2\jenkins-maven-box-maven-surefire-deployment-15\maven-failsafe-plugin\dependency-reduced-pom.xml to C:\Users\jenkins\AppData\Local\Temp\2\jenkins-maven-box-maven-surefire-deployment-15\maven-failsafe-plugin\target\local-repo\org\apache\maven\plugins\maven-failsafe-plugin\3.0.0-M4-SNAPSHOT\maven-failsafe-plugin-3.0.0-M4-SNAPSHOT.pom
[2019-10-26T17:22:38.932Z] [INFO] Installing C:\Users\jenkins\AppData\Local\Temp\2\jenkins-maven-box-maven-surefire-deployment-15\maven-failsafe-plugin\target\maven-failsafe-plugin-3.0.0-M4-SNAPSHOT.jar to C:\Users\jenkins\AppData\Local\Temp\2\jenkins-maven-box-maven-surefire-deployment-15\maven-failsafe-plugin\target\local-repo\org\apache\maven\plugins\maven-failsafe-plugin\3.0.0-M4-SNAPSHOT\maven-failsafe-plugin-3.0.0-M4-SNAPSHOT.jar
[2019-10-26T17:22:38.932Z] [INFO]
[2019-10-26T17:22:38.932Z] [INFO] --- maven-invoker-plugin:3.2.0:run (integration-test) @ maven-failsafe-plugin ---
[2019-10-26T17:22:39.533Z] [INFO] Building: jetty-war-test-failing\pom.xml
[2019-10-26T17:22:43.106Z] [INFO] Tests run: 1, Failures: 0, Errors: 0, Skipped: 0, Time elapsed: 6.3 s - in org.apache.maven.surefire.its.CheckTestNgListenersIT
[2019-10-26T17:22:43.106Z] [INFO] Running org.apache.maven.surefire.its.CheckTestNgPathWithSpacesIT
[2019-10-26T17:22:47.671Z] [INFO] Tests run: 8, Failures: 0, Errors: 0, Skipped: 0, Time elapsed: 59.428 s - in org.apache.maven.surefire.its.CheckTestNgListenerReporterIT
[2019-10-26T17:22:47.671Z] [INFO] Running org.apache.maven.surefire.its.CheckTestNgListenersIT
[2019-10-26T17:22:47.671Z] [INFO] Tests run: 1, Failures: 0, Errors: 0, Skipped: 0, Time elapsed: 6.348 s - in org.apache.maven.surefire.its.CheckTestNgListenersIT
[2019-10-26T17:22:47.671Z] [INFO] Running org.apache.maven.surefire.its.CheckTestNgPathWithSpacesIT
[2019-10-26T17:22:48.466Z] [INFO] Tests run: 1, Failures: 0, Errors: 0, Skipped: 0, Time elapsed: 5.683 s - in org.apache.maven.surefire.its.CheckTestNgPathWithSpacesIT
[2019-10-26T17:22:48.467Z] [INFO] Running org.apache.maven.surefire.its.CheckTestNgReportTestIT
[2019-10-26T17:22:51.033Z] [INFO] Tests run: 1, Failures: 0, Errors: 0, Skipped: 0, Time elapsed: 6.637 s - in org.apache.maven.surefire.its.CheckTestNgPathWithSpacesIT
[2019-10-26T17:22:51.033Z] [INFO] Running org.apache.maven.surefire.its.CheckTestNgReportTestIT
[2019-10-26T17:22:58.759Z] [WARNING] Tests run: 20, Failures: 0, Errors: 0, Skipped: 2, Time elapsed: 112.103 s - in org.apache.maven.surefire.its.CheckTestNgVersionsIT
[2019-10-26T17:22:58.759Z] [INFO] Running org.apache.maven.surefire.its.ClassPathOrderIT
[2019-10-26T17:23:03.028Z] [INFO] Tests run: 1, Failures: 0, Errors: 0, Skipped: 0, Time elapsed: 4.511 s - in org.apache.maven.surefire.its.ClassPathOrderIT
[2019-10-26T17:23:03.028Z] [INFO] Running org.apache.maven.surefire.its.ClasspathFilteringIT
Aborted by hboutemy
[2019-10-26T17:23:06.948Z] [INFO] Tests run: 3, Failures: 0, Errors: 0, Skipped: 0, Time elapsed: 18.122 s - in org.apache.maven.surefire.its.CheckTestNgReportTestIT
[2019-10-26T17:23:06.948Z] [INFO] Running org.apache.maven.surefire.its.CheckTestNgSuiteXmlIT
[2019-10-26T17:23:06.953Z] Sending interrupt signal to process
[2019-10-26T17:23:08.379Z] [INFO] Tests run: 1, Failures: 0, Errors: 0, Skipped: 0, Time elapsed: 5.388 s - in org.apache.maven.surefire.its.ClasspathFilteringIT
[2019-10-26T17:23:08.379Z] [INFO] Running org.apache.maven.surefire.its.ClasspathScopeFilteringIT
[2019-10-26T17:23:08.447Z] Sending interrupt signal to process
[2019-10-26T17:23:08.929Z] [INFO]
[2019-10-26T17:23:08.929Z] [INFO] Results:
[2019-10-26T17:23:08.929Z] [INFO]
[2019-10-26T17:23:08.929Z] [INFO] Tests run: 39, Failures: 0, Errors: 0, Skipped: 0
[2019-10-26T17:23:08.929Z] [INFO]
[2019-10-26T17:23:09.222Z] [INFO]
[2019-10-26T17:23:09.222Z] [INFO] --- maven-checkstyle-plugin:3.0.0:check (checkstyle-check) @ surefire-its ---
[2019-10-26T17:23:09.508Z] script returned exit code -1
[2019-10-26T17:23:09.551Z] Sending interrupt signal to process
[2019-10-26T17:23:09.909Z] Sending interrupt signal to process
[2019-10-26T17:23:10.992Z] Terminate batch job (Y/N)?
[2019-10-26T17:23:11.024Z] script returned exit code 1
[2019-10-26T17:23:11.411Z] Sending interrupt signal to process
[2019-10-26T17:23:11.535Z] Sending interrupt signal to process
[Pipeline] }
[Pipeline] }
[Pipeline] // withEnv
[Pipeline] // withEnv
[Pipeline] }
[Pipeline] }
[Pipeline] // stage
[Pipeline] // stage
[Pipeline] fileExists
[Pipeline] fileExists
[Pipeline] zip
[Pipeline] zip
[2019-10-26T17:23:11.918Z] Terminate batch job (Y/N)?
[2019-10-26T17:23:11.933Z] Writing zip file of C:\Users\jenkins\AppData\Local\Temp\2\jenkins-maven-box-maven-surefire-deployment-15\maven-failsafe-plugin\target\it to C:\Users\jenkins\AppData\Local\Temp\2\jenkins-maven-box-maven-surefire-deployment-15\maven-failsafe-plugin--windows-jdk12-maven3.6.x.zip
[2019-10-26T17:23:11.935Z] Writing zip file of C:\Users\jenkins\AppData\Local\Temp\3\jenkins-maven-box-maven-surefire-deployment-15@2\maven-failsafe-plugin\target\it to C:\Users\jenkins\AppData\Local\Temp\3\jenkins-maven-box-maven-surefire-deployment-15@2\maven-failsafe-plugin--windows-jdk8-maven3.6.x.zip
[2019-10-26T17:23:11.940Z] script returned exit code 1
[Pipeline] }
[Pipeline] // withEnv
[Pipeline] }
[Pipeline] // stage
[2019-10-26T17:23:12.785Z] Zipped 78 entries.
[2019-10-26T17:23:12.785Z] Archiving C:\Users\jenkins\AppData\Local\Temp\3\jenkins-maven-box-maven-surefire-deployment-15@2\maven-failsafe-plugin--windows-jdk8-maven3.6.x.zip
[2019-10-26T17:23:12.785Z] [Fast Archiver] No prior successful build to compare, so performing full copy of artifacts
[2019-10-26T17:23:12.797Z] Zipped 79 entries.
[2019-10-26T17:23:12.797Z] Archiving C:\Users\jenkins\AppData\Local\Temp\2\jenkins-maven-box-maven-surefire-deployment-15\maven-failsafe-plugin--windows-jdk12-maven3.6.x.zip
[2019-10-26T17:23:12.797Z] [Fast Archiver] No prior successful build to compare, so performing full copy of artifacts
[Pipeline] fileExists
[Pipeline] fileExists
[Pipeline] zip
[2019-10-26T17:23:12.851Z] Writing zip file of C:\Users\jenkins\AppData\Local\Temp\3\jenkins-maven-box-maven-surefire-deployment-15@2\surefire-its\target to C:\Users\jenkins\AppData\Local\Temp\3\jenkins-maven-box-maven-surefire-deployment-15@2\surefire-its--windows-jdk8-maven3.6.x.zip
[Pipeline] fileExists
[Pipeline] zip
[Pipeline] zip
[2019-10-26T17:23:12.941Z] Writing zip file of C:\Users\jenkins\AppData\Local\Temp\2\jenkins-maven-box-maven-surefire-deployment-15\maven-failsafe-plugin\target\it to C:\Users\jenkins\AppData\Local\Temp\2\jenkins-maven-box-maven-surefire-deployment-15\maven-failsafe-plugin--windows-jdk7-maven3.6.x.zip
[2019-10-26T17:23:12.972Z] Writing zip file of C:\Users\jenkins\AppData\Local\Temp\2\jenkins-maven-box-maven-surefire-deployment-15\surefire-its\target to C:\Users\jenkins\AppData\Local\Temp\2\jenkins-maven-box-maven-surefire-deployment-15\surefire-its--windows-jdk12-maven3.6.x.zip
[2019-10-26T17:23:13.075Z] Zipped 32 entries.
[2019-10-26T17:23:13.075Z] Archiving C:\Users\jenkins\AppData\Local\Temp\2\jenkins-maven-box-maven-surefire-deployment-15\maven-failsafe-plugin--windows-jdk7-maven3.6.x.zip
[2019-10-26T17:23:13.075Z] [Fast Archiver] No prior successful build to compare, so performing full copy of artifacts
[Pipeline] fileExists
[Pipeline] archiveArtifacts
[2019-10-26T17:23:13.134Z] Archiving artifacts
[2019-10-26T17:23:13.143Z] [Fast Archiver] No prior successful build to compare, so performing full copy of artifacts
[Pipeline] cleanWs
[2019-10-26T17:23:13.187Z] [WS-CLEANUP] Deleting project workspace...
[2019-10-26T17:23:13.187Z] [WS-CLEANUP] Deferred wipeout is used...
[2019-10-26T17:23:13.227Z] [WS-CLEANUP] done
[Pipeline] }
[Pipeline] // ws
[Pipeline] }
[2019-10-26T17:23:13.281Z] script returned exit code -1
[Pipeline] // timestamps
[Pipeline] }
[Pipeline] }
[Pipeline] // withEnv
[Pipeline] // node
[Pipeline] }
Failed in branch windows-jdk7-maven3.6.x
[Pipeline] }
[Pipeline] // stage
[Pipeline] fileExists
[Pipeline] zip
[2019-10-26T17:23:13.488Z] Writing zip file of C:\Users\jenkins\AppData\Local\Temp\3\jenkins-maven-box-maven-surefire-deployment-15\maven-failsafe-plugin\target\it to C:\Users\jenkins\AppData\Local\Temp\3\jenkins-maven-box-maven-surefire-deployment-15\maven-failsafe-plugin--windows-jdk11-maven3.6.x.zip
[2019-10-26T17:23:13.552Z] Zipped 80 entries.
[2019-10-26T17:23:13.552Z] Archiving C:\Users\jenkins\AppData\Local\Temp\3\jenkins-maven-box-maven-surefire-deployment-15\maven-failsafe-plugin--windows-jdk11-maven3.6.x.zip
[2019-10-26T17:23:13.553Z] [Fast Archiver] No prior successful build to compare, so performing full copy of artifacts
[Pipeline] fileExists
[Pipeline] zip
[2019-10-26T17:23:13.610Z] Writing zip file of C:\Users\jenkins\AppData\Local\Temp\3\jenkins-maven-box-maven-surefire-deployment-15\surefire-its\target to C:\Users\jenkins\AppData\Local\Temp\3\jenkins-maven-box-maven-surefire-deployment-15\surefire-its--windows-jdk11-maven3.6.x.zip
[2019-10-26T17:23:14.792Z] Zipped 2538 entries.
[2019-10-26T17:23:14.792Z] Archiving C:\Users\jenkins\AppData\Local\Temp\3\jenkins-maven-box-maven-surefire-deployment-15@2\surefire-its--windows-jdk8-maven3.6.x.zip
[2019-10-26T17:23:14.793Z] [Fast Archiver] No prior successful build to compare, so performing full copy of artifacts
[2019-10-26T17:23:14.832Z] Zipped 3260 entries.
[2019-10-26T17:23:14.833Z] Archiving C:\Users\jenkins\AppData\Local\Temp\2\jenkins-maven-box-maven-surefire-deployment-15\surefire-its--windows-jdk12-maven3.6.x.zip
[2019-10-26T17:23:14.833Z] [Fast Archiver] No prior successful build to compare, so performing full copy of artifacts
[Pipeline] archiveArtifacts
[2019-10-26T17:23:14.995Z] Archiving artifacts
[2019-10-26T17:23:15.022Z] [Fast Archiver] No prior successful build to compare, so performing full copy of artifacts
[Pipeline] archiveArtifacts
[2019-10-26T17:23:15.153Z] Archiving artifacts
[2019-10-26T17:23:15.162Z] [Fast Archiver] No prior successful build to compare, so performing full copy of artifacts
[Pipeline] cleanWs
[2019-10-26T17:23:15.252Z] [WS-CLEANUP] Deleting project workspace...
[2019-10-26T17:23:15.252Z] [WS-CLEANUP] Deferred wipeout is used...
[2019-10-26T17:23:15.293Z] [WS-CLEANUP] done
[Pipeline] }
[Pipeline] // ws
[Pipeline] }
[Pipeline] // timestamps
[Pipeline] }
[2019-10-26T17:23:15.417Z] Zipped 2511 entries.
[2019-10-26T17:23:15.417Z] Archiving C:\Users\jenkins\AppData\Local\Temp\3\jenkins-maven-box-maven-surefire-deployment-15\surefire-its--windows-jdk11-maven3.6.x.zip
[2019-10-26T17:23:15.417Z] [Fast Archiver] No prior successful build to compare, so performing full copy of artifacts
[Pipeline] // node
[Pipeline] }
Failed in branch windows-jdk8-maven3.6.x
[Pipeline] cleanWs
[2019-10-26T17:23:15.552Z] [WS-CLEANUP] Deleting project workspace...
[2019-10-26T17:23:15.552Z] [WS-CLEANUP] Deferred wipeout is used...
[2019-10-26T17:23:15.620Z] [WS-CLEANUP] done
[Pipeline] }
[Pipeline] // ws
[Pipeline] }
[Pipeline] // timestamps
[Pipeline] }
[Pipeline] // node
[Pipeline] }
Failed in branch windows-jdk12-maven3.6.x
[Pipeline] archiveArtifacts
[2019-10-26T17:23:15.761Z] Archiving artifacts
[2019-10-26T17:23:15.773Z] [Fast Archiver] No prior successful build to compare, so performing full copy of artifacts
[Pipeline] cleanWs
[2019-10-26T17:23:16.208Z] [WS-CLEANUP] Deleting project workspace...
[2019-10-26T17:23:16.209Z] [WS-CLEANUP] Deferred wipeout is used...
[2019-10-26T17:23:16.254Z] [WS-CLEANUP] done
[Pipeline] }
[Pipeline] // ws
[Pipeline] }
[Pipeline] // timestamps
[Pipeline] }
[Pipeline] // node
[Pipeline] }
Failed in branch windows-jdk11-maven3.6.x
[Pipeline] // parallel
[Pipeline] echo
org.jenkinsci.plugins.workflow.steps.FlowInterruptedException: org.jenkinsci.plugins.workflow.steps.FlowInterruptedException
[Pipeline] echo
Build result: FAILURE
[Pipeline] jiraIssueSelector
[Pipeline] echo
The authors of changes [rfscholte].
[Pipeline] echo
Sending email ...
[Pipeline] emailext
Build failed in Jenkins: Maven TLP » maven-surefire » deployment #14
Posted by Apache Jenkins Server <je...@builds.apache.org>.
See https://builds.apache.org/job/maven-box/job/maven-surefire/job/deployment/14/
No changes.
1 tests failed.
FAILED: org.apache.maven.surefire.its.JUnitPlatformEnginesIT.platform[1.4.0-SNAPSHOT]
Error Message:
Expected: <[\[DEBUG\] test\(compact\) classpath: test-classes classes junit-jupiter-engine-5\.4\.0-SNAPSHOT\.jar apiguardian-api-1\.0\.0\.jar junit-platform-engine-1\.4\.0-SNAPSHOT\.jar junit-platform-commons-1\.4\.0-SNAPSHOT\.jar opentest4j-1\.1\.1\.jar junit-jupiter-api-5\.4\.0-SNAPSHOT\.jar]>
but: was <[[DEBUG] test(compact) classpath: test-classes classes junit-jupiter-engine-5.4.0-SNAPSHOT.jar apiguardian-api-1.0.0.jar junit-platform-engine-1.4.0-SNAPSHOT.jar opentest4j-1.1.1.jar junit-platform-commons-1.4.0-SNAPSHOT.jar junit-jupiter-api-5.4.0-SNAPSHOT.jar]>
Stack Trace:
java.lang.AssertionError:
Expected: <[\[DEBUG\] test\(compact\) classpath: test-classes classes junit-jupiter-engine-5\.4\.0-SNAPSHOT\.jar apiguardian-api-1\.0\.0\.jar junit-platform-engine-1\.4\.0-SNAPSHOT\.jar junit-platform-commons-1\.4\.0-SNAPSHOT\.jar opentest4j-1\.1\.1\.jar junit-jupiter-api-5\.4\.0-SNAPSHOT\.jar]>
but: was <[[DEBUG] test(compact) classpath: test-classes classes junit-jupiter-engine-5.4.0-SNAPSHOT.jar apiguardian-api-1.0.0.jar junit-platform-engine-1.4.0-SNAPSHOT.jar opentest4j-1.1.1.jar junit-platform-commons-1.4.0-SNAPSHOT.jar junit-jupiter-api-5.4.0-SNAPSHOT.jar]>
at org.apache.maven.surefire.its.JUnitPlatformEnginesIT.platform(JUnitPlatformEnginesIT.java:111)
Build log:
[...truncated 47121 lines...]
[Pipeline] }
[2019-10-04T08:45:34.813Z] [INFO] Tests run: 1, Failures: 0, Errors: 0, Skipped: 0, Time elapsed: 4.226 s - in org.apache.maven.surefire.its.jiras.Surefire979WrongClassLoaderIT
[2019-10-04T08:45:34.813Z] [INFO] Running org.apache.maven.surefire.its.jiras.Surefire985ParameterizedRunnerAndCategoriesIT
[2019-10-04T08:45:36.320Z] [INFO] Tests run: 1, Failures: 0, Errors: 0, Skipped: 0, Time elapsed: 7.82 s - in org.apache.maven.surefire.its.jiras.Surefire930TestNgSuiteXmlIT
[2019-10-04T08:45:36.320Z] [INFO] Running org.apache.maven.surefire.its.jiras.Surefire943ReportContentIT
[2019-10-04T08:45:38.260Z] [INFO] Tests run: 1, Failures: 0, Errors: 0, Skipped: 0, Time elapsed: 3.513 s - in org.apache.maven.surefire.its.jiras.Surefire985ParameterizedRunnerAndCategoriesIT
[2019-10-04T08:45:38.260Z] [INFO] Running org.apache.maven.surefire.its.jiras.Surefire995CategoryInheritanceIT
[2019-10-04T08:45:57.386Z] [INFO] Tests run: 5, Failures: 0, Errors: 0, Skipped: 0, Time elapsed: 17.188 s - in org.apache.maven.surefire.its.jiras.Surefire995CategoryInheritanceIT
[2019-10-04T08:45:57.386Z] [INFO]
[2019-10-04T08:45:57.386Z] [INFO] Results:
[2019-10-04T08:45:57.386Z] [INFO]
[2019-10-04T08:45:57.386Z] [ERROR] Failures:
[2019-10-04T08:45:57.386Z] [ERROR] JUnitPlatformEnginesIT.platform:111
[2019-10-04T08:45:57.386Z] Expected: <[\[DEBUG\] test\(compact\) classpath: test-classes classes junit-jupiter-engine-5\.4\.0-SNAPSHOT\.jar apiguardian-api-1\.0\.0\.jar junit-platform-engine-1\.4\.0-SNAPSHOT\.jar junit-platform-commons-1\.4\.0-SNAPSHOT\.jar opentest4j-1\.1\.1\.jar junit-jupiter-api-5\.4\.0-SNAPSHOT\.jar]>
[2019-10-04T08:45:57.386Z] but: was <[[DEBUG] test(compact) classpath: test-classes classes junit-jupiter-engine-5.4.0-SNAPSHOT.jar apiguardian-api-1.0.0.jar junit-platform-engine-1.4.0-SNAPSHOT.jar opentest4j-1.1.1.jar junit-platform-commons-1.4.0-SNAPSHOT.jar junit-jupiter-api-5.4.0-SNAPSHOT.jar]>
[2019-10-04T08:45:57.386Z] [INFO]
[2019-10-04T08:45:57.386Z] [ERROR] Tests run: 788, Failures: 1, Errors: 0, Skipped: 143
[2019-10-04T08:45:57.386Z] [INFO]
[2019-10-04T08:45:57.386Z] [INFO]
[2019-10-04T08:45:57.386Z] [INFO] --- maven-checkstyle-plugin:3.0.0:check (checkstyle-check) @ surefire-its ---
[2019-10-04T08:45:57.386Z] [INFO]
[2019-10-04T08:45:57.386Z] [INFO] --- maven-failsafe-plugin:3.0.0-M3:verify (default) @ surefire-its ---
[2019-10-04T08:45:57.386Z] [INFO] Failsafe report directory: /home/jenkins/jenkins-slave/workspace/en-box_maven-surefire_deployment@2/surefire-its/target/failsafe-reports
[2019-10-04T08:45:57.386Z] [INFO] ------------------------------------------------------------------------
[2019-10-04T08:45:57.386Z] [INFO] Reactor Summary for Apache Maven Surefire 3.0.0-M4-SNAPSHOT:
[2019-10-04T08:45:57.386Z] [INFO]
[2019-10-04T08:45:57.386Z] [INFO] Apache Maven Surefire .............................. SUCCESS [ 18.297 s]
[2019-10-04T08:45:57.386Z] [INFO] SureFire Logger API ................................ SUCCESS [ 3.551 s]
[2019-10-04T08:45:57.386Z] [INFO] SureFire API ....................................... SUCCESS [ 8.401 s]
[2019-10-04T08:45:57.386Z] [INFO] SureFire Booter .................................... SUCCESS [ 10.019 s]
[2019-10-04T08:45:57.386Z] [INFO] Maven Surefire Test-Grouping Support ............... SUCCESS [ 4.632 s]
[2019-10-04T08:45:57.386Z] [INFO] SureFire Providers ................................. SUCCESS [ 0.850 s]
[2019-10-04T08:45:57.386Z] [INFO] Shared JUnit3 Provider Code ........................ SUCCESS [ 3.112 s]
[2019-10-04T08:45:57.386Z] [INFO] Shared Java 5 Provider Base ........................ SUCCESS [ 3.710 s]
[2019-10-04T08:45:57.386Z] [INFO] Shared JUnit4 Provider Code ........................ SUCCESS [ 3.716 s]
[2019-10-04T08:45:57.386Z] [INFO] Shared JUnit48 Provider Code ....................... SUCCESS [ 4.386 s]
[2019-10-04T08:45:57.386Z] [INFO] SureFire JUnit Runner .............................. SUCCESS [ 3.323 s]
[2019-10-04T08:45:57.386Z] [INFO] SureFire JUnit4 Runner ............................. SUCCESS [ 13.032 s]
[2019-10-04T08:45:57.386Z] [INFO] Maven Surefire Common .............................. SUCCESS [ 22.416 s]
[2019-10-04T08:45:57.386Z] [INFO] SureFire JUnitCore Runner .......................... SUCCESS [02:12 min]
[2019-10-04T08:45:57.386Z] [INFO] SureFire JUnit Platform Runner ..................... SUCCESS [ 7.599 s]
[2019-10-04T08:45:57.386Z] [INFO] SureFire TestNG Utils .............................. SUCCESS [ 3.474 s]
[2019-10-04T08:45:57.386Z] [INFO] SureFire TestNG Runner ............................. SUCCESS [ 3.991 s]
[2019-10-04T08:45:57.386Z] [INFO] ShadeFire JUnit3 Provider .......................... SUCCESS [ 1.325 s]
[2019-10-04T08:45:57.386Z] [INFO] Surefire Report Parser ............................. SUCCESS [ 4.701 s]
[2019-10-04T08:45:57.386Z] [INFO] Maven Surefire Plugin .............................. SUCCESS [ 8.533 s]
[2019-10-04T08:45:57.386Z] [INFO] Maven Failsafe Plugin .............................. SUCCESS [ 50.661 s]
[2019-10-04T08:45:57.386Z] [INFO] Maven Surefire Report Plugin ....................... SUCCESS [ 11.629 s]
[2019-10-04T08:45:57.386Z] [INFO] Maven Surefire Integration Tests ................... FAILURE [55:58 min]
[2019-10-04T08:45:57.386Z] [INFO] ------------------------------------------------------------------------
[2019-10-04T08:45:57.386Z] [INFO] BUILD FAILURE
[2019-10-04T08:45:57.386Z] [INFO] ------------------------------------------------------------------------
[2019-10-04T08:45:57.386Z] [INFO] Total time: 01:01 h
[2019-10-04T08:45:57.386Z] [INFO] Finished at: 2019-10-04T08:45:55Z
[2019-10-04T08:45:57.386Z] [INFO] ------------------------------------------------------------------------
[2019-10-04T08:45:57.386Z] [ERROR] Failed to execute goal org.apache.maven.plugins:maven-failsafe-plugin:3.0.0-M3:verify (default) on project surefire-its: There are test failures.
[2019-10-04T08:45:57.386Z] [ERROR]
[2019-10-04T08:45:57.386Z] [ERROR] Please refer to /home/jenkins/jenkins-slave/workspace/en-box_maven-surefire_deployment@2/surefire-its/target/failsafe-reports for the individual test results.
[2019-10-04T08:45:57.386Z] [ERROR] Please refer to dump files (if any exist) [date].dump, [date]-jvmRun[N].dump and [date].dumpstream.
[2019-10-04T08:45:57.386Z] [ERROR] -> [Help 1]
[2019-10-04T08:45:57.387Z] org.apache.maven.lifecycle.LifecycleExecutionException: Failed to execute goal org.apache.maven.plugins:maven-failsafe-plugin:3.0.0-M3:verify (default) on project surefire-its: There are test failures.
[2019-10-04T08:45:57.387Z]
[2019-10-04T08:45:57.387Z] Please refer to /home/jenkins/jenkins-slave/workspace/en-box_maven-surefire_deployment@2/surefire-its/target/failsafe-reports for the individual test results.
[2019-10-04T08:45:57.387Z] Please refer to dump files (if any exist) [date].dump, [date]-jvmRun[N].dump and [date].dumpstream.
[2019-10-04T08:45:57.387Z] at org.apache.maven.lifecycle.internal.MojoExecutor.execute (MojoExecutor.java:215)
[2019-10-04T08:45:57.387Z] at org.apache.maven.lifecycle.internal.MojoExecutor.execute (MojoExecutor.java:156)
[2019-10-04T08:45:57.387Z] at org.apache.maven.lifecycle.internal.MojoExecutor.execute (MojoExecutor.java:148)
[2019-10-04T08:45:57.387Z] at org.apache.maven.lifecycle.internal.LifecycleModuleBuilder.buildProject (LifecycleModuleBuilder.java:117)
[2019-10-04T08:45:57.387Z] at org.apache.maven.lifecycle.internal.LifecycleModuleBuilder.buildProject (LifecycleModuleBuilder.java:81)
[2019-10-04T08:45:57.387Z] at org.apache.maven.lifecycle.internal.builder.singlethreaded.SingleThreadedBuilder.build (SingleThreadedBuilder.java:56)
[2019-10-04T08:45:57.387Z] at org.apache.maven.lifecycle.internal.LifecycleStarter.execute (LifecycleStarter.java:128)
[2019-10-04T08:45:57.387Z] at org.apache.maven.DefaultMaven.doExecute (DefaultMaven.java:305)
[2019-10-04T08:45:57.387Z] at org.apache.maven.DefaultMaven.doExecute (DefaultMaven.java:192)
[2019-10-04T08:45:57.387Z] at org.apache.maven.DefaultMaven.execute (DefaultMaven.java:105)
[2019-10-04T08:45:57.387Z] at org.apache.maven.cli.MavenCli.execute (MavenCli.java:956)
[2019-10-04T08:45:57.387Z] at org.apache.maven.cli.MavenCli.doMain (MavenCli.java:288)
[2019-10-04T08:45:57.387Z] at org.apache.maven.cli.MavenCli.main (MavenCli.java:192)
[2019-10-04T08:45:57.387Z] at sun.reflect.NativeMethodAccessorImpl.invoke0 (Native Method)
[2019-10-04T08:45:57.387Z] at sun.reflect.NativeMethodAccessorImpl.invoke (NativeMethodAccessorImpl.java:62)
[2019-10-04T08:45:57.387Z] at sun.reflect.DelegatingMethodAccessorImpl.invoke (DelegatingMethodAccessorImpl.java:43)
[2019-10-04T08:45:57.387Z] at java.lang.reflect.Method.invoke (Method.java:498)
[2019-10-04T08:45:57.387Z] at org.codehaus.plexus.classworlds.launcher.Launcher.launchEnhanced (Launcher.java:289)
[2019-10-04T08:45:57.387Z] at org.codehaus.plexus.classworlds.launcher.Launcher.launch (Launcher.java:229)
[2019-10-04T08:45:57.387Z] at org.codehaus.plexus.classworlds.launcher.Launcher.mainWithExitCode (Launcher.java:415)
[2019-10-04T08:45:57.387Z] at org.codehaus.plexus.classworlds.launcher.Launcher.main (Launcher.java:356)
[2019-10-04T08:45:57.387Z] Caused by: org.apache.maven.plugin.MojoFailureException: There are test failures.
[2019-10-04T08:45:57.387Z]
[2019-10-04T08:45:57.387Z] Please refer to /home/jenkins/jenkins-slave/workspace/en-box_maven-surefire_deployment@2/surefire-its/target/failsafe-reports for the individual test results.
[2019-10-04T08:45:57.387Z] Please refer to dump files (if any exist) [date].dump, [date]-jvmRun[N].dump and [date].dumpstream.
[2019-10-04T08:45:57.387Z] at org.apache.maven.plugin.surefire.SurefireHelper.throwException (SurefireHelper.java:271)
[2019-10-04T08:45:57.387Z] at org.apache.maven.plugin.surefire.SurefireHelper.reportExecution (SurefireHelper.java:159)
[2019-10-04T08:45:57.387Z] at org.apache.maven.plugin.failsafe.VerifyMojo.execute (VerifyMojo.java:192)
[2019-10-04T08:45:57.387Z] at org.apache.maven.plugin.DefaultBuildPluginManager.executeMojo (DefaultBuildPluginManager.java:137)
[2019-10-04T08:45:57.387Z] at org.apache.maven.lifecycle.internal.MojoExecutor.execute (MojoExecutor.java:210)
[2019-10-04T08:45:57.387Z] at org.apache.maven.lifecycle.internal.MojoExecutor.execute (MojoExecutor.java:156)
[2019-10-04T08:45:57.387Z] at org.apache.maven.lifecycle.internal.MojoExecutor.execute (MojoExecutor.java:148)
[2019-10-04T08:45:57.387Z] at org.apache.maven.lifecycle.internal.LifecycleModuleBuilder.buildProject (LifecycleModuleBuilder.java:117)
[2019-10-04T08:45:57.387Z] at org.apache.maven.lifecycle.internal.LifecycleModuleBuilder.buildProject (LifecycleModuleBuilder.java:81)
[2019-10-04T08:45:57.387Z] at org.apache.maven.lifecycle.internal.builder.singlethreaded.SingleThreadedBuilder.build (SingleThreadedBuilder.java:56)
[2019-10-04T08:45:57.387Z] at org.apache.maven.lifecycle.internal.LifecycleStarter.execute (LifecycleStarter.java:128)
[2019-10-04T08:45:57.387Z] at org.apache.maven.DefaultMaven.doExecute (DefaultMaven.java:305)
[2019-10-04T08:45:57.387Z] at org.apache.maven.DefaultMaven.doExecute (DefaultMaven.java:192)
[2019-10-04T08:45:57.387Z] at org.apache.maven.DefaultMaven.execute (DefaultMaven.java:105)
[2019-10-04T08:45:57.387Z] at org.apache.maven.cli.MavenCli.execute (MavenCli.java:956)
[2019-10-04T08:45:57.387Z] at org.apache.maven.cli.MavenCli.doMain (MavenCli.java:288)
[2019-10-04T08:45:57.387Z] at org.apache.maven.cli.MavenCli.main (MavenCli.java:192)
[2019-10-04T08:45:57.387Z] at sun.reflect.NativeMethodAccessorImpl.invoke0 (Native Method)
[2019-10-04T08:45:57.387Z] at sun.reflect.NativeMethodAccessorImpl.invoke (NativeMethodAccessorImpl.java:62)
[2019-10-04T08:45:57.387Z] at sun.reflect.DelegatingMethodAccessorImpl.invoke (DelegatingMethodAccessorImpl.java:43)
[2019-10-04T08:45:57.387Z] at java.lang.reflect.Method.invoke (Method.java:498)
[2019-10-04T08:45:57.387Z] at org.codehaus.plexus.classworlds.launcher.Launcher.launchEnhanced (Launcher.java:289)
[2019-10-04T08:45:57.387Z] at org.codehaus.plexus.classworlds.launcher.Launcher.launch (Launcher.java:229)
[2019-10-04T08:45:57.387Z] at org.codehaus.plexus.classworlds.launcher.Launcher.mainWithExitCode (Launcher.java:415)
[2019-10-04T08:45:57.387Z] at org.codehaus.plexus.classworlds.launcher.Launcher.main (Launcher.java:356)
[2019-10-04T08:45:57.387Z] [ERROR]
[2019-10-04T08:45:57.387Z] [ERROR] Re-run Maven using the -X switch to enable full debug logging.
[2019-10-04T08:45:57.387Z] [ERROR]
[2019-10-04T08:45:57.387Z] [ERROR] For more information about the errors and possible solutions, please read the following articles:
[2019-10-04T08:45:57.387Z] [ERROR] [Help 1] http://cwiki.apache.org/confluence/display/MAVEN/MojoFailureException
[2019-10-04T08:45:57.387Z] [ERROR]
[2019-10-04T08:45:57.387Z] [ERROR] After correcting the problems, you can resume the build with the command
[2019-10-04T08:45:57.387Z] [ERROR] mvn <goals> -rf :surefire-its
[Pipeline] }
[Pipeline] // withEnv
[Pipeline] }
[Pipeline] // stage
[Pipeline] fileExists
[Pipeline] zip
[2019-10-04T08:45:58.414Z] Writing zip file of /home/jenkins/jenkins-slave/workspace/en-box_maven-surefire_deployment@2/maven-failsafe-plugin/target/it to /home/jenkins/jenkins-slave/workspace/en-box_maven-surefire_deployment@2/maven-failsafe-plugin--linux-jdk8-maven3.6.x.zip
[2019-10-04T08:45:58.597Z] Zipped 78 entries.
[2019-10-04T08:45:58.598Z] Archiving /home/jenkins/jenkins-slave/workspace/en-box_maven-surefire_deployment@2/maven-failsafe-plugin--linux-jdk8-maven3.6.x.zip
[2019-10-04T08:45:58.598Z] [Fast Archiver] No prior successful build to compare, so performing full copy of artifacts
[Pipeline] fileExists
[Pipeline] zip
[2019-10-04T08:45:59.397Z] Writing zip file of /home/jenkins/jenkins-slave/workspace/en-box_maven-surefire_deployment@2/surefire-its/target to /home/jenkins/jenkins-slave/workspace/en-box_maven-surefire_deployment@2/surefire-its--linux-jdk8-maven3.6.x.zip
[2019-10-04T08:46:05.095Z] Zipped 16159 entries.
[2019-10-04T08:46:05.095Z] Archiving /home/jenkins/jenkins-slave/workspace/en-box_maven-surefire_deployment@2/surefire-its--linux-jdk8-maven3.6.x.zip
[2019-10-04T08:46:05.096Z] [Fast Archiver] No prior successful build to compare, so performing full copy of artifacts
[Pipeline] archiveArtifacts
[2019-10-04T08:46:07.150Z] Archiving artifacts
[2019-10-04T08:46:07.306Z] [Fast Archiver] No prior successful build to compare, so performing full copy of artifacts
[2019-10-04T08:46:08.704Z] [INFO] Tests run: 2, Failures: 0, Errors: 0, Skipped: 0, Time elapsed: 28.937 s - in org.apache.maven.surefire.its.jiras.Surefire943ReportContentIT
[2019-10-04T08:46:08.704Z] [INFO] Running org.apache.maven.surefire.its.jiras.Surefire946KillMainProcessInReusableForkIT
[Pipeline] cleanWs
[2019-10-04T08:46:09.366Z] [WS-CLEANUP] Deleting project workspace...
[2019-10-04T08:46:09.366Z] [WS-CLEANUP] Deferred wipeout is used...
[2019-10-04T08:46:09.679Z] [WS-CLEANUP] done
[Pipeline] }
[Pipeline] // ws
[Pipeline] }
[Pipeline] // timestamps
[Pipeline] }
[Pipeline] // node
[Pipeline] }
[2019-10-04T08:46:30.785Z] [INFO] Tests run: 3, Failures: 0, Errors: 0, Skipped: 0, Time elapsed: 22.944 s - in org.apache.maven.surefire.its.jiras.Surefire946KillMainProcessInReusableForkIT
[2019-10-04T08:46:30.785Z] [INFO] Running org.apache.maven.surefire.its.jiras.Surefire972BizarreNoClassDefIT
[2019-10-04T08:46:37.916Z] [INFO] Tests run: 1, Failures: 0, Errors: 0, Skipped: 0, Time elapsed: 10.295 s - in org.apache.maven.surefire.its.jiras.Surefire972BizarreNoClassDefIT
[2019-10-04T08:46:37.916Z] [INFO] Running org.apache.maven.surefire.its.jiras.Surefire975DefaultVMEncodingIT
[2019-10-04T08:46:46.176Z] [INFO] Tests run: 1, Failures: 0, Errors: 0, Skipped: 0, Time elapsed: 6.975 s - in org.apache.maven.surefire.its.jiras.Surefire975DefaultVMEncodingIT
[2019-10-04T08:46:46.176Z] [INFO] Running org.apache.maven.surefire.its.jiras.Surefire979WrongClassLoaderIT
[2019-10-04T08:46:50.007Z] [INFO] Tests run: 1, Failures: 0, Errors: 0, Skipped: 0, Time elapsed: 5.04 s - in org.apache.maven.surefire.its.jiras.Surefire979WrongClassLoaderIT
[2019-10-04T08:46:50.007Z] [INFO] Running org.apache.maven.surefire.its.jiras.Surefire985ParameterizedRunnerAndCategoriesIT
[2019-10-04T08:46:53.607Z] [INFO] Tests run: 1, Failures: 0, Errors: 0, Skipped: 0, Time elapsed: 3.81 s - in org.apache.maven.surefire.its.jiras.Surefire985ParameterizedRunnerAndCategoriesIT
[2019-10-04T08:46:53.607Z] [INFO] Running org.apache.maven.surefire.its.jiras.Surefire995CategoryInheritanceIT
[2019-10-04T08:47:15.780Z] [INFO] Tests run: 5, Failures: 0, Errors: 0, Skipped: 0, Time elapsed: 18.963 s - in org.apache.maven.surefire.its.jiras.Surefire995CategoryInheritanceIT
[2019-10-04T08:47:15.780Z] [INFO]
[2019-10-04T08:47:15.780Z] [INFO] Results:
[2019-10-04T08:47:15.780Z] [INFO]
[2019-10-04T08:47:15.780Z] [WARNING] Tests run: 788, Failures: 0, Errors: 0, Skipped: 169
[2019-10-04T08:47:15.780Z] [INFO]
[2019-10-04T08:47:15.780Z] [INFO]
[2019-10-04T08:47:15.780Z] [INFO] --- maven-checkstyle-plugin:3.0.0:check (checkstyle-check) @ surefire-its ---
[2019-10-04T08:47:15.780Z] [INFO]
[2019-10-04T08:47:15.780Z] [INFO] --- maven-failsafe-plugin:3.0.0-M3:verify (default) @ surefire-its ---
[2019-10-04T08:47:15.780Z] [INFO] Failsafe report directory: C:\Users\jenkins\AppData\Local\Temp\3\jenkins-maven-box-maven-surefire-deployment-14\surefire-its\target\failsafe-reports
[2019-10-04T08:47:15.780Z] [INFO]
[2019-10-04T08:47:15.780Z] [INFO] --- maven-install-plugin:2.5.2:install (default-install) @ surefire-its ---
[2019-10-04T08:47:15.780Z] [INFO] Skipping artifact installation
[2019-10-04T08:47:15.780Z] [INFO] ------------------------------------------------------------------------
[2019-10-04T08:47:15.780Z] [INFO] Reactor Summary for Apache Maven Surefire 3.0.0-M4-SNAPSHOT:
[2019-10-04T08:47:15.780Z] [INFO]
[2019-10-04T08:47:15.780Z] [INFO] Apache Maven Surefire .............................. SUCCESS [01:26 min]
[2019-10-04T08:47:15.780Z] [INFO] SureFire Logger API ................................ SUCCESS [ 11.324 s]
[2019-10-04T08:47:15.780Z] [INFO] SureFire API ....................................... SUCCESS [ 22.312 s]
[2019-10-04T08:47:15.780Z] [INFO] SureFire Booter .................................... SUCCESS [ 25.058 s]
[2019-10-04T08:47:15.780Z] [INFO] Maven Surefire Test-Grouping Support ............... SUCCESS [ 13.606 s]
[2019-10-04T08:47:15.780Z] [INFO] SureFire Providers ................................. SUCCESS [ 1.646 s]
[2019-10-04T08:47:15.780Z] [INFO] Shared JUnit3 Provider Code ........................ SUCCESS [ 6.521 s]
[2019-10-04T08:47:15.780Z] [INFO] Shared Java 5 Provider Base ........................ SUCCESS [ 9.183 s]
[2019-10-04T08:47:15.780Z] [INFO] Shared JUnit4 Provider Code ........................ SUCCESS [ 7.813 s]
[2019-10-04T08:47:15.780Z] [INFO] Shared JUnit48 Provider Code ....................... SUCCESS [ 8.369 s]
[2019-10-04T08:47:15.780Z] [INFO] SureFire JUnit Runner .............................. SUCCESS [ 5.585 s]
[2019-10-04T08:47:15.780Z] [INFO] SureFire JUnit4 Runner ............................. SUCCESS [ 15.061 s]
[2019-10-04T08:47:15.780Z] [INFO] Maven Surefire Common .............................. SUCCESS [ 36.277 s]
[2019-10-04T08:47:15.780Z] [INFO] SureFire JUnitCore Runner .......................... SUCCESS [02:34 min]
[2019-10-04T08:47:15.780Z] [INFO] SureFire JUnit Platform Runner ..................... SUCCESS [ 12.525 s]
[2019-10-04T08:47:15.780Z] [INFO] SureFire TestNG Utils .............................. SUCCESS [ 6.023 s]
[2019-10-04T08:47:15.780Z] [INFO] SureFire TestNG Runner ............................. SUCCESS [ 7.526 s]
[2019-10-04T08:47:15.780Z] [INFO] ShadeFire JUnit3 Provider .......................... SUCCESS [ 3.685 s]
[2019-10-04T08:47:15.780Z] [INFO] Surefire Report Parser ............................. SUCCESS [ 8.900 s]
[2019-10-04T08:47:15.780Z] [INFO] Maven Surefire Plugin .............................. SUCCESS [ 18.363 s]
[2019-10-04T08:47:15.780Z] [INFO] Maven Failsafe Plugin .............................. SUCCESS [02:06 min]
[2019-10-04T08:47:15.780Z] [INFO] Maven Surefire Report Plugin ....................... SUCCESS [ 21.866 s]
[2019-10-04T08:47:15.780Z] [INFO] Maven Surefire Integration Tests ................... SUCCESS [ 01:07 h]
[2019-10-04T08:47:15.780Z] [INFO] ------------------------------------------------------------------------
[2019-10-04T08:47:15.780Z] [INFO] BUILD SUCCESS
[2019-10-04T08:47:15.780Z] [INFO] ------------------------------------------------------------------------
[2019-10-04T08:47:15.780Z] [INFO] Total time: 01:17 h
[2019-10-04T08:47:15.780Z] [INFO] Finished at: 2019-10-04T01:47:14-07:00
[2019-10-04T08:47:15.780Z] [INFO] ------------------------------------------------------------------------
[Pipeline] }
[Pipeline] // withEnv
[Pipeline] }
[Pipeline] // stage
[Pipeline] fileExists
[Pipeline] zip
[2019-10-04T08:47:16.218Z] Writing zip file of C:\Users\jenkins\AppData\Local\Temp\3\jenkins-maven-box-maven-surefire-deployment-14\maven-failsafe-plugin\target\it to C:\Users\jenkins\AppData\Local\Temp\3\jenkins-maven-box-maven-surefire-deployment-14\maven-failsafe-plugin--windows-jdk7-maven3.6.x.zip
[2019-10-04T08:47:16.372Z] Zipped 78 entries.
[2019-10-04T08:47:16.372Z] Archiving C:\Users\jenkins\AppData\Local\Temp\3\jenkins-maven-box-maven-surefire-deployment-14\maven-failsafe-plugin--windows-jdk7-maven3.6.x.zip
[2019-10-04T08:47:16.372Z] [Fast Archiver] No prior successful build to compare, so performing full copy of artifacts
[Pipeline] fileExists
[Pipeline] zip
[2019-10-04T08:47:16.456Z] Writing zip file of C:\Users\jenkins\AppData\Local\Temp\3\jenkins-maven-box-maven-surefire-deployment-14\surefire-its\target to C:\Users\jenkins\AppData\Local\Temp\3\jenkins-maven-box-maven-surefire-deployment-14\surefire-its--windows-jdk7-maven3.6.x.zip
[2019-10-04T08:47:27.874Z] Zipped 15819 entries.
[2019-10-04T08:47:27.874Z] Archiving C:\Users\jenkins\AppData\Local\Temp\3\jenkins-maven-box-maven-surefire-deployment-14\surefire-its--windows-jdk7-maven3.6.x.zip
[2019-10-04T08:47:27.875Z] [Fast Archiver] No prior successful build to compare, so performing full copy of artifacts
[Pipeline] archiveArtifacts
[2019-10-04T08:47:29.715Z] Archiving artifacts
[2019-10-04T08:47:29.730Z] [Fast Archiver] No prior successful build to compare, so performing full copy of artifacts
[Pipeline] cleanWs
[2019-10-04T08:47:31.488Z] [WS-CLEANUP] Deleting project workspace...
[2019-10-04T08:47:31.488Z] [WS-CLEANUP] Deferred wipeout is used...
[2019-10-04T08:47:31.930Z] [WS-CLEANUP] done
[Pipeline] }
[Pipeline] // ws
[Pipeline] }
[Pipeline] // timestamps
[Pipeline] }
[Pipeline] // node
[Pipeline] }
[Pipeline] // parallel
[Pipeline] echo
Build result: FAILURE
[Pipeline] jiraIssueSelector
[Pipeline] echo
The authors of changes [].
[Pipeline] echo
Sending email ...
[Pipeline] emailext