You are viewing a plain text version of this content. The canonical link for it is here.
Posted to builds@beam.apache.org by Apache Jenkins Server <je...@builds.apache.org> on 2022/12/26 12:27:29 UTC
Build failed in Jenkins: beam_PostCommit_Python_Examples_Direct #1287
See <https://ci-beam.apache.org/job/beam_PostCommit_Python_Examples_Direct/1287/display/redirect>
Changes:
------------------------------------------
[...truncated 577.01 KB...]
apache_beam/examples/cookbook/bigquery_tornadoes_it_test.py::BigqueryTornadoesIT::test_bigquery_tornadoes_it
apache_beam/examples/cookbook/filters_test.py::FiltersTest::test_filters_output_bigquery_matcher
apache_beam/examples/dataframe/flight_delays_it_test.py::FlightDelaysTest::test_flight_delays
<https://ci-beam.apache.org/job/beam_PostCommit_Python_Examples_Direct/ws/src/sdks/python/apache_beam/io/gcp/bigquery.py>:2487: BeamDeprecationWarning: options is deprecated since First stable release. References to <pipeline>.options will not be supported
job_name = pcoll.pipeline.options.view_as(GoogleCloudOptions).job_name
apache_beam/examples/cookbook/bigquery_side_input_it_test.py::BigQuerySideInputIT::test_bigquery_side_input_it
apache_beam/examples/cookbook/bigquery_side_input_it_test.py::BigQuerySideInputIT::test_bigquery_side_input_it
apache_beam/examples/cookbook/bigquery_tornadoes_it_test.py::BigqueryTornadoesIT::test_bigquery_tornadoes_it
apache_beam/examples/cookbook/filters_test.py::FiltersTest::test_filters_output_bigquery_matcher
apache_beam/examples/dataframe/flight_delays_it_test.py::FlightDelaysTest::test_flight_delays
<https://ci-beam.apache.org/job/beam_PostCommit_Python_Examples_Direct/ws/src/sdks/python/apache_beam/io/gcp/bigquery.py>:2511: BeamDeprecationWarning: options is deprecated since First stable release. References to <pipeline>.options will not be supported
pipeline_options=pcoll.pipeline.options,
apache_beam/examples/cookbook/bigquery_tornadoes_it_test.py::BigqueryTornadoesIT::test_bigquery_tornadoes_it
apache_beam/examples/cookbook/filters_test.py::FiltersTest::test_filters_output_bigquery_matcher
<https://ci-beam.apache.org/job/beam_PostCommit_Python_Examples_Direct/ws/src/sdks/python/apache_beam/io/gcp/bigquery.py>:1988: BeamDeprecationWarning: options is deprecated since First stable release. References to <pipeline>.options will not be supported
self.table_reference.projectId = pcoll.pipeline.options.view_as(
apache_beam/examples/cookbook/bigquery_tornadoes_it_test.py::BigqueryTornadoesIT::test_bigquery_tornadoes_it
apache_beam/examples/cookbook/filters_test.py::FiltersTest::test_filters_output_bigquery_matcher
<https://ci-beam.apache.org/job/beam_PostCommit_Python_Examples_Direct/ws/src/sdks/python/apache_beam/io/gcp/bigquery_file_loads.py>:1166: BeamDeprecationWarning: options is deprecated since First stable release. References to <pipeline>.options will not be supported
self.project = self.project or p.options.view_as(GoogleCloudOptions).project
apache_beam/examples/cookbook/bigquery_tornadoes_it_test.py::BigqueryTornadoesIT::test_bigquery_tornadoes_it
apache_beam/examples/cookbook/filters_test.py::FiltersTest::test_filters_output_bigquery_matcher
<https://ci-beam.apache.org/job/beam_PostCommit_Python_Examples_Direct/ws/src/sdks/python/apache_beam/io/gcp/tests/utils.py>:100: PendingDeprecationWarning: Client.dataset is deprecated and will be removed in a future version. Use a string like 'my_project.my_dataset' or a cloud.google.bigquery.DatasetReference object, instead.
table_ref = client.dataset(dataset_id).table(table_id)
apache_beam/examples/dataframe/flight_delays_it_test.py: 46 warnings
<https://ci-beam.apache.org/job/beam_PostCommit_Python_Examples_Direct/ws/src/sdks/python/apache_beam/examples/dataframe/flight_delays.py>:47: FutureWarning: The default value of numeric_only in DataFrame.mean is deprecated. In a future version, it will default to False. In addition, specifying 'numeric_only=None' is deprecated. Select only valid columns or specify the value of numeric_only to silence this warning.
return airline_df[at_top_airports].mean()
apache_beam/examples/dataframe/flight_delays_it_test.py::FlightDelaysTest::test_flight_delays
apache_beam/examples/dataframe/wordcount_test.py::WordCountTest::test_basics
<https://ci-beam.apache.org/job/beam_PostCommit_Python_Examples_Direct/ws/src/sdks/python/apache_beam/dataframe/io.py>:659: FutureWarning: WriteToFiles is experimental.
return pcoll | fileio.WriteToFiles(
apache_beam/examples/dataframe/flight_delays_it_test.py::FlightDelaysTest::test_flight_delays
apache_beam/examples/dataframe/wordcount_test.py::WordCountTest::test_basics
<https://ci-beam.apache.org/job/beam_PostCommit_Python_Examples_Direct/ws/src/sdks/python/apache_beam/io/fileio.py>:591: BeamDeprecationWarning: options is deprecated since First stable release. References to <pipeline>.options will not be supported
p.options.view_as(GoogleCloudOptions).temp_location or
-- Docs: https://docs.pytest.org/en/stable/how-to/capture-warnings.html
- generated xml file: <https://ci-beam.apache.org/job/beam_PostCommit_Python_Examples_Direct/ws/src/sdks/python/pytest_postCommitExamples-direct-py39.xml> -
=== 22 passed, 6 skipped, 6772 deselected, 89 warnings in 208.07s (0:03:28) ====
> Task :sdks:python:test-suites:direct:py310:examples
INFO root:bigquery_tools.py:635 Job status: DONE
INFO apache_beam.io.gcp.bigquery_tools:bigquery_tools.py:562 Started BigQuery job: <JobReference
jobId: 'beam_bq_job_EXPORT_BQ_EXPORT_JOB_e6f33d87-d_1672057628_727'
location: 'US'
projectId: 'apache-beam-testing'>
bq show -j --format=prettyjson --project_id=apache-beam-testing beam_bq_job_EXPORT_BQ_EXPORT_JOB_e6f33d87-d_1672057628_727
INFO root:bigquery_tools.py:635 Job status: RUNNING
INFO root:bigquery_tools.py:635 Job status: DONE
INFO apache_beam.io.gcp.gcsio:gcsio.py:644 Finished listing 1 files in 0.04063820838928223 seconds.
INFO apache_beam.io.gcp.gcsio:gcsio.py:644 Finished listing 1 files in 0.02838134765625 seconds.
INFO apache_beam.io.fileio:fileio.py:692 Moving temporary files <map object at 0x7fbd32c4c490> to dir: gs://temp-storage-for-end-to-end-tests/temp-it/flight_delays_it-19356b3f-c40a-46a8-a236-03aefa89de33 as ['output.csv-2012-12-24T00:00:00-2012-12-25T00:00:00-00000-of-00001']
INFO apache_beam.io.fileio:fileio.py:692 Moving temporary files <map object at 0x7fbd32c4f040> to dir: gs://temp-storage-for-end-to-end-tests/temp-it/flight_delays_it-19356b3f-c40a-46a8-a236-03aefa89de33 as ['output.csv-2012-12-23T00:00:00-2012-12-24T00:00:00-00000-of-00001']
INFO apache_beam.io.fileio:fileio.py:692 Moving temporary files <map object at 0x7fbd32c4f010> to dir: gs://temp-storage-for-end-to-end-tests/temp-it/flight_delays_it-19356b3f-c40a-46a8-a236-03aefa89de33 as ['output.csv-2012-12-25T00:00:00-2012-12-26T00:00:00-00000-of-00001']
INFO apache_beam.io.gcp.gcsio:gcsio.py:644 Finished listing 1 files in 0.03796887397766113 seconds.
INFO apache_beam.io.gcp.gcsio:gcsio.py:644 Finished listing 1 files in 0.039116621017456055 seconds.
INFO apache_beam.io.gcp.gcsio:gcsio.py:644 Finished listing 1 files in 0.04178595542907715 seconds.
INFO apache_beam.io.gcp.gcsio:gcsio.py:644 Finished listing 3 files in 0.03722333908081055 seconds.
PASSED [ 95%]
apache_beam/examples/dataframe/wordcount_test.py::WordCountTest::test_basics
-------------------------------- live log call ---------------------------------
INFO root:transforms.py:182 Computing dataframe stage <ComputeStage(PTransform) label=[[ComputedExpression[set_column_DataFrame_140450593674272], ComputedExpression[set_index_DataFrame_140450676686512], ComputedExpression[pre_combine_sum_DataFrame_140450676686080]]:140450582414336]> for Stage[inputs={PlaceholderExpression[placeholder_DataFrame_140450577312608]}, partitioning=Arbitrary, ops=[ComputedExpression[set_column_DataFrame_140450593674272], ComputedExpression[set_index_DataFrame_140450676686512], ComputedExpression[pre_combine_sum_DataFrame_140450676686080]], outputs={PlaceholderExpression[placeholder_DataFrame_140450577312608], ComputedExpression[pre_combine_sum_DataFrame_140450676686080]}]
INFO root:transforms.py:182 Computing dataframe stage <ComputeStage(PTransform) label=[[ComputedExpression[post_combine_sum_DataFrame_140450676673264]]:140450594619008]> for Stage[inputs={ComputedExpression[pre_combine_sum_DataFrame_140450676686080]}, partitioning=Index, ops=[ComputedExpression[post_combine_sum_DataFrame_140450676673264]], outputs={ComputedExpression[post_combine_sum_DataFrame_140450676673264]}]
INFO apache_beam.io.fileio:fileio.py:596 Added temporary directory gs://temp-storage-for-end-to-end-tests/temp-it/.temp9cc3a68e-b265-4775-9bd7-27317e3d42f6
WARNING apache_beam.options.pipeline_options:pipeline_options.py:352 Discarding unparseable args: ['--sleep_secs=20', '--kms_key_name=projects/apache-beam-testing/locations/global/keyRings/beam-it/cryptoKeys/test']
INFO root:environments.py:376 Default Python SDK image for environment is apache/beam_python3.10_sdk:2.45.0.dev
INFO apache_beam.runners.portability.fn_api_runner.translations:translations.py:710 ==================== <function annotate_downstream_side_inputs at 0x7fbd882c2560> ====================
INFO apache_beam.runners.portability.fn_api_runner.translations:translations.py:710 ==================== <function fix_side_input_pcoll_coders at 0x7fbd882c2680> ====================
INFO apache_beam.runners.portability.fn_api_runner.translations:translations.py:710 ==================== <function pack_combiners at 0x7fbd882c2b90> ====================
INFO apache_beam.runners.portability.fn_api_runner.translations:translations.py:710 ==================== <function lift_combiners at 0x7fbd882c2c20> ====================
INFO apache_beam.runners.portability.fn_api_runner.translations:translations.py:710 ==================== <function expand_sdf at 0x7fbd882c2dd0> ====================
INFO apache_beam.runners.portability.fn_api_runner.translations:translations.py:710 ==================== <function expand_gbk at 0x7fbd882c2e60> ====================
INFO apache_beam.runners.portability.fn_api_runner.translations:translations.py:710 ==================== <function sink_flattens at 0x7fbd882c2f80> ====================
INFO apache_beam.runners.portability.fn_api_runner.translations:translations.py:710 ==================== <function greedily_fuse at 0x7fbd882c3010> ====================
INFO apache_beam.runners.portability.fn_api_runner.translations:translations.py:710 ==================== <function read_to_impulse at 0x7fbd882c30a0> ====================
INFO apache_beam.runners.portability.fn_api_runner.translations:translations.py:710 ==================== <function impulse_to_input at 0x7fbd882c3130> ====================
INFO apache_beam.runners.portability.fn_api_runner.translations:translations.py:710 ==================== <function sort_stages at 0x7fbd882c3370> ====================
INFO apache_beam.runners.portability.fn_api_runner.translations:translations.py:710 ==================== <function add_impulse_to_dangling_transforms at 0x7fbd882c3490> ====================
INFO apache_beam.runners.portability.fn_api_runner.translations:translations.py:710 ==================== <function setup_timer_mapping at 0x7fbd882c32e0> ====================
INFO apache_beam.runners.portability.fn_api_runner.translations:translations.py:710 ==================== <function populate_data_channel_coders at 0x7fbd882c3400> ====================
INFO apache_beam.runners.worker.statecache:statecache.py:234 Creating state cache with size 104857600
INFO apache_beam.runners.portability.fn_api_runner.worker_handlers:worker_handlers.py:903 Created Worker handler <apache_beam.runners.portability.fn_api_runner.worker_handlers.EmbeddedWorkerHandler object at 0x7fbd33ba7640> for environment ref_Environment_default_environment_1 (beam:env:embedded_python:v1, b'')
INFO apache_beam.io.fileio:fileio.py:692 Moving temporary files <map object at 0x7fbd89112500> to dir: gs://temp-storage-for-end-to-end-tests/temp-it as ['eec074b1-69f5-4169-bfc6-6cceb3ee9127.result-00000-of-00001']
INFO apache_beam.io.gcp.gcsio:gcsio.py:644 Finished listing 1 files in 0.0434722900390625 seconds.
PASSED [100%]
=============================== warnings summary ===============================
../../build/gradleenv/417525523/lib/python3.10/site-packages/hdfs/config.py:15
<https://ci-beam.apache.org/job/beam_PostCommit_Python_Examples_Direct/ws/src/build/gradleenv/417525523/lib/python3.10/site-packages/hdfs/config.py>:15: DeprecationWarning: the imp module is deprecated in favour of importlib and slated for removal in Python 3.12; see the module's documentation for alternative uses
from imp import load_source
../../build/gradleenv/417525523/lib/python3.10/site-packages/google/api_core/operations_v1/abstract_operations_client.py:17
<https://ci-beam.apache.org/job/beam_PostCommit_Python_Examples_Direct/ws/src/build/gradleenv/417525523/lib/python3.10/site-packages/google/api_core/operations_v1/abstract_operations_client.py>:17: DeprecationWarning: The distutils package is deprecated and slated for removal in Python 3.12. Use setuptools or check PEP 632 for potential alternatives
from distutils import util
../../build/gradleenv/417525523/lib/python3.10/site-packages/tenacity/_asyncio.py:42
<https://ci-beam.apache.org/job/beam_PostCommit_Python_Examples_Direct/ws/src/build/gradleenv/417525523/lib/python3.10/site-packages/tenacity/_asyncio.py>:42: DeprecationWarning: "@coroutine" decorator is deprecated since Python 3.8, use "async def" instead
def call(self, fn, *args, **kwargs):
apache_beam/typehints/pandas_type_compatibility_test.py:67
<https://ci-beam.apache.org/job/beam_PostCommit_Python_Examples_Direct/ws/src/sdks/python/apache_beam/typehints/pandas_type_compatibility_test.py>:67: FutureWarning: pandas.Int64Index is deprecated and will be removed from pandas in a future version. Use pandas.Index with the appropriate dtype instead.
}).set_index(pd.Int64Index(range(123, 223), name='an_index')),
apache_beam/typehints/pandas_type_compatibility_test.py:90
<https://ci-beam.apache.org/job/beam_PostCommit_Python_Examples_Direct/ws/src/sdks/python/apache_beam/typehints/pandas_type_compatibility_test.py>:90: FutureWarning: pandas.Int64Index is deprecated and will be removed from pandas in a future version. Use pandas.Index with the appropriate dtype instead.
pd.Int64Index(range(123, 223), name='an_index'),
apache_beam/typehints/pandas_type_compatibility_test.py:91
<https://ci-beam.apache.org/job/beam_PostCommit_Python_Examples_Direct/ws/src/sdks/python/apache_beam/typehints/pandas_type_compatibility_test.py>:91: FutureWarning: pandas.Int64Index is deprecated and will be removed from pandas in a future version. Use pandas.Index with the appropriate dtype instead.
pd.Int64Index(range(475, 575), name='another_index'),
apache_beam/examples/wordcount_debugging_test.py: 15 warnings
apache_beam/examples/wordcount_minimal_test.py: 15 warnings
apache_beam/examples/wordcount_test.py: 15 warnings
apache_beam/examples/complete/autocomplete_it_test.py: 15 warnings
apache_beam/examples/complete/distribopt_test.py: 15 warnings
apache_beam/examples/complete/estimate_pi_it_test.py: 9 warnings
apache_beam/examples/complete/tfidf_it_test.py: 28 warnings
apache_beam/examples/complete/top_wikipedia_sessions_it_test.py: 15 warnings
apache_beam/examples/complete/game/hourly_team_score_it_test.py: 10 warnings
apache_beam/examples/complete/game/user_score_it_test.py: 17 warnings
apache_beam/examples/cookbook/bigquery_side_input_it_test.py: 25 warnings
apache_beam/examples/cookbook/bigquery_tornadoes_it_test.py: 11 warnings
apache_beam/examples/cookbook/coders_it_test.py: 15 warnings
apache_beam/examples/cookbook/custom_ptransform_it_test.py: 45 warnings
apache_beam/examples/cookbook/filters_test.py: 11 warnings
apache_beam/examples/cookbook/group_with_coder_test.py: 21 warnings
apache_beam/examples/cookbook/mergecontacts_test.py: 27 warnings
apache_beam/examples/cookbook/multiple_output_pardo_test.py: 33 warnings
apache_beam/examples/dataframe/flight_delays_it_test.py: 28 warnings
apache_beam/examples/dataframe/wordcount_test.py: 12 warnings
<https://ci-beam.apache.org/job/beam_PostCommit_Python_Examples_Direct/ws/src/build/gradleenv/417525523/lib/python3.10/site-packages/httplib2/__init__.py>:147: DeprecationWarning: ssl.PROTOCOL_TLS is deprecated
context = ssl.SSLContext(DEFAULT_TLS_VERSION)
apache_beam/examples/complete/game/hourly_team_score_it_test.py::HourlyTeamScoreIT::test_hourly_team_score_output_checksum_on_small_input
<https://ci-beam.apache.org/job/beam_PostCommit_Python_Examples_Direct/ws/src/sdks/python/apache_beam/io/gcp/tests/utils.py>:63: PendingDeprecationWarning: Client.dataset is deprecated and will be removed in a future version. Use a string like 'my_project.my_dataset' or a cloud.google.bigquery.DatasetReference object, instead.
dataset_ref = client.dataset(unique_dataset_name, project=project)
apache_beam/examples/complete/game/hourly_team_score_it_test.py::HourlyTeamScoreIT::test_hourly_team_score_output_checksum_on_small_input
apache_beam/examples/cookbook/bigquery_tornadoes_it_test.py::BigqueryTornadoesIT::test_bigquery_tornadoes_it
apache_beam/examples/cookbook/filters_test.py::FiltersTest::test_filters_output_bigquery_matcher
<https://ci-beam.apache.org/job/beam_PostCommit_Python_Examples_Direct/ws/src/sdks/python/apache_beam/io/gcp/bigquery.py>:1992: BeamDeprecationWarning: options is deprecated since First stable release. References to <pipeline>.options will not be supported
is_streaming_pipeline = p.options.view_as(StandardOptions).streaming
apache_beam/examples/complete/game/hourly_team_score_it_test.py::HourlyTeamScoreIT::test_hourly_team_score_output_checksum_on_small_input
apache_beam/examples/cookbook/bigquery_tornadoes_it_test.py::BigqueryTornadoesIT::test_bigquery_tornadoes_it
apache_beam/examples/cookbook/filters_test.py::FiltersTest::test_filters_output_bigquery_matcher
<https://ci-beam.apache.org/job/beam_PostCommit_Python_Examples_Direct/ws/src/sdks/python/apache_beam/io/gcp/bigquery.py>:1998: BeamDeprecationWarning: options is deprecated since First stable release. References to <pipeline>.options will not be supported
experiments = p.options.view_as(DebugOptions).experiments or []
apache_beam/examples/complete/game/hourly_team_score_it_test.py::HourlyTeamScoreIT::test_hourly_team_score_output_checksum_on_small_input
apache_beam/examples/cookbook/bigquery_tornadoes_it_test.py::BigqueryTornadoesIT::test_bigquery_tornadoes_it
apache_beam/examples/cookbook/filters_test.py::FiltersTest::test_filters_output_bigquery_matcher
<https://ci-beam.apache.org/job/beam_PostCommit_Python_Examples_Direct/ws/src/sdks/python/apache_beam/io/gcp/bigquery_file_loads.py>:1173: BeamDeprecationWarning: options is deprecated since First stable release. References to <pipeline>.options will not be supported
temp_location = p.options.view_as(GoogleCloudOptions).temp_location
apache_beam/examples/complete/game/hourly_team_score_it_test.py::HourlyTeamScoreIT::test_hourly_team_score_output_checksum_on_small_input
apache_beam/examples/cookbook/bigquery_tornadoes_it_test.py::BigqueryTornadoesIT::test_bigquery_tornadoes_it
apache_beam/examples/cookbook/filters_test.py::FiltersTest::test_filters_output_bigquery_matcher
<https://ci-beam.apache.org/job/beam_PostCommit_Python_Examples_Direct/ws/src/sdks/python/apache_beam/io/gcp/bigquery_file_loads.py>:1175: BeamDeprecationWarning: options is deprecated since First stable release. References to <pipeline>.options will not be supported
p.options.view_as(GoogleCloudOptions).job_name or 'AUTOMATIC_JOB_NAME')
apache_beam/examples/cookbook/bigquery_side_input_it_test.py::BigQuerySideInputIT::test_bigquery_side_input_it
apache_beam/examples/cookbook/bigquery_side_input_it_test.py::BigQuerySideInputIT::test_bigquery_side_input_it
apache_beam/examples/cookbook/bigquery_tornadoes_it_test.py::BigqueryTornadoesIT::test_bigquery_tornadoes_it
apache_beam/examples/cookbook/filters_test.py::FiltersTest::test_filters_output_bigquery_matcher
apache_beam/examples/dataframe/flight_delays_it_test.py::FlightDelaysTest::test_flight_delays
<https://ci-beam.apache.org/job/beam_PostCommit_Python_Examples_Direct/ws/src/sdks/python/apache_beam/io/gcp/bigquery.py>:2485: BeamDeprecationWarning: options is deprecated since First stable release. References to <pipeline>.options will not be supported
temp_location = pcoll.pipeline.options.view_as(
apache_beam/examples/cookbook/bigquery_side_input_it_test.py::BigQuerySideInputIT::test_bigquery_side_input_it
apache_beam/examples/cookbook/bigquery_side_input_it_test.py::BigQuerySideInputIT::test_bigquery_side_input_it
apache_beam/examples/cookbook/bigquery_tornadoes_it_test.py::BigqueryTornadoesIT::test_bigquery_tornadoes_it
apache_beam/examples/cookbook/filters_test.py::FiltersTest::test_filters_output_bigquery_matcher
apache_beam/examples/dataframe/flight_delays_it_test.py::FlightDelaysTest::test_flight_delays
<https://ci-beam.apache.org/job/beam_PostCommit_Python_Examples_Direct/ws/src/sdks/python/apache_beam/io/gcp/bigquery.py>:2487: BeamDeprecationWarning: options is deprecated since First stable release. References to <pipeline>.options will not be supported
job_name = pcoll.pipeline.options.view_as(GoogleCloudOptions).job_name
apache_beam/examples/cookbook/bigquery_side_input_it_test.py::BigQuerySideInputIT::test_bigquery_side_input_it
apache_beam/examples/cookbook/bigquery_side_input_it_test.py::BigQuerySideInputIT::test_bigquery_side_input_it
apache_beam/examples/cookbook/bigquery_tornadoes_it_test.py::BigqueryTornadoesIT::test_bigquery_tornadoes_it
apache_beam/examples/cookbook/filters_test.py::FiltersTest::test_filters_output_bigquery_matcher
apache_beam/examples/dataframe/flight_delays_it_test.py::FlightDelaysTest::test_flight_delays
<https://ci-beam.apache.org/job/beam_PostCommit_Python_Examples_Direct/ws/src/sdks/python/apache_beam/io/gcp/bigquery.py>:2511: BeamDeprecationWarning: options is deprecated since First stable release. References to <pipeline>.options will not be supported
pipeline_options=pcoll.pipeline.options,
apache_beam/examples/cookbook/bigquery_tornadoes_it_test.py::BigqueryTornadoesIT::test_bigquery_tornadoes_it
apache_beam/examples/cookbook/filters_test.py::FiltersTest::test_filters_output_bigquery_matcher
<https://ci-beam.apache.org/job/beam_PostCommit_Python_Examples_Direct/ws/src/sdks/python/apache_beam/io/gcp/bigquery.py>:1988: BeamDeprecationWarning: options is deprecated since First stable release. References to <pipeline>.options will not be supported
self.table_reference.projectId = pcoll.pipeline.options.view_as(
apache_beam/examples/cookbook/bigquery_tornadoes_it_test.py::BigqueryTornadoesIT::test_bigquery_tornadoes_it
apache_beam/examples/cookbook/filters_test.py::FiltersTest::test_filters_output_bigquery_matcher
<https://ci-beam.apache.org/job/beam_PostCommit_Python_Examples_Direct/ws/src/sdks/python/apache_beam/io/gcp/bigquery_file_loads.py>:1166: BeamDeprecationWarning: options is deprecated since First stable release. References to <pipeline>.options will not be supported
self.project = self.project or p.options.view_as(GoogleCloudOptions).project
apache_beam/examples/cookbook/bigquery_tornadoes_it_test.py::BigqueryTornadoesIT::test_bigquery_tornadoes_it
apache_beam/examples/cookbook/filters_test.py::FiltersTest::test_filters_output_bigquery_matcher
<https://ci-beam.apache.org/job/beam_PostCommit_Python_Examples_Direct/ws/src/sdks/python/apache_beam/io/gcp/tests/utils.py>:100: PendingDeprecationWarning: Client.dataset is deprecated and will be removed in a future version. Use a string like 'my_project.my_dataset' or a cloud.google.bigquery.DatasetReference object, instead.
table_ref = client.dataset(dataset_id).table(table_id)
apache_beam/examples/dataframe/flight_delays_it_test.py: 46 warnings
<https://ci-beam.apache.org/job/beam_PostCommit_Python_Examples_Direct/ws/src/sdks/python/apache_beam/examples/dataframe/flight_delays.py>:47: FutureWarning: The default value of numeric_only in DataFrame.mean is deprecated. In a future version, it will default to False. In addition, specifying 'numeric_only=None' is deprecated. Select only valid columns or specify the value of numeric_only to silence this warning.
return airline_df[at_top_airports].mean()
apache_beam/examples/dataframe/flight_delays_it_test.py::FlightDelaysTest::test_flight_delays
apache_beam/examples/dataframe/wordcount_test.py::WordCountTest::test_basics
<https://ci-beam.apache.org/job/beam_PostCommit_Python_Examples_Direct/ws/src/sdks/python/apache_beam/dataframe/io.py>:659: FutureWarning: WriteToFiles is experimental.
return pcoll | fileio.WriteToFiles(
apache_beam/examples/dataframe/flight_delays_it_test.py::FlightDelaysTest::test_flight_delays
apache_beam/examples/dataframe/wordcount_test.py::WordCountTest::test_basics
<https://ci-beam.apache.org/job/beam_PostCommit_Python_Examples_Direct/ws/src/sdks/python/apache_beam/io/fileio.py>:591: BeamDeprecationWarning: options is deprecated since First stable release. References to <pipeline>.options will not be supported
p.options.view_as(GoogleCloudOptions).temp_location or
-- Docs: https://docs.pytest.org/en/stable/how-to/capture-warnings.html
- generated xml file: <https://ci-beam.apache.org/job/beam_PostCommit_Python_Examples_Direct/ws/src/sdks/python/pytest_postCommitExamples-direct-py310.xml> -
=== 22 passed, 6 skipped, 6772 deselected, 472 warnings in 209.23s (0:03:29) ===
FAILURE: Build failed with an exception.
* Where:
Script '<https://ci-beam.apache.org/job/beam_PostCommit_Python_Examples_Direct/ws/src/sdks/python/test-suites/direct/common.gradle'> line: 92
* What went wrong:
Execution failed for task ':sdks:python:test-suites:direct:py37:examples'.
> Process 'command 'sh'' finished with non-zero exit value 1
* Try:
> Run with --stacktrace option to get the stack trace.
> Run with --info or --debug option to get more log output.
* Get more help at https://help.gradle.org
BUILD FAILED in 5m 2s
24 actionable tasks: 18 executed, 4 from cache, 2 up-to-date
Publishing build scan...
https://gradle.com/s/4tmomw6p62f56
Build step 'Invoke Gradle script' changed build result to FAILURE
Build step 'Invoke Gradle script' marked build as failure
---------------------------------------------------------------------
To unsubscribe, e-mail: builds-unsubscribe@beam.apache.org
For additional commands, e-mail: builds-help@beam.apache.org
Jenkins build is back to normal : beam_PostCommit_Python_Examples_Direct #1288
Posted by Apache Jenkins Server <je...@builds.apache.org>.
See <https://ci-beam.apache.org/job/beam_PostCommit_Python_Examples_Direct/1288/display/redirect>
---------------------------------------------------------------------
To unsubscribe, e-mail: builds-unsubscribe@beam.apache.org
For additional commands, e-mail: builds-help@beam.apache.org