You are viewing a plain text version of this content. The canonical link for it is here.
Posted to builds@cassandra.apache.org by Apache Jenkins Server <je...@builds.apache.org> on 2026/01/28 13:41:11 UTC
Build complete: Cassandra-5.0 #552 [ABORTED] b3ee9713f8fd51e65c3040f7e7af4ce662c986ae
-------------------------------------------------------------------------------
Build Cassandra-5.0 #552 Aborted
URL: https://ci-cassandra.apache.org/job/Cassandra-5.0/552/
-------------------------------------------------------------------------------
Changes:
[Michael Semb Wever] Implement microbench test target type
-------------------------------------------------------------------------------
Failed Tests:
8 tests failed.
FAILED: dtest-latest.materialized_views_test.TestMaterializedViews.Tests / dtest-latest jdk11 17/64 / test_complex_mv_select_statements
FAILED: dtest-novnode.secondary_indexes_test.TestSecondaryIndexes.Tests / dtest-novnode jdk17 14/64 / test_6924_dropping_cf
FAILED: dtest-novnode.secondary_indexes_test.TestSecondaryIndexes.Tests / dtest-novnode jdk11 14/64 / test_6924_dropping_cf
FAILED: dtest-upgrade-novnode.upgrade_tests.cql_tests.TestCQLNodes3RF3_Upgrade_current_4_0_x_To_indev_5_0_x.Tests / dtest-upgrade-novnode jdk11 96/128 / test_only_pk
FAILED: dtest-upgrade-novnode.upgrade_tests.cql_tests.TestCQLNodes3RF3_Upgrade_current_5_0_x_To_indev_5_0_x.Tests / dtest-upgrade-novnode jdk11 78/128 / test_select_count_paging
FAILED: dtest-upgrade.upgrade_tests.cql_tests.TestCQLNodes3RF3_Upgrade_current_5_0_x_To_indev_5_0_x.Tests / dtest-upgrade jdk11 82/128 / test_batch
FAILED: dtest.bootstrap_test.TestBootstrap.Tests / dtest jdk11 13/64 / test_shutdown_wiped_node_cannot_join
FAILED: dtest.materialized_views_test.TestMaterializedViews.Tests / dtest jdk11 46/64 / test_drop_mv
-------------------------------------------------------------------------------
For complete test report and logs see https://nightlies.apache.org/cassandra/Cassandra-5.0/552/