You are viewing a plain text version of this content. The canonical link for it is here.
Posted to dev@jmeter.apache.org by Apache Jenkins Server <je...@builds.apache.org> on 2025/11/20 14:28:36 UTC
Build failed in Jenkins: JMeter » JMeter-analysis #567
See <https://ci-builds.apache.org/job/JMeter/job/JMeter-analysis/567/display/redirect?page=changes>
Changes:
[Vladimir Sitnikov] chore: bump org.sonarqube Gradle plugin to 7.1.0.6387
[Vladimir Sitnikov] fix(deps): update dependency org.junit:junit-bom to v6
------------------------------------------
[...truncated 301.20 KiB...]
Creating summariser <summary>
Created the tree successfully using <https://ci-builds.apache.org/job/JMeter/job/JMeter-analysis/ws/bin/testfiles/TestHeaderManager.jmx>
Starting standalone test @ 2025 Nov 20 14:27:19 UTC (1763648839028)
Waiting for possible Shutdown/StopTestNow/HeapDump/ThreadDump message on port 4445
2025-11-20T14:27:19.454264692Z Thread Group 1-1 WARN The use of package scanning to locate Log4j plugins is deprecated.
Please remove the `packages` attribute from your configuration file.
See https://logging.apache.org/log4j/2.x/faq.html#package-scanning for details.
summary = 3 in 00:00:00 = 7.6/s Avg: 13 Min: 2 Max: 37 Err: 0 (0.00%)
Tidying up ... @ 2025 Nov 20 14:27:19 UTC (1763648839664)
... end of run
No errors present in the logfile <https://ci-builds.apache.org/job/JMeter/job/JMeter-analysis/ws/bin/TestHeaderManager.log> (the file is empty)
> Task :src:dist-check:batchTestHeaderManagerJava
2025-11-20T14:27:22.199296314Z main WARN The use of package scanning to locate Log4j plugins is deprecated.
Please remove the `packages` attribute from your configuration file.
See https://logging.apache.org/log4j/2.x/faq.html#package-scanning for details.
Creating summariser <summary>
Created the tree successfully using <https://ci-builds.apache.org/job/JMeter/job/JMeter-analysis/ws/bin/testfiles/TestHeaderManager.jmx>
Starting standalone test @ 2025 Nov 20 14:27:23 UTC (1763648843376)
Waiting for possible Shutdown/StopTestNow/HeapDump/ThreadDump message on port 4445
summary = 3 in 00:00:00 = 15.1/s Avg: 4 Min: 0 Max: 13 Err: 0 (0.00%)
Tidying up ... @ 2025 Nov 20 14:27:23 UTC (1763648843810)
... end of run
No errors present in the logfile <https://ci-builds.apache.org/job/JMeter/job/JMeter-analysis/ws/bin/TestHeaderManager.log> (the file is empty)
> Task :src:dist-check:batchTestKeepAlive SKIPPED
> Task :src:dist-check:batchTestRedirectionPolicies SKIPPED
> Task :src:dist-check:batchTestResultStatusAction
2025-11-20T14:27:26.199286510Z main WARN The use of package scanning to locate Log4j plugins is deprecated.
Please remove the `packages` attribute from your configuration file.
See https://logging.apache.org/log4j/2.x/faq.html#package-scanning for details.
Creating summariser <summary>
Created the tree successfully using <https://ci-builds.apache.org/job/JMeter/job/JMeter-analysis/ws/bin/testfiles/TestResultStatusAction.jmx>
Starting standalone test @ 2025 Nov 20 14:27:27 UTC (1763648847383)
Waiting for possible Shutdown/StopTestNow/HeapDump/ThreadDump message on port 4445
summary = 135 in 00:00:01 = 100.4/s Avg: 1 Min: 0 Max: 128 Err: 18 (13.33%)
Tidying up ... @ 2025 Nov 20 14:27:29 UTC (1763648849402)
... end of run
No errors present in the logfile <https://ci-builds.apache.org/job/JMeter/job/JMeter-analysis/ws/bin/TestResultStatusAction.log> (the file is empty)
> Task :src:dist-check:batchTestSchedulerWithTimer
2025-11-20T14:27:31.796174844Z main WARN The use of package scanning to locate Log4j plugins is deprecated.
Please remove the `packages` attribute from your configuration file.
See https://logging.apache.org/log4j/2.x/faq.html#package-scanning for details.
Creating summariser <summary>
Created the tree successfully using <https://ci-builds.apache.org/job/JMeter/job/JMeter-analysis/ws/bin/testfiles/TestSchedulerWithTimer.jmx>
Starting standalone test @ 2025 Nov 20 14:27:32 UTC (1763648852935)
Waiting for possible Shutdown/StopTestNow/HeapDump/ThreadDump message on port 4445
summary + 1 in 00:00:01 = 1.0/s Avg: 964 Min: 964 Max: 964 Err: 0 (0.00%) Active: 1 Started: 1 Finished: 0
summary + 4 in 00:00:05 = 0.7/s Avg: 81 Min: 5 Max: 309 Err: 0 (0.00%) Active: 0 Started: 1 Finished: 1
summary = 5 in 00:00:06 = 0.8/s Avg: 257 Min: 5 Max: 964 Err: 0 (0.00%)
Tidying up ... @ 2025 Nov 20 14:27:39 UTC (1763648859875)
... end of run
No errors present in the logfile <https://ci-builds.apache.org/job/JMeter/job/JMeter-analysis/ws/bin/TestSchedulerWithTimer.log> (the file is empty)
> Task :src:dist-check:batchTests
> Task :src:dist-check:kaptTestKotlin
> Task :src:dist-check:compileTestKotlin
w: file://<https://ci-builds.apache.org/job/JMeter/job/JMeter-analysis/ws/src/dist-check/src/test/kotlin/org/apache/jmeter/gui/action/HtmlReportGeneratorTest.kt>:116:35 'fun readTree(p0: URL!): JsonNode!' is deprecated. Deprecated in Java.
w: file://<https://ci-builds.apache.org/job/JMeter/job/JMeter-analysis/ws/src/dist-check/src/test/kotlin/org/apache/jmeter/report/dashboard/ReportGeneratorTest.kt>:65:35 'fun readTree(p0: URL!): JsonNode!' is deprecated. Deprecated in Java.
w: file://<https://ci-builds.apache.org/job/JMeter/job/JMeter-analysis/ws/src/dist-check/src/test/kotlin/org/apache/jmeter/report/dashboard/ReportGeneratorTest.kt>:82:35 'fun readTree(p0: URL!): JsonNode!' is deprecated. Deprecated in Java.
> Task :src:dist-check:compileTestJava
> Task :src:dist-check:testClasses
> Task :src:dist-check:test
ThreadGroupLoad STANDARD_ERROR
2025-11-20T14:27:46.596366541Z ForkJoinPool-1-worker-1 WARN The use of package scanning to locate Log4j plugins is deprecated.
Please remove the `packages` attribute from your configuration file.
See https://logging.apache.org/log4j/2.x/faq.html#package-scanning for details.
ThreadGroupLoad STANDARD_OUT
Setting JMeterHome: <https://ci-builds.apache.org/job/JMeter/job/JMeter-analysis/ws/src/dist-check/../../.>
Initializing Properties: ../.././bin/jmeter.properties
JMeterVersion=6.0.0-SNAPSHOT a4ca5a0
java.version=21.0.4
java.vm.name=OpenJDK 64-Bit Server VM
java.vendor=Eclipse Adoptium
java.home=/usr/local/asfpackages/java/adoptium-jdk-21.0.4+7
file.encoding=UTF-8
default encoding=UTF-8
user.home=/home/jenkins
user.dir=<https://ci-builds.apache.org/job/JMeter/job/JMeter-analysis/ws/src/dist-check>
user.language=en
user.region=null
user.country=US
user.variant=
Locale=en_US
java.class.version=65.0
java.awt.headless=null
os.name=Linux
os.version=5.15.0-157-generic
os.arch=amd64
[0;1m 11.9sec[0m, org.apache.jorphan.reflect.[0;1mTestClassFinder[0m > [0;1mtestFindClassesThatExtendStringArrayClassOfQArrayTrue()[0m
[0;1m 3.5sec[0m, org.apache.jorphan.reflect.[0;1mTestClassFinder[0m > [0;1mtestFindAnnotatedClasses()[0m
[0;1m 1.2sec[0m, org.apache.jorphan.reflect.[0;1mTestClassFinder[0m > [0;1mtestFindAnnotatedInnerClasses()[0m
[0;1m 17.5sec[0m, 9 completed, 0 failed, 0 skipped, org.apache.jorphan.reflect.TestClassFinder
[0;1m 3.0sec[0m, 138 completed, 0 failed, 0 skipped, org.apache.jmeter.junit.[0;1mJMeterTest[0m > [0;1mrunGUITitle(GuiComponentHolder)[0m
JMeterTest > runSerialTest(Serializable) STANDARD_ERROR
Unable to instantiate org.apache.jmeter.gui.GlobalUndoableEdit for service interface java.io.Serializable, java.lang.NoSuchMethodException: org.apache.jmeter.gui.GlobalUndoableEdit.<init>()
Unable to instantiate org.apache.jmeter.gui.JBooleanPropertyEditor for service interface java.io.Serializable, java.lang.NoSuchMethodException: org.apache.jmeter.gui.JBooleanPropertyEditor.<init>()
Unable to instantiate org.apache.jmeter.gui.logging.LogEventObject for service interface java.io.Serializable, java.lang.NoSuchMethodException: org.apache.jmeter.gui.logging.LogEventObject.<init>()
Unable to instantiate org.apache.jmeter.rmi.RMIServerSocketFactoryImpl for service interface java.io.Serializable, java.lang.NoSuchMethodException: org.apache.jmeter.rmi.RMIServerSocketFactoryImpl.<init>()
Unable to instantiate org.apache.jmeter.rmi.SSLRMIServerSocketFactory for service interface java.io.Serializable, java.lang.NoSuchMethodException: org.apache.jmeter.rmi.SSLRMIServerSocketFactory.<init>()
Unable to instantiate org.apache.jmeter.threads.RemoteThreadsListenerImpl for service interface java.io.Serializable, java.rmi.server.ExportException: Listen failed on port: 0; nested exception is:
java.io.FileNotFoundException: rmi_keystore.jks (No such file or directory)
Unable to instantiate org.apache.jmeter.threads.openmodel.ParserException for service interface java.io.Serializable, java.lang.NoSuchMethodException: org.apache.jmeter.threads.openmodel.ParserException.<init>()
Unable to instantiate org.apache.jmeter.threads.openmodel.TokenizerException for service interface java.io.Serializable, java.lang.NoSuchMethodException: org.apache.jmeter.threads.openmodel.TokenizerException.<init>()
Unable to instantiate org.apache.jmeter.util.LocaleChangeEvent for service interface java.io.Serializable, java.lang.NoSuchMethodException: org.apache.jmeter.util.LocaleChangeEvent.<init>()
[0;34;1mWARNING[0m [0;1m 10.7sec[0m, 1296 completed, 0 failed, [0;34;1m 6[0m skipped, org.apache.jmeter.junit.[0;34;1mJMeterTest[0m
[0;1m 2.1sec[0m, 384 completed, 0 failed, 0 skipped, org.apache.jmeter.testbeans.gui.[0;1mPackageTest[0m > [0;1mrunTest(Class,[0m Locale, ResourceBundle)
[0;1m 2.1sec[0m, 384 completed, 0 failed, 0 skipped, org.apache.jmeter.testbeans.gui.PackageTest
[0;1m 1.8sec[0m, org.apache.jmeter.gui.action.[0;1mHtmlReportGeneratorTest[0m > [0;1mreport[0m generation fails when format does not match and error is reported()
[0;1m 2.9sec[0m, org.apache.jmeter.gui.action.[0;1mHtmlReportGeneratorTest[0m > [0;1mcheck[0m that report generation succeeds and statistic are generated()
[0;1m 4.7sec[0m, 6 completed, 0 failed, 0 skipped, org.apache.jmeter.gui.action.HtmlReportGeneratorTest
[0;34;1mWARNING[0m [0;1m 43.8sec[0m, 2066 completed, 0 failed, [0;34;1m 6[0m skipped, [0;34;1mGradle Test Run :src:dist-check:test[0m
> Task :src:dist-check:check
> Task :sonarqube FAILED
Task 'sonarqube' is deprecated. Use 'sonar' instead.
Failed to query JRE metadata: GET https://api.sonarcloud.io/analysis/jres?os=linux&arch=x86_64 failed with HTTP 403. Please check the property sonar.token or the environment variable SONAR_TOKEN.
Build [0;1m [0;1;31mFAILURE[0;1m[0m reason:
Execution [0;1;31mfailed[0m for task '[0;1m:sonarqube[0m':
org.sonarqube.gradle.AnalysisException: The scanner boostrapping has failed! See the logs for more details.
at org.sonarqube.gradle.SonarTask.run(SonarTask.java:145)
[0;0;90mat org.gradle.internal.reflect.JavaMethod.invoke(JavaMethod.java:125)
[0m [0;0;90mat org.gradle.api.internal.project.taskfactory.StandardTaskAction.doExecute(StandardTaskAction.java:58)
[0m [0;0;90mat org.gradle.api.internal.project.taskfactory.StandardTaskAction.execute(StandardTaskAction.java:51)
[0m [0;0;90mat org.gradle.api.internal.project.taskfactory.StandardTaskAction.execute(StandardTaskAction.java:29)
[0m [0;0;90mat org.gradle.api.internal.tasks.execution.TaskExecution$3.run(TaskExecution.java:252)
[0m [0;0;90mat org.gradle.internal.operations.DefaultBuildOperationRunner$1.execute(DefaultBuildOperationRunner.java:29)
[0m [0;0;90mat org.gradle.internal.operations.DefaultBuildOperationRunner$1.execute(DefaultBuildOperationRunner.java:26)
[0m [0;0;90mat org.gradle.internal.operations.DefaultBuildOperationRunner$2.execute(DefaultBuildOperationRunner.java:66)
[0m [0;0;90mat org.gradle.internal.operations.DefaultBuildOperationRunner$2.execute(DefaultBuildOperationRunner.java:59)
[0m [0;0;90mat org.gradle.internal.operations.DefaultBuildOperationRunner.execute(DefaultBuildOperationRunner.java:166)
[0m [0;0;90mat org.gradle.internal.operations.DefaultBuildOperationRunner.execute(DefaultBuildOperationRunner.java:59)
[0m [0;0;90mat org.gradle.internal.operations.DefaultBuildOperationRunner.run(DefaultBuildOperationRunner.java:47)
[0m [0;0;90mat org.gradle.api.internal.tasks.execution.TaskExecution.executeAction(TaskExecution.java:237)
[0m [0;0;90mat org.gradle.api.internal.tasks.execution.TaskExecution.executeActions(TaskExecution.java:220)
[0m [0;0;90mat org.gradle.api.internal.tasks.execution.TaskExecution.executeWithPreviousOutputFiles(TaskExecution.java:203)
[0m [0;0;90mat org.gradle.api.internal.tasks.execution.TaskExecution.execute(TaskExecution.java:170)
[0m [0;0;90mat org.gradle.internal.execution.steps.ExecuteStep.executeInternal(ExecuteStep.java:105)
[0m [0;0;90mat org.gradle.internal.execution.steps.ExecuteStep.access$000(ExecuteStep.java:44)
[0m [0;0;90mat org.gradle.internal.execution.steps.ExecuteStep$1.call(ExecuteStep.java:59)
[0m [0;0;90mat org.gradle.internal.execution.steps.ExecuteStep$1.call(ExecuteStep.java:56)
[0m [0;0;90mat org.gradle.internal.operations.DefaultBuildOperationRunner$CallableBuildOperationWorker.execute(DefaultBuildOperationRunner.java:209)
[0m [0;0;90mat org.gradle.internal.operations.DefaultBuildOperationRunner$CallableBuildOperationWorker.execute(DefaultBuildOperationRunner.java:204)
[0m [0;0;90mat org.gradle.internal.operations.DefaultBuildOperationRunner$2.execute(DefaultBuildOperationRunner.java:66)
[0m [0;0;90mat org.gradle.internal.operations.DefaultBuildOperationRunner$2.execute(DefaultBuildOperationRunner.java:59)
[0m [0;0;90mat org.gradle.internal.operations.DefaultBuildOperationRunner.execute(DefaultBuildOperationRunner.java:166)
[0m [0;0;90mat org.gradle.internal.operations.DefaultBuildOperationRunner.execute(DefaultBuildOperationRunner.java:59)
[0m [0;0;90mat org.gradle.internal.operations.DefaultBuildOperationRunner.call(DefaultBuildOperationRunner.java:53)
[0m [0;0;90mat org.gradle.internal.execution.steps.ExecuteStep.execute(ExecuteStep.java:56)
[0m [0;0;90mat org.gradle.internal.execution.steps.ExecuteStep.execute(ExecuteStep.java:44)
[0m [0;0;90mat org.gradle.internal.execution.steps.CancelExecutionStep.execute(CancelExecutionStep.java:42)
[0m [0;0;90mat org.gradle.internal.execution.steps.TimeoutStep.executeWithoutTimeout(TimeoutStep.java:75)
[0m [0;0;90mat org.gradle.internal.execution.steps.TimeoutStep.execute(TimeoutStep.java:55)
[0m [0;0;90mat org.gradle.internal.execution.steps.PreCreateOutputParentsStep.execute(PreCreateOutputParentsStep.java:50)
[0m [0;0;90mat org.gradle.internal.execution.steps.PreCreateOutputParentsStep.execute(PreCreateOutputParentsStep.java:28)
[0m [0;0;90mat org.gradle.internal.execution.steps.RemovePreviousOutputsStep.execute(RemovePreviousOutputsStep.java:68)
[0m [0;0;90mat org.gradle.internal.execution.steps.RemovePreviousOutputsStep.execute(RemovePreviousOutputsStep.java:38)
[0m [0;0;90mat org.gradle.internal.execution.steps.BroadcastChangingOutputsStep.execute(BroadcastChangingOutputsStep.java:61)
[0m [0;0;90mat org.gradle.internal.execution.steps.BroadcastChangingOutputsStep.execute(BroadcastChangingOutputsStep.java:26)
[0m [0;0;90mat org.gradle.internal.execution.steps.CaptureOutputsAfterExecutionStep.execute(CaptureOutputsAfterExecutionStep.java:69)
[0m [0;0;90mat org.gradle.internal.execution.steps.CaptureOutputsAfterExecutionStep.execute(CaptureOutputsAfterExecutionStep.java:46)
[0m [0;0;90mat org.gradle.internal.execution.steps.ResolveInputChangesStep.execute(ResolveInputChangesStep.java:39)
[0m [0;0;90mat org.gradle.internal.execution.steps.ResolveInputChangesStep.execute(ResolveInputChangesStep.java:28)
[0m [0;0;90mat org.gradle.internal.execution.steps.BuildCacheStep.executeWithoutCache(BuildCacheStep.java:189)
[0m [0;0;90mat org.gradle.internal.execution.steps.BuildCacheStep.lambda$execute$1(BuildCacheStep.java:75)
[0m [0;0;90mat org.gradle.internal.Either$Right.fold(Either.java:176)
[0m [0;0;90mat org.gradle.internal.execution.caching.CachingState.fold(CachingState.java:62)
[0m [0;0;90mat org.gradle.internal.execution.steps.BuildCacheStep.execute(BuildCacheStep.java:73)
[0m [0;0;90mat org.gradle.internal.execution.steps.BuildCacheStep.execute(BuildCacheStep.java:48)
[0m [0;0;90mat org.gradle.internal.execution.steps.StoreExecutionStateStep.execute(StoreExecutionStateStep.java:46)
[0m [0;0;90mat org.gradle.internal.execution.steps.StoreExecutionStateStep.execute(StoreExecutionStateStep.java:35)
[0m [0;0;90mat org.gradle.internal.execution.steps.SkipUpToDateStep.executeBecause(SkipUpToDateStep.java:75)
[0m [0;0;90mat org.gradle.internal.execution.steps.SkipUpToDateStep.lambda$execute$2(SkipUpToDateStep.java:53)
[0m [0;0;90mat org.gradle.internal.execution.steps.SkipUpToDateStep.execute(SkipUpToDateStep.java:53)
[0m [0;0;90mat org.gradle.internal.execution.steps.SkipUpToDateStep.execute(SkipUpToDateStep.java:35)
[0m [0;0;90mat org.gradle.internal.execution.steps.legacy.MarkSnapshottingInputsFinishedStep.execute(MarkSnapshottingInputsFinishedStep.java:37)
[0m [0;0;90mat org.gradle.internal.execution.steps.legacy.MarkSnapshottingInputsFinishedStep.execute(MarkSnapshottingInputsFinishedStep.java:27)
[0m [0;0;90mat org.gradle.internal.execution.steps.ResolveIncrementalCachingStateStep.executeDelegate(ResolveIncrementalCachingStateStep.java:49)
[0m [0;0;90mat org.gradle.internal.execution.steps.ResolveIncrementalCachingStateStep.executeDelegate(ResolveIncrementalCachingStateStep.java:27)
[0m [0;0;90mat org.gradle.internal.execution.steps.AbstractResolveCachingStateStep.execute(AbstractResolveCachingStateStep.java:71)
[0m [0;0;90mat org.gradle.internal.execution.steps.AbstractResolveCachingStateStep.execute(AbstractResolveCachingStateStep.java:39)
[0m [0;0;90mat org.gradle.internal.execution.steps.ResolveChangesStep.execute(ResolveChangesStep.java:64)
[0m [0;0;90mat org.gradle.internal.execution.steps.ResolveChangesStep.execute(ResolveChangesStep.java:35)
[0m [0;0;90mat org.gradle.internal.execution.steps.ValidateStep.execute(ValidateStep.java:62)
[0m [0;0;90mat org.gradle.internal.execution.steps.ValidateStep.execute(ValidateStep.java:40)
[0m [0;0;90mat org.gradle.internal.execution.steps.AbstractCaptureStateBeforeExecutionStep.execute(AbstractCaptureStateBeforeExecutionStep.java:76)
[0m [0;0;90mat org.gradle.internal.execution.steps.AbstractCaptureStateBeforeExecutionStep.execute(AbstractCaptureStateBeforeExecutionStep.java:45)
[0m [0;0;90mat org.gradle.internal.execution.steps.AbstractSkipEmptyWorkStep.executeWithNonEmptySources(AbstractSkipEmptyWorkStep.java:136)
[0m [0;0;90mat org.gradle.internal.execution.steps.AbstractSkipEmptyWorkStep.execute(AbstractSkipEmptyWorkStep.java:61)
[0m [0;0;90mat org.gradle.internal.execution.steps.AbstractSkipEmptyWorkStep.execute(AbstractSkipEmptyWorkStep.java:38)
[0m [0;0;90mat org.gradle.internal.execution.steps.legacy.MarkSnapshottingInputsStartedStep.execute(MarkSnapshottingInputsStartedStep.java:38)
[0m [0;0;90mat org.gradle.internal.execution.steps.LoadPreviousExecutionStateStep.execute(LoadPreviousExecutionStateStep.java:36)
[0m [0;0;90mat org.gradle.internal.execution.steps.LoadPreviousExecutionStateStep.execute(LoadPreviousExecutionStateStep.java:23)
[0m [0;0;90mat org.gradle.internal.execution.steps.HandleStaleOutputsStep.execute(HandleStaleOutputsStep.java:75)
[0m [0;0;90mat org.gradle.internal.execution.steps.HandleStaleOutputsStep.execute(HandleStaleOutputsStep.java:41)
[0m [0;0;90mat org.gradle.internal.execution.steps.AssignMutableWorkspaceStep.lambda$execute$0(AssignMutableWorkspaceStep.java:35)
[0m [0;0;90mat org.gradle.api.internal.tasks.execution.TaskExecution$4.withWorkspace(TaskExecution.java:297)
[0m [0;0;90mat org.gradle.internal.execution.steps.AssignMutableWorkspaceStep.execute(AssignMutableWorkspaceStep.java:31)
[0m [0;0;90mat org.gradle.internal.execution.steps.AssignMutableWorkspaceStep.execute(AssignMutableWorkspaceStep.java:22)
[0m [0;0;90mat org.gradle.internal.execution.steps.ChoosePipelineStep.execute(ChoosePipelineStep.java:40)
[0m [0;0;90mat org.gradle.internal.execution.steps.ChoosePipelineStep.execute(ChoosePipelineStep.java:23)
[0m [0;0;90mat org.gradle.internal.execution.steps.ExecuteWorkBuildOperationFiringStep.lambda$execute$2(ExecuteWorkBuildOperationFiringStep.java:67)
[0m [0;0;90mat org.gradle.internal.execution.steps.ExecuteWorkBuildOperationFiringStep.execute(ExecuteWorkBuildOperationFiringStep.java:67)
[0m [0;0;90mat org.gradle.internal.execution.steps.ExecuteWorkBuildOperationFiringStep.execute(ExecuteWorkBuildOperationFiringStep.java:39)
[0m [0;0;90mat org.gradle.internal.execution.steps.IdentityCacheStep.execute(IdentityCacheStep.java:46)
[0m [0;0;90mat org.gradle.internal.execution.steps.IdentityCacheStep.execute(IdentityCacheStep.java:34)
[0m [0;0;90mat org.gradle.internal.execution.steps.IdentifyStep.execute(IdentifyStep.java:44)
[0m [0;0;90mat org.gradle.internal.execution.steps.IdentifyStep.execute(IdentifyStep.java:31)
[0m
[Incubating] Problems report is available at: file://<https://ci-builds.apache.org/job/JMeter/job/JMeter-analysis/ws/build/reports/problems/problems-report.html>
FAILURE: Build failed with an exception.
* What went wrong:
Execution failed for task ':sonarqube'.
> The scanner boostrapping has failed! See the logs for more details.
* Try:
> Run with --stacktrace option to get the stack trace.
> Run with --info or --debug option to get more log output.
> Get more help at https://help.gradle.org.
Deprecated Gradle features were used in this build, making it incompatible with Gradle 10.
You can use '--warning-mode all' to show the individual deprecation warnings and determine if they come from your own scripts or plugins.
For more on this, please refer to https://docs.gradle.org/9.2.1/userguide/command_line_interface.html#sec:command_line_warnings in the Gradle documentation.
BUILD FAILED in 11m 15s
523 actionable tasks: 335 executed, 188 up-to-date
See the profiling report at: file://<https://ci-builds.apache.org/job/JMeter/job/JMeter-analysis/ws/build/reports/profile/profile-2025-11-20-14-17-24.html>
A fine-grained performance profile is available: use the --scan option.
Build step 'Invoke Gradle script' changed build result to FAILURE
Build step 'Invoke Gradle script' marked build as failure
Xvfb stopping
Recording test results
[Checks API] No suitable checks publisher found.