You are viewing a plain text version of this content. The canonical link for it is here.
Posted to dev@pdfbox.apache.org by Apache Jenkins Server <je...@builds.apache.org> on 2024/01/21 17:24:52 UTC
Build failed in Jenkins: PDFBox » PDFBox-Trunk-jdk21 #951
See <https://ci-builds.apache.org/job/PDFBox/job/PDFBox-Trunk-jdk21/951/display/redirect?page=changes>
Changes:
[Andreas Lehmkühler] PDFBOX-5704: detect and fix wrong CID font subtype inspired by the implementation of pdf.js as proposed by Mike Li on dev@
------------------------------------------
Started by an SCM change
Running as SYSTEM
[EnvInject] - Loading node environment variables.
Building remotely on builds30 (ubuntu) in workspace <https://ci-builds.apache.org/job/PDFBox/job/PDFBox-Trunk-jdk21/ws/>
Cleaning up <https://ci-builds.apache.org/job/PDFBox/job/PDFBox-Trunk-jdk21/ws/.>
Deleting <https://ci-builds.apache.org/job/PDFBox/job/PDFBox-Trunk-jdk21/ws/target>
Updating http://svn.apache.org/repos/asf/pdfbox/trunk at revision '2024-01-21T17:23:10.376 +0000' --quiet
At revision 1915353
Parsing POMs
Modules changed, recalculating dependency graph
Established TCP socket on 33683
maven35-agent.jar already up to date
maven35-interceptor.jar already up to date
maven3-interceptor-commons.jar already up to date
[PDFBox-Trunk-jdk21] $ /home/jenkins/tools/java/latest21/bin/java -cp /home/jenkins/jenkins-agent/maven35-agent.jar:/home/jenkins/tools/maven/latest/boot/plexus-classworlds-2.7.0.jar:/home/jenkins/tools/maven/latest/conf/logging jenkins.maven3.agent.Maven35Main /home/jenkins/tools/maven/latest /home/jenkins/jenkins-agent/agent.jar /home/jenkins/jenkins-agent/maven35-interceptor.jar /home/jenkins/jenkins-agent/maven3-interceptor-commons.jar 33683
<===[JENKINS REMOTING CAPACITY]===> channel started
Executing Maven: -B -f <https://ci-builds.apache.org/job/PDFBox/job/PDFBox-Trunk-jdk21/ws/pom.xml> clean install -Ppedantic -Dmaven.source.skip=true org.sonatype.ossindex.maven:ossindex-maven-plugin:audit
[INFO] Scanning for projects...
[HUDSON] Collecting dependencies info
[HUDSON] Collecting dependencies info
[HUDSON] Collecting dependencies info
[HUDSON] Collecting dependencies info
[HUDSON] Collecting dependencies info
[HUDSON] Collecting dependencies info
[HUDSON] Collecting dependencies info
[HUDSON] Collecting dependencies info
[HUDSON] Collecting dependencies info
[HUDSON] Collecting dependencies info
[HUDSON] Collecting dependencies info
[INFO] ------------------------------------------------------------------------
[INFO] Reactor Build Order:
[INFO]
[INFO] Apache PDFBox parent [pom]
[INFO] Apache PDFBox io [bundle]
[INFO] Apache FontBox [bundle]
[INFO] Apache XmpBox [bundle]
[INFO] Apache PDFBox [bundle]
[INFO] Apache PDFBox Debugger [jar]
[INFO] Apache PDFBox tools [jar]
[INFO] Apache PDFBox application [jar]
[INFO] Apache PDFBox Debugger application [jar]
[INFO] Apache PDFBox examples [jar]
[INFO] Apache PDFBox release [pom]
[INFO] Downloading from Nexus: https://repository.apache.org/snapshots/org/sonatype/ossindex/maven/ossindex-maven-plugin/maven-metadata.xml
[INFO]
[INFO] ------------------< org.apache.pdfbox:pdfbox-parent >-------------------
[INFO] Building Apache PDFBox parent 4.0.0-SNAPSHOT [1/11]
[INFO] from pom.xml
[INFO] --------------------------------[ pom ]---------------------------------
[INFO]
[INFO] --- clean:3.3.2:clean (default-clean) @ pdfbox-parent ---
[INFO]
[INFO] --- enforcer:3.4.1:enforce (default) @ pdfbox-parent ---
[INFO] Rule 0: org.apache.maven.enforcer.rules.version.RequireMavenVersion passed
[INFO]
[INFO] --- enforcer:3.4.1:enforce (enforce-maven-version) @ pdfbox-parent ---
[INFO] Rule 0: org.apache.maven.enforcer.rules.version.RequireMavenVersion passed
[INFO]
[INFO] --- enforcer:3.4.1:enforce (enforce-java-version) @ pdfbox-parent ---
[INFO] Rule 0: org.apache.maven.enforcer.rules.version.RequireJavaVersion passed
[INFO]
[INFO] --- jacoco:0.8.11:prepare-agent (default) @ pdfbox-parent ---
[INFO] surefireArgLine set to -javaagent:/home/jenkins/.m2/repository/org/jacoco/org.jacoco.agent/0.8.11/org.jacoco.agent-0.8.11-runtime.jar=destfile=<https://ci-builds.apache.org/job/PDFBox/job/PDFBox-Trunk-jdk21/ws/target/jacoco.exec>
[INFO]
[INFO] --- remote-resources:3.1.0:process (process-resource-bundles) @ pdfbox-parent ---
[INFO] Preparing remote bundle org.apache.apache.resources:apache-jar-resource-bundle:1.5
[INFO] Copying 3 resources from 1 bundle.
[INFO]
[INFO] --- jacoco:0.8.11:report (report) @ pdfbox-parent ---
[INFO] Skipping JaCoCo execution due to missing execution data file.
[INFO]
[INFO] --- site:3.12.1:attach-descriptor (attach-descriptor) @ pdfbox-parent ---
[INFO] No site descriptor found: nothing to attach.
[INFO]
[INFO] --- source:3.3.0:jar-no-fork (attach-sources) @ pdfbox-parent ---
[INFO] Skipping source per configuration.
[INFO]
[INFO] --- apache-rat:0.16:check (default) @ pdfbox-parent ---
[INFO] Rat check: Summary over all files. Unapproved: 0, unknown: 0, generated: 0, approved: 10 licenses.
[INFO]
[INFO] --- dependency-check:9.0.9:check (default) @ pdfbox-parent ---
[ERROR] Incompatible or corrupt database found. To resolve this issue please remove the existing database by running purge
[WARNING] Attempt to (de-)serialize anonymous class org.jfrog.hudson.maven2.MavenDependenciesRecorder$1; see: https://jenkins.io/redirect/serialization-of-anonymous-classes/
[INFO] ------------------------------------------------------------------------
[INFO] Reactor Summary for Apache PDFBox parent 4.0.0-SNAPSHOT:
[INFO]
[INFO] Apache PDFBox parent ............................... FAILURE [ 17.887 s]
[INFO] Apache PDFBox io ................................... SKIPPED
[INFO] Apache FontBox ..................................... SKIPPED
[INFO] Apache XmpBox ...................................... SKIPPED
[INFO] Apache PDFBox ...................................... SKIPPED
[INFO] Apache PDFBox Debugger ............................. SKIPPED
[INFO] Apache PDFBox tools ................................ SKIPPED
[INFO] Apache PDFBox application .......................... SKIPPED
[INFO] Apache PDFBox Debugger application ................. SKIPPED
[INFO] Apache PDFBox examples ............................. SKIPPED
[INFO] Apache PDFBox release .............................. SKIPPED
[INFO] ------------------------------------------------------------------------
[INFO] BUILD FAILURE
[INFO] ------------------------------------------------------------------------
[INFO] Total time: 43.992 s
[INFO] Finished at: 2024-01-21T17:24:33Z
[INFO] ------------------------------------------------------------------------
Waiting for Jenkins to finish collecting data
[ERROR] Failed to execute goal org.owasp:dependency-check-maven:9.0.9:check (default) on project pdfbox-parent: Fatal exception(s) analyzing Apache PDFBox parent: One or more exceptions occurred during analysis:
[ERROR] DatabaseException: Unable to connect to the dependency-check database
[ERROR] caused by DatabaseException: Incompatible or corrupt database found; run the purge command to resolve the issue
[ERROR] -> [Help 1]
[ERROR]
[ERROR] To see the full stack trace of the errors, re-run Maven with the -e switch.
[ERROR] Re-run Maven using the -X switch to enable full debug logging.
[ERROR]
[ERROR] For more information about the errors and possible solutions, please read the following articles:
[ERROR] [Help 1] http://cwiki.apache.org/confluence/display/MAVEN/MojoExecutionException
[JENKINS] Archiving <https://ci-builds.apache.org/job/PDFBox/job/PDFBox-Trunk-jdk21/ws/xmpbox/pom.xml> to org.apache.pdfbox/xmpbox/4.0.0-SNAPSHOT/xmpbox-4.0.0-SNAPSHOT.pom
[JENKINS] Archiving <https://ci-builds.apache.org/job/PDFBox/job/PDFBox-Trunk-jdk21/ws/tools/pom.xml> to org.apache.pdfbox/pdfbox-tools/4.0.0-SNAPSHOT/pdfbox-tools-4.0.0-SNAPSHOT.pom
[JENKINS] Archiving <https://ci-builds.apache.org/job/PDFBox/job/PDFBox-Trunk-jdk21/ws/debugger/pom.xml> to org.apache.pdfbox/pdfbox-debugger/4.0.0-SNAPSHOT/pdfbox-debugger-4.0.0-SNAPSHOT.pom
[JENKINS] Archiving <https://ci-builds.apache.org/job/PDFBox/job/PDFBox-Trunk-jdk21/ws/app/pom.xml> to org.apache.pdfbox/pdfbox-app/4.0.0-SNAPSHOT/pdfbox-app-4.0.0-SNAPSHOT.pom
[JENKINS] Archiving <https://ci-builds.apache.org/job/PDFBox/job/PDFBox-Trunk-jdk21/ws/examples/pom.xml> to org.apache.pdfbox/pdfbox-examples/4.0.0-SNAPSHOT/pdfbox-examples-4.0.0-SNAPSHOT.pom
[JENKINS] Archiving <https://ci-builds.apache.org/job/PDFBox/job/PDFBox-Trunk-jdk21/ws/release/pom.xml> to org.apache.pdfbox/pdfbox-release/4.0.0-SNAPSHOT/pdfbox-release-4.0.0-SNAPSHOT.pom
[JENKINS] Archiving <https://ci-builds.apache.org/job/PDFBox/job/PDFBox-Trunk-jdk21/ws/pom.xml> to org.apache.pdfbox/pdfbox-parent/4.0.0-SNAPSHOT/pdfbox-parent-4.0.0-SNAPSHOT.pom
[JENKINS] Archiving <https://ci-builds.apache.org/job/PDFBox/job/PDFBox-Trunk-jdk21/ws/pdfbox/pom.xml> to org.apache.pdfbox/pdfbox/4.0.0-SNAPSHOT/pdfbox-4.0.0-SNAPSHOT.pom
[JENKINS] Archiving <https://ci-builds.apache.org/job/PDFBox/job/PDFBox-Trunk-jdk21/ws/debugger-app/pom.xml> to org.apache.pdfbox/debugger-app/4.0.0-SNAPSHOT/debugger-app-4.0.0-SNAPSHOT.pom
[JENKINS] Archiving <https://ci-builds.apache.org/job/PDFBox/job/PDFBox-Trunk-jdk21/ws/io/pom.xml> to org.apache.pdfbox/pdfbox-io/4.0.0-SNAPSHOT/pdfbox-io-4.0.0-SNAPSHOT.pom
[JENKINS] Archiving <https://ci-builds.apache.org/job/PDFBox/job/PDFBox-Trunk-jdk21/ws/fontbox/pom.xml> to org.apache.pdfbox/fontbox/4.0.0-SNAPSHOT/fontbox-4.0.0-SNAPSHOT.pom
No mail will be sent out, as 'PDFBox » PDFBox-Trunk-jdk21 » Apache XmpBox #951' does not have a result yet. Please make sure you set a proper result in case of pipeline/build scripts.
No mail will be sent out, as 'PDFBox » PDFBox-Trunk-jdk21 » Apache PDFBox tools #951' does not have a result yet. Please make sure you set a proper result in case of pipeline/build scripts.
No mail will be sent out, as 'PDFBox » PDFBox-Trunk-jdk21 » Apache PDFBox Debugger #951' does not have a result yet. Please make sure you set a proper result in case of pipeline/build scripts.
No mail will be sent out, as 'PDFBox » PDFBox-Trunk-jdk21 » Apache PDFBox application #951' does not have a result yet. Please make sure you set a proper result in case of pipeline/build scripts.
No mail will be sent out, as 'PDFBox » PDFBox-Trunk-jdk21 » Apache PDFBox examples #951' does not have a result yet. Please make sure you set a proper result in case of pipeline/build scripts.
No mail will be sent out, as 'PDFBox » PDFBox-Trunk-jdk21 » Apache PDFBox release #951' does not have a result yet. Please make sure you set a proper result in case of pipeline/build scripts.
Sending e-mails to: dev@pdfbox.apache.org
No mail will be sent out, as 'PDFBox » PDFBox-Trunk-jdk21 » Apache PDFBox #951' does not have a result yet. Please make sure you set a proper result in case of pipeline/build scripts.
No mail will be sent out, as 'PDFBox » PDFBox-Trunk-jdk21 » Apache PDFBox Debugger application #951' does not have a result yet. Please make sure you set a proper result in case of pipeline/build scripts.
No mail will be sent out, as 'PDFBox » PDFBox-Trunk-jdk21 » Apache PDFBox io #951' does not have a result yet. Please make sure you set a proper result in case of pipeline/build scripts.
No mail will be sent out, as 'PDFBox » PDFBox-Trunk-jdk21 » Apache FontBox #951' does not have a result yet. Please make sure you set a proper result in case of pipeline/build scripts.
channel stopped
Archiving artifacts
---------------------------------------------------------------------
To unsubscribe, e-mail: dev-unsubscribe@pdfbox.apache.org
For additional commands, e-mail: dev-help@pdfbox.apache.org
Jenkins build is back to normal : PDFBox » PDFBox-Trunk-jdk21 #955
Posted by Apache Jenkins Server <je...@builds.apache.org>.
See <https://ci-builds.apache.org/job/PDFBox/job/PDFBox-Trunk-jdk21/955/display/redirect>
---------------------------------------------------------------------
To unsubscribe, e-mail: dev-unsubscribe@pdfbox.apache.org
For additional commands, e-mail: dev-help@pdfbox.apache.org
Build failed in Jenkins: PDFBox » PDFBox-Trunk-jdk21 #954
Posted by Apache Jenkins Server <je...@builds.apache.org>.
See <https://ci-builds.apache.org/job/PDFBox/job/PDFBox-Trunk-jdk21/954/display/redirect>
Changes:
------------------------------------------
Started by user Tilman Hausherr
Running as SYSTEM
[EnvInject] - Loading node environment variables.
Building remotely on builds30 (ubuntu) in workspace <https://ci-builds.apache.org/job/PDFBox/job/PDFBox-Trunk-jdk21/ws/>
Checking out a fresh workspace because there's no workspace at <https://ci-builds.apache.org/job/PDFBox/job/PDFBox-Trunk-jdk21/ws/>
Cleaning local Directory .
Checking out http://svn.apache.org/repos/asf/pdfbox/trunk at revision '2024-01-21T18:55:54.311 +0000' --quiet
At revision 1915354
No changes for http://svn.apache.org/repos/asf/pdfbox/trunk since the previous build
Parsing POMs
Modules changed, recalculating dependency graph
Established TCP socket on 35663
maven35-agent.jar already up to date
maven35-interceptor.jar already up to date
maven3-interceptor-commons.jar already up to date
[PDFBox-Trunk-jdk21] $ /home/jenkins/tools/java/latest21/bin/java -cp /home/jenkins/jenkins-agent/maven35-agent.jar:/home/jenkins/tools/maven/latest/boot/plexus-classworlds-2.7.0.jar:/home/jenkins/tools/maven/latest/conf/logging jenkins.maven3.agent.Maven35Main /home/jenkins/tools/maven/latest /home/jenkins/jenkins-agent/agent.jar /home/jenkins/jenkins-agent/maven35-interceptor.jar /home/jenkins/jenkins-agent/maven3-interceptor-commons.jar 35663
<===[JENKINS REMOTING CAPACITY]===> channel started
Executing Maven: -B -f <https://ci-builds.apache.org/job/PDFBox/job/PDFBox-Trunk-jdk21/ws/pom.xml> clean install -Ppedantic -Dmaven.source.skip=true org.sonatype.ossindex.maven:ossindex-maven-plugin:audit
[INFO] Scanning for projects...
[HUDSON] Collecting dependencies info
[HUDSON] Collecting dependencies info
[HUDSON] Collecting dependencies info
[HUDSON] Collecting dependencies info
[HUDSON] Collecting dependencies info
[HUDSON] Collecting dependencies info
[HUDSON] Collecting dependencies info
[HUDSON] Collecting dependencies info
[HUDSON] Collecting dependencies info
[HUDSON] Collecting dependencies info
[HUDSON] Collecting dependencies info
[INFO] ------------------------------------------------------------------------
[INFO] Reactor Build Order:
[INFO]
[INFO] Apache PDFBox parent [pom]
[INFO] Apache PDFBox io [bundle]
[INFO] Apache FontBox [bundle]
[INFO] Apache XmpBox [bundle]
[INFO] Apache PDFBox [bundle]
[INFO] Apache PDFBox Debugger [jar]
[INFO] Apache PDFBox tools [jar]
[INFO] Apache PDFBox application [jar]
[INFO] Apache PDFBox Debugger application [jar]
[INFO] Apache PDFBox examples [jar]
[INFO] Apache PDFBox release [pom]
[INFO]
[INFO] ------------------< org.apache.pdfbox:pdfbox-parent >-------------------
[INFO] Building Apache PDFBox parent 4.0.0-SNAPSHOT [1/11]
[INFO] from pom.xml
[INFO] --------------------------------[ pom ]---------------------------------
[INFO]
[INFO] --- clean:3.3.2:clean (default-clean) @ pdfbox-parent ---
[INFO]
[INFO] --- enforcer:3.4.1:enforce (default) @ pdfbox-parent ---
[INFO] Rule 0: org.apache.maven.enforcer.rules.version.RequireMavenVersion passed
[INFO]
[INFO] --- enforcer:3.4.1:enforce (enforce-maven-version) @ pdfbox-parent ---
[INFO] Rule 0: org.apache.maven.enforcer.rules.version.RequireMavenVersion passed
[INFO]
[INFO] --- enforcer:3.4.1:enforce (enforce-java-version) @ pdfbox-parent ---
[INFO] Rule 0: org.apache.maven.enforcer.rules.version.RequireJavaVersion passed
[INFO]
[INFO] --- jacoco:0.8.11:prepare-agent (default) @ pdfbox-parent ---
[INFO] surefireArgLine set to -javaagent:/home/jenkins/.m2/repository/org/jacoco/org.jacoco.agent/0.8.11/org.jacoco.agent-0.8.11-runtime.jar=destfile=<https://ci-builds.apache.org/job/PDFBox/job/PDFBox-Trunk-jdk21/ws/target/jacoco.exec>
[INFO]
[INFO] --- remote-resources:3.1.0:process (process-resource-bundles) @ pdfbox-parent ---
[INFO] Preparing remote bundle org.apache.apache.resources:apache-jar-resource-bundle:1.5
[INFO] Copying 3 resources from 1 bundle.
[INFO]
[INFO] --- jacoco:0.8.11:report (report) @ pdfbox-parent ---
[INFO] Skipping JaCoCo execution due to missing execution data file.
[INFO]
[INFO] --- site:3.12.1:attach-descriptor (attach-descriptor) @ pdfbox-parent ---
[INFO] No site descriptor found: nothing to attach.
[INFO]
[INFO] --- source:3.3.0:jar-no-fork (attach-sources) @ pdfbox-parent ---
[INFO] Skipping source per configuration.
[INFO]
[INFO] --- apache-rat:0.16:check (default) @ pdfbox-parent ---
[INFO] Rat check: Summary over all files. Unapproved: 0, unknown: 0, generated: 0, approved: 10 licenses.
[INFO]
[INFO] --- dependency-check:9.0.9:check (default) @ pdfbox-parent ---
[ERROR] Incompatible or corrupt database found. To resolve this issue please remove the existing database by running purge
[WARNING] Attempt to (de-)serialize anonymous class org.jfrog.hudson.maven2.MavenDependenciesRecorder$1; see: https://jenkins.io/redirect/serialization-of-anonymous-classes/
[INFO] ------------------------------------------------------------------------
[INFO] Reactor Summary for Apache PDFBox parent 4.0.0-SNAPSHOT:
[INFO]
[INFO] Apache PDFBox parent ............................... FAILURE [ 16.960 s]
[INFO] Apache PDFBox io ................................... SKIPPED
[INFO] Apache FontBox ..................................... SKIPPED
[INFO] Apache XmpBox ...................................... SKIPPED
[INFO] Apache PDFBox ...................................... SKIPPED
[INFO] Apache PDFBox Debugger ............................. SKIPPED
[INFO] Apache PDFBox tools ................................ SKIPPED
[INFO] Apache PDFBox application .......................... SKIPPED
[INFO] Apache PDFBox Debugger application ................. SKIPPED
[INFO] Apache PDFBox examples ............................. SKIPPED
[INFO] Apache PDFBox release .............................. SKIPPED
[INFO] ------------------------------------------------------------------------
[INFO] BUILD FAILURE
[INFO] ------------------------------------------------------------------------
[INFO] Total time: 43.157 s
[INFO] Finished at: 2024-01-21T18:57:28Z
[INFO] ------------------------------------------------------------------------
Waiting for Jenkins to finish collecting data
[ERROR] Failed to execute goal org.owasp:dependency-check-maven:9.0.9:check (default) on project pdfbox-parent: Fatal exception(s) analyzing Apache PDFBox parent: One or more exceptions occurred during analysis:
[ERROR] DatabaseException: Unable to connect to the dependency-check database
[ERROR] caused by DatabaseException: Incompatible or corrupt database found; run the purge command to resolve the issue
[ERROR] -> [Help 1]
[ERROR]
[ERROR] To see the full stack trace of the errors, re-run Maven with the -e switch.
[ERROR] Re-run Maven using the -X switch to enable full debug logging.
[ERROR]
[ERROR] For more information about the errors and possible solutions, please read the following articles:
[ERROR] [Help 1] http://cwiki.apache.org/confluence/display/MAVEN/MojoExecutionException
[JENKINS] Archiving <https://ci-builds.apache.org/job/PDFBox/job/PDFBox-Trunk-jdk21/ws/xmpbox/pom.xml> to org.apache.pdfbox/xmpbox/4.0.0-SNAPSHOT/xmpbox-4.0.0-SNAPSHOT.pom
[JENKINS] Archiving <https://ci-builds.apache.org/job/PDFBox/job/PDFBox-Trunk-jdk21/ws/tools/pom.xml> to org.apache.pdfbox/pdfbox-tools/4.0.0-SNAPSHOT/pdfbox-tools-4.0.0-SNAPSHOT.pom
[JENKINS] Archiving <https://ci-builds.apache.org/job/PDFBox/job/PDFBox-Trunk-jdk21/ws/debugger/pom.xml> to org.apache.pdfbox/pdfbox-debugger/4.0.0-SNAPSHOT/pdfbox-debugger-4.0.0-SNAPSHOT.pom
[JENKINS] Archiving <https://ci-builds.apache.org/job/PDFBox/job/PDFBox-Trunk-jdk21/ws/app/pom.xml> to org.apache.pdfbox/pdfbox-app/4.0.0-SNAPSHOT/pdfbox-app-4.0.0-SNAPSHOT.pom
[JENKINS] Archiving <https://ci-builds.apache.org/job/PDFBox/job/PDFBox-Trunk-jdk21/ws/examples/pom.xml> to org.apache.pdfbox/pdfbox-examples/4.0.0-SNAPSHOT/pdfbox-examples-4.0.0-SNAPSHOT.pom
[JENKINS] Archiving <https://ci-builds.apache.org/job/PDFBox/job/PDFBox-Trunk-jdk21/ws/release/pom.xml> to org.apache.pdfbox/pdfbox-release/4.0.0-SNAPSHOT/pdfbox-release-4.0.0-SNAPSHOT.pom
[JENKINS] Archiving <https://ci-builds.apache.org/job/PDFBox/job/PDFBox-Trunk-jdk21/ws/pom.xml> to org.apache.pdfbox/pdfbox-parent/4.0.0-SNAPSHOT/pdfbox-parent-4.0.0-SNAPSHOT.pom
[JENKINS] Archiving <https://ci-builds.apache.org/job/PDFBox/job/PDFBox-Trunk-jdk21/ws/pdfbox/pom.xml> to org.apache.pdfbox/pdfbox/4.0.0-SNAPSHOT/pdfbox-4.0.0-SNAPSHOT.pom
[JENKINS] Archiving <https://ci-builds.apache.org/job/PDFBox/job/PDFBox-Trunk-jdk21/ws/debugger-app/pom.xml> to org.apache.pdfbox/debugger-app/4.0.0-SNAPSHOT/debugger-app-4.0.0-SNAPSHOT.pom
[JENKINS] Archiving <https://ci-builds.apache.org/job/PDFBox/job/PDFBox-Trunk-jdk21/ws/io/pom.xml> to org.apache.pdfbox/pdfbox-io/4.0.0-SNAPSHOT/pdfbox-io-4.0.0-SNAPSHOT.pom
[JENKINS] Archiving <https://ci-builds.apache.org/job/PDFBox/job/PDFBox-Trunk-jdk21/ws/fontbox/pom.xml> to org.apache.pdfbox/fontbox/4.0.0-SNAPSHOT/fontbox-4.0.0-SNAPSHOT.pom
No mail will be sent out, as 'PDFBox » PDFBox-Trunk-jdk21 » Apache XmpBox #954' does not have a result yet. Please make sure you set a proper result in case of pipeline/build scripts.
No mail will be sent out, as 'PDFBox » PDFBox-Trunk-jdk21 » Apache PDFBox tools #954' does not have a result yet. Please make sure you set a proper result in case of pipeline/build scripts.
No mail will be sent out, as 'PDFBox » PDFBox-Trunk-jdk21 » Apache PDFBox Debugger #954' does not have a result yet. Please make sure you set a proper result in case of pipeline/build scripts.
No mail will be sent out, as 'PDFBox » PDFBox-Trunk-jdk21 » Apache PDFBox application #954' does not have a result yet. Please make sure you set a proper result in case of pipeline/build scripts.
No mail will be sent out, as 'PDFBox » PDFBox-Trunk-jdk21 » Apache PDFBox examples #954' does not have a result yet. Please make sure you set a proper result in case of pipeline/build scripts.
No mail will be sent out, as 'PDFBox » PDFBox-Trunk-jdk21 » Apache PDFBox release #954' does not have a result yet. Please make sure you set a proper result in case of pipeline/build scripts.
Sending e-mails to: dev@pdfbox.apache.org
No mail will be sent out, as 'PDFBox » PDFBox-Trunk-jdk21 » Apache PDFBox #954' does not have a result yet. Please make sure you set a proper result in case of pipeline/build scripts.
No mail will be sent out, as 'PDFBox » PDFBox-Trunk-jdk21 » Apache PDFBox Debugger application #954' does not have a result yet. Please make sure you set a proper result in case of pipeline/build scripts.
No mail will be sent out, as 'PDFBox » PDFBox-Trunk-jdk21 » Apache PDFBox io #954' does not have a result yet. Please make sure you set a proper result in case of pipeline/build scripts.
No mail will be sent out, as 'PDFBox » PDFBox-Trunk-jdk21 » Apache FontBox #954' does not have a result yet. Please make sure you set a proper result in case of pipeline/build scripts.
channel stopped
Archiving artifacts
---------------------------------------------------------------------
To unsubscribe, e-mail: dev-unsubscribe@pdfbox.apache.org
For additional commands, e-mail: dev-help@pdfbox.apache.org
Build failed in Jenkins: PDFBox » PDFBox-Trunk-jdk21 #953
Posted by Apache Jenkins Server <je...@builds.apache.org>.
See <https://ci-builds.apache.org/job/PDFBox/job/PDFBox-Trunk-jdk21/953/display/redirect>
Changes:
------------------------------------------
Started by user Tilman Hausherr
Running as SYSTEM
[EnvInject] - Loading node environment variables.
Building remotely on builds30 (ubuntu) in workspace <https://ci-builds.apache.org/job/PDFBox/job/PDFBox-Trunk-jdk21/ws/>
Checking out a fresh workspace because there's no workspace at <https://ci-builds.apache.org/job/PDFBox/job/PDFBox-Trunk-jdk21/ws/>
Cleaning local Directory .
Checking out http://svn.apache.org/repos/asf/pdfbox/trunk at revision '2024-01-21T18:41:16.891 +0000' --quiet
At revision 1915353
No changes for http://svn.apache.org/repos/asf/pdfbox/trunk since the previous build
Parsing POMs
Modules changed, recalculating dependency graph
Established TCP socket on 44675
maven35-agent.jar already up to date
maven35-interceptor.jar already up to date
maven3-interceptor-commons.jar already up to date
[PDFBox-Trunk-jdk21] $ /home/jenkins/tools/java/latest21/bin/java -cp /home/jenkins/jenkins-agent/maven35-agent.jar:/home/jenkins/tools/maven/latest/boot/plexus-classworlds-2.7.0.jar:/home/jenkins/tools/maven/latest/conf/logging jenkins.maven3.agent.Maven35Main /home/jenkins/tools/maven/latest /home/jenkins/jenkins-agent/agent.jar /home/jenkins/jenkins-agent/maven35-interceptor.jar /home/jenkins/jenkins-agent/maven3-interceptor-commons.jar 44675
<===[JENKINS REMOTING CAPACITY]===> channel started
Executing Maven: -B -f <https://ci-builds.apache.org/job/PDFBox/job/PDFBox-Trunk-jdk21/ws/pom.xml> clean install -Ppedantic -Dmaven.source.skip=true org.sonatype.ossindex.maven:ossindex-maven-plugin:audit
[INFO] Scanning for projects...
[HUDSON] Collecting dependencies info
[HUDSON] Collecting dependencies info
[HUDSON] Collecting dependencies info
[HUDSON] Collecting dependencies info
[HUDSON] Collecting dependencies info
[HUDSON] Collecting dependencies info
[HUDSON] Collecting dependencies info
[HUDSON] Collecting dependencies info
[HUDSON] Collecting dependencies info
[HUDSON] Collecting dependencies info
[HUDSON] Collecting dependencies info
[INFO] ------------------------------------------------------------------------
[INFO] Reactor Build Order:
[INFO]
[INFO] Apache PDFBox parent [pom]
[INFO] Apache PDFBox io [bundle]
[INFO] Apache FontBox [bundle]
[INFO] Apache XmpBox [bundle]
[INFO] Apache PDFBox [bundle]
[INFO] Apache PDFBox Debugger [jar]
[INFO] Apache PDFBox tools [jar]
[INFO] Apache PDFBox application [jar]
[INFO] Apache PDFBox Debugger application [jar]
[INFO] Apache PDFBox examples [jar]
[INFO] Apache PDFBox release [pom]
[INFO]
[INFO] ------------------< org.apache.pdfbox:pdfbox-parent >-------------------
[INFO] Building Apache PDFBox parent 4.0.0-SNAPSHOT [1/11]
[INFO] from pom.xml
[INFO] --------------------------------[ pom ]---------------------------------
[INFO]
[INFO] --- clean:3.3.2:clean (default-clean) @ pdfbox-parent ---
[INFO]
[INFO] --- enforcer:3.4.1:enforce (default) @ pdfbox-parent ---
[INFO] Rule 0: org.apache.maven.enforcer.rules.version.RequireMavenVersion passed
[INFO]
[INFO] --- enforcer:3.4.1:enforce (enforce-maven-version) @ pdfbox-parent ---
[INFO] Rule 0: org.apache.maven.enforcer.rules.version.RequireMavenVersion passed
[INFO]
[INFO] --- enforcer:3.4.1:enforce (enforce-java-version) @ pdfbox-parent ---
[INFO] Rule 0: org.apache.maven.enforcer.rules.version.RequireJavaVersion passed
[INFO]
[INFO] --- jacoco:0.8.11:prepare-agent (default) @ pdfbox-parent ---
[INFO] surefireArgLine set to -javaagent:/home/jenkins/.m2/repository/org/jacoco/org.jacoco.agent/0.8.11/org.jacoco.agent-0.8.11-runtime.jar=destfile=<https://ci-builds.apache.org/job/PDFBox/job/PDFBox-Trunk-jdk21/ws/target/jacoco.exec>
[INFO]
[INFO] --- remote-resources:3.1.0:process (process-resource-bundles) @ pdfbox-parent ---
[INFO] Preparing remote bundle org.apache.apache.resources:apache-jar-resource-bundle:1.5
[INFO] Copying 3 resources from 1 bundle.
[INFO]
[INFO] --- jacoco:0.8.11:report (report) @ pdfbox-parent ---
[INFO] Skipping JaCoCo execution due to missing execution data file.
[INFO]
[INFO] --- site:3.12.1:attach-descriptor (attach-descriptor) @ pdfbox-parent ---
[INFO] No site descriptor found: nothing to attach.
[INFO]
[INFO] --- source:3.3.0:jar-no-fork (attach-sources) @ pdfbox-parent ---
[INFO] Skipping source per configuration.
[INFO]
[INFO] --- apache-rat:0.16:check (default) @ pdfbox-parent ---
[INFO] Rat check: Summary over all files. Unapproved: 0, unknown: 0, generated: 0, approved: 10 licenses.
[INFO]
[INFO] --- dependency-check:9.0.9:check (default) @ pdfbox-parent ---
[ERROR] Incompatible or corrupt database found. To resolve this issue please remove the existing database by running purge
[WARNING] Attempt to (de-)serialize anonymous class org.jfrog.hudson.maven2.MavenDependenciesRecorder$1; see: https://jenkins.io/redirect/serialization-of-anonymous-classes/
[INFO] ------------------------------------------------------------------------
[INFO] Reactor Summary for Apache PDFBox parent 4.0.0-SNAPSHOT:
[INFO]
[INFO] Apache PDFBox parent ............................... FAILURE [ 17.375 s]
[INFO] Apache PDFBox io ................................... SKIPPED
[INFO] Apache FontBox ..................................... SKIPPED
[INFO] Apache XmpBox ...................................... SKIPPED
[INFO] Apache PDFBox ...................................... SKIPPED
[INFO] Apache PDFBox Debugger ............................. SKIPPED
[INFO] Apache PDFBox tools ................................ SKIPPED
[INFO] Apache PDFBox application .......................... SKIPPED
[INFO] Apache PDFBox Debugger application ................. SKIPPED
[INFO] Apache PDFBox examples ............................. SKIPPED
[INFO] Apache PDFBox release .............................. SKIPPED
[INFO] ------------------------------------------------------------------------
[INFO] BUILD FAILURE
[INFO] ------------------------------------------------------------------------
[INFO] Total time: 42.014 s
[INFO] Finished at: 2024-01-21T18:42:52Z
[INFO] ------------------------------------------------------------------------
Waiting for Jenkins to finish collecting data
[ERROR] Failed to execute goal org.owasp:dependency-check-maven:9.0.9:check (default) on project pdfbox-parent: Fatal exception(s) analyzing Apache PDFBox parent: One or more exceptions occurred during analysis:
[ERROR] DatabaseException: Unable to connect to the dependency-check database
[ERROR] caused by DatabaseException: Incompatible or corrupt database found; run the purge command to resolve the issue
[ERROR] -> [Help 1]
[ERROR]
[ERROR] To see the full stack trace of the errors, re-run Maven with the -e switch.
[ERROR] Re-run Maven using the -X switch to enable full debug logging.
[ERROR]
[ERROR] For more information about the errors and possible solutions, please read the following articles:
[ERROR] [Help 1] http://cwiki.apache.org/confluence/display/MAVEN/MojoExecutionException
[JENKINS] Archiving <https://ci-builds.apache.org/job/PDFBox/job/PDFBox-Trunk-jdk21/ws/xmpbox/pom.xml> to org.apache.pdfbox/xmpbox/4.0.0-SNAPSHOT/xmpbox-4.0.0-SNAPSHOT.pom
[JENKINS] Archiving <https://ci-builds.apache.org/job/PDFBox/job/PDFBox-Trunk-jdk21/ws/tools/pom.xml> to org.apache.pdfbox/pdfbox-tools/4.0.0-SNAPSHOT/pdfbox-tools-4.0.0-SNAPSHOT.pom
[JENKINS] Archiving <https://ci-builds.apache.org/job/PDFBox/job/PDFBox-Trunk-jdk21/ws/debugger/pom.xml> to org.apache.pdfbox/pdfbox-debugger/4.0.0-SNAPSHOT/pdfbox-debugger-4.0.0-SNAPSHOT.pom
[JENKINS] Archiving <https://ci-builds.apache.org/job/PDFBox/job/PDFBox-Trunk-jdk21/ws/app/pom.xml> to org.apache.pdfbox/pdfbox-app/4.0.0-SNAPSHOT/pdfbox-app-4.0.0-SNAPSHOT.pom
[JENKINS] Archiving <https://ci-builds.apache.org/job/PDFBox/job/PDFBox-Trunk-jdk21/ws/examples/pom.xml> to org.apache.pdfbox/pdfbox-examples/4.0.0-SNAPSHOT/pdfbox-examples-4.0.0-SNAPSHOT.pom
[JENKINS] Archiving <https://ci-builds.apache.org/job/PDFBox/job/PDFBox-Trunk-jdk21/ws/release/pom.xml> to org.apache.pdfbox/pdfbox-release/4.0.0-SNAPSHOT/pdfbox-release-4.0.0-SNAPSHOT.pom
[JENKINS] Archiving <https://ci-builds.apache.org/job/PDFBox/job/PDFBox-Trunk-jdk21/ws/pom.xml> to org.apache.pdfbox/pdfbox-parent/4.0.0-SNAPSHOT/pdfbox-parent-4.0.0-SNAPSHOT.pom
[JENKINS] Archiving <https://ci-builds.apache.org/job/PDFBox/job/PDFBox-Trunk-jdk21/ws/pdfbox/pom.xml> to org.apache.pdfbox/pdfbox/4.0.0-SNAPSHOT/pdfbox-4.0.0-SNAPSHOT.pom
[JENKINS] Archiving <https://ci-builds.apache.org/job/PDFBox/job/PDFBox-Trunk-jdk21/ws/debugger-app/pom.xml> to org.apache.pdfbox/debugger-app/4.0.0-SNAPSHOT/debugger-app-4.0.0-SNAPSHOT.pom
[JENKINS] Archiving <https://ci-builds.apache.org/job/PDFBox/job/PDFBox-Trunk-jdk21/ws/io/pom.xml> to org.apache.pdfbox/pdfbox-io/4.0.0-SNAPSHOT/pdfbox-io-4.0.0-SNAPSHOT.pom
[JENKINS] Archiving <https://ci-builds.apache.org/job/PDFBox/job/PDFBox-Trunk-jdk21/ws/fontbox/pom.xml> to org.apache.pdfbox/fontbox/4.0.0-SNAPSHOT/fontbox-4.0.0-SNAPSHOT.pom
No mail will be sent out, as 'PDFBox » PDFBox-Trunk-jdk21 » Apache XmpBox #953' does not have a result yet. Please make sure you set a proper result in case of pipeline/build scripts.
No mail will be sent out, as 'PDFBox » PDFBox-Trunk-jdk21 » Apache PDFBox tools #953' does not have a result yet. Please make sure you set a proper result in case of pipeline/build scripts.
No mail will be sent out, as 'PDFBox » PDFBox-Trunk-jdk21 » Apache PDFBox Debugger #953' does not have a result yet. Please make sure you set a proper result in case of pipeline/build scripts.
No mail will be sent out, as 'PDFBox » PDFBox-Trunk-jdk21 » Apache PDFBox application #953' does not have a result yet. Please make sure you set a proper result in case of pipeline/build scripts.
No mail will be sent out, as 'PDFBox » PDFBox-Trunk-jdk21 » Apache PDFBox examples #953' does not have a result yet. Please make sure you set a proper result in case of pipeline/build scripts.
No mail will be sent out, as 'PDFBox » PDFBox-Trunk-jdk21 » Apache PDFBox release #953' does not have a result yet. Please make sure you set a proper result in case of pipeline/build scripts.
Sending e-mails to: dev@pdfbox.apache.org
No mail will be sent out, as 'PDFBox » PDFBox-Trunk-jdk21 » Apache PDFBox #953' does not have a result yet. Please make sure you set a proper result in case of pipeline/build scripts.
No mail will be sent out, as 'PDFBox » PDFBox-Trunk-jdk21 » Apache PDFBox Debugger application #953' does not have a result yet. Please make sure you set a proper result in case of pipeline/build scripts.
No mail will be sent out, as 'PDFBox » PDFBox-Trunk-jdk21 » Apache PDFBox io #953' does not have a result yet. Please make sure you set a proper result in case of pipeline/build scripts.
No mail will be sent out, as 'PDFBox » PDFBox-Trunk-jdk21 » Apache FontBox #953' does not have a result yet. Please make sure you set a proper result in case of pipeline/build scripts.
channel stopped
Archiving artifacts
---------------------------------------------------------------------
To unsubscribe, e-mail: dev-unsubscribe@pdfbox.apache.org
For additional commands, e-mail: dev-help@pdfbox.apache.org
Build failed in Jenkins: PDFBox » PDFBox-Trunk-jdk21 #952
Posted by Apache Jenkins Server <je...@builds.apache.org>.
See <https://ci-builds.apache.org/job/PDFBox/job/PDFBox-Trunk-jdk21/952/display/redirect>
Changes:
------------------------------------------
Started by user Tilman Hausherr
Running as SYSTEM
[EnvInject] - Loading node environment variables.
Building remotely on builds30 (ubuntu) in workspace <https://ci-builds.apache.org/job/PDFBox/job/PDFBox-Trunk-jdk21/ws/>
Cleaning up <https://ci-builds.apache.org/job/PDFBox/job/PDFBox-Trunk-jdk21/ws/.>
Deleting <https://ci-builds.apache.org/job/PDFBox/job/PDFBox-Trunk-jdk21/ws/target>
Updating http://svn.apache.org/repos/asf/pdfbox/trunk at revision '2024-01-21T18:38:52.543 +0000' --quiet
At revision 1915353
No changes for http://svn.apache.org/repos/asf/pdfbox/trunk since the previous build
Parsing POMs
Modules changed, recalculating dependency graph
Established TCP socket on 34183
maven35-agent.jar already up to date
maven35-interceptor.jar already up to date
maven3-interceptor-commons.jar already up to date
[PDFBox-Trunk-jdk21] $ /home/jenkins/tools/java/latest21/bin/java -cp /home/jenkins/jenkins-agent/maven35-agent.jar:/home/jenkins/tools/maven/latest/boot/plexus-classworlds-2.7.0.jar:/home/jenkins/tools/maven/latest/conf/logging jenkins.maven3.agent.Maven35Main /home/jenkins/tools/maven/latest /home/jenkins/jenkins-agent/agent.jar /home/jenkins/jenkins-agent/maven35-interceptor.jar /home/jenkins/jenkins-agent/maven3-interceptor-commons.jar 34183
<===[JENKINS REMOTING CAPACITY]===> channel started
Executing Maven: -B -f <https://ci-builds.apache.org/job/PDFBox/job/PDFBox-Trunk-jdk21/ws/pom.xml> clean install -Ppedantic -Dmaven.source.skip=true org.sonatype.ossindex.maven:ossindex-maven-plugin:audit
[INFO] Scanning for projects...
[HUDSON] Collecting dependencies info
[HUDSON] Collecting dependencies info
[HUDSON] Collecting dependencies info
[HUDSON] Collecting dependencies info
[INFO] ------------------------------------------------------------------------
[HUDSON] Collecting dependencies info
[INFO] Reactor Build Order:
[INFO]
[HUDSON] Collecting dependencies info
[HUDSON] Collecting dependencies info
[HUDSON] Collecting dependencies info
[HUDSON] Collecting dependencies info
[HUDSON] Collecting dependencies info
[HUDSON] Collecting dependencies info
[INFO] Apache PDFBox parent [pom]
[INFO] Apache PDFBox io [bundle]
[INFO] Apache FontBox [bundle]
[INFO] Apache XmpBox [bundle]
[INFO] Apache PDFBox [bundle]
[INFO] Apache PDFBox Debugger [jar]
[INFO] Apache PDFBox tools [jar]
[INFO] Apache PDFBox application [jar]
[INFO] Apache PDFBox Debugger application [jar]
[INFO] Apache PDFBox examples [jar]
[INFO] Apache PDFBox release [pom]
[INFO]
[INFO] ------------------< org.apache.pdfbox:pdfbox-parent >-------------------
[INFO] Building Apache PDFBox parent 4.0.0-SNAPSHOT [1/11]
[INFO] from pom.xml
[INFO] --------------------------------[ pom ]---------------------------------
[INFO]
[INFO] --- clean:3.3.2:clean (default-clean) @ pdfbox-parent ---
[INFO]
[INFO] --- enforcer:3.4.1:enforce (default) @ pdfbox-parent ---
[INFO] Rule 0: org.apache.maven.enforcer.rules.version.RequireMavenVersion passed
[INFO]
[INFO] --- enforcer:3.4.1:enforce (enforce-maven-version) @ pdfbox-parent ---
[INFO] Rule 0: org.apache.maven.enforcer.rules.version.RequireMavenVersion passed
[INFO]
[INFO] --- enforcer:3.4.1:enforce (enforce-java-version) @ pdfbox-parent ---
[INFO] Rule 0: org.apache.maven.enforcer.rules.version.RequireJavaVersion passed
[INFO]
[INFO] --- jacoco:0.8.11:prepare-agent (default) @ pdfbox-parent ---
[INFO] surefireArgLine set to -javaagent:/home/jenkins/.m2/repository/org/jacoco/org.jacoco.agent/0.8.11/org.jacoco.agent-0.8.11-runtime.jar=destfile=<https://ci-builds.apache.org/job/PDFBox/job/PDFBox-Trunk-jdk21/ws/target/jacoco.exec>
[INFO]
[INFO] --- remote-resources:3.1.0:process (process-resource-bundles) @ pdfbox-parent ---
[INFO] Preparing remote bundle org.apache.apache.resources:apache-jar-resource-bundle:1.5
[INFO] Copying 3 resources from 1 bundle.
[INFO]
[INFO] --- jacoco:0.8.11:report (report) @ pdfbox-parent ---
[INFO] Skipping JaCoCo execution due to missing execution data file.
[INFO]
[INFO] --- site:3.12.1:attach-descriptor (attach-descriptor) @ pdfbox-parent ---
[INFO] No site descriptor found: nothing to attach.
[INFO]
[INFO] --- source:3.3.0:jar-no-fork (attach-sources) @ pdfbox-parent ---
[INFO] Skipping source per configuration.
[INFO]
[INFO] --- apache-rat:0.16:check (default) @ pdfbox-parent ---
[INFO] Rat check: Summary over all files. Unapproved: 0, unknown: 0, generated: 0, approved: 10 licenses.
[INFO]
[INFO] --- dependency-check:9.0.9:check (default) @ pdfbox-parent ---
[ERROR] Incompatible or corrupt database found. To resolve this issue please remove the existing database by running purge
[WARNING] Attempt to (de-)serialize anonymous class org.jfrog.hudson.maven2.MavenDependenciesRecorder$1; see: https://jenkins.io/redirect/serialization-of-anonymous-classes/
[INFO] ------------------------------------------------------------------------
[INFO] Reactor Summary for Apache PDFBox parent 4.0.0-SNAPSHOT:
[INFO]
[INFO] Apache PDFBox parent ............................... FAILURE [ 16.326 s]
[INFO] Apache PDFBox io ................................... SKIPPED
[INFO] Apache FontBox ..................................... SKIPPED
[INFO] Apache XmpBox ...................................... SKIPPED
[INFO] Apache PDFBox ...................................... SKIPPED
[INFO] Apache PDFBox Debugger ............................. SKIPPED
[INFO] Apache PDFBox tools ................................ SKIPPED
[INFO] Apache PDFBox application .......................... SKIPPED
[INFO] Apache PDFBox Debugger application ................. SKIPPED
[INFO] Apache PDFBox examples ............................. SKIPPED
[INFO] Apache PDFBox release .............................. SKIPPED
[INFO] ------------------------------------------------------------------------
[INFO] BUILD FAILURE
[INFO] ------------------------------------------------------------------------
[INFO] Total time: 41.989 s
[INFO] Finished at: 2024-01-21T18:40:09Z
[INFO] ------------------------------------------------------------------------
Waiting for Jenkins to finish collecting data
[ERROR] Failed to execute goal org.owasp:dependency-check-maven:9.0.9:check (default) on project pdfbox-parent: Fatal exception(s) analyzing Apache PDFBox parent: One or more exceptions occurred during analysis:
[ERROR] DatabaseException: Unable to connect to the dependency-check database
[ERROR] caused by DatabaseException: Incompatible or corrupt database found; run the purge command to resolve the issue
[ERROR] -> [Help 1]
[ERROR]
[ERROR] To see the full stack trace of the errors, re-run Maven with the -e switch.
[ERROR] Re-run Maven using the -X switch to enable full debug logging.
[ERROR]
[ERROR] For more information about the errors and possible solutions, please read the following articles:
[ERROR] [Help 1] http://cwiki.apache.org/confluence/display/MAVEN/MojoExecutionException
[JENKINS] Archiving <https://ci-builds.apache.org/job/PDFBox/job/PDFBox-Trunk-jdk21/ws/xmpbox/pom.xml> to org.apache.pdfbox/xmpbox/4.0.0-SNAPSHOT/xmpbox-4.0.0-SNAPSHOT.pom
[JENKINS] Archiving <https://ci-builds.apache.org/job/PDFBox/job/PDFBox-Trunk-jdk21/ws/tools/pom.xml> to org.apache.pdfbox/pdfbox-tools/4.0.0-SNAPSHOT/pdfbox-tools-4.0.0-SNAPSHOT.pom
[JENKINS] Archiving <https://ci-builds.apache.org/job/PDFBox/job/PDFBox-Trunk-jdk21/ws/debugger/pom.xml> to org.apache.pdfbox/pdfbox-debugger/4.0.0-SNAPSHOT/pdfbox-debugger-4.0.0-SNAPSHOT.pom
[JENKINS] Archiving <https://ci-builds.apache.org/job/PDFBox/job/PDFBox-Trunk-jdk21/ws/app/pom.xml> to org.apache.pdfbox/pdfbox-app/4.0.0-SNAPSHOT/pdfbox-app-4.0.0-SNAPSHOT.pom
[JENKINS] Archiving <https://ci-builds.apache.org/job/PDFBox/job/PDFBox-Trunk-jdk21/ws/examples/pom.xml> to org.apache.pdfbox/pdfbox-examples/4.0.0-SNAPSHOT/pdfbox-examples-4.0.0-SNAPSHOT.pom
[JENKINS] Archiving <https://ci-builds.apache.org/job/PDFBox/job/PDFBox-Trunk-jdk21/ws/release/pom.xml> to org.apache.pdfbox/pdfbox-release/4.0.0-SNAPSHOT/pdfbox-release-4.0.0-SNAPSHOT.pom
[JENKINS] Archiving <https://ci-builds.apache.org/job/PDFBox/job/PDFBox-Trunk-jdk21/ws/pom.xml> to org.apache.pdfbox/pdfbox-parent/4.0.0-SNAPSHOT/pdfbox-parent-4.0.0-SNAPSHOT.pom
[JENKINS] Archiving <https://ci-builds.apache.org/job/PDFBox/job/PDFBox-Trunk-jdk21/ws/pdfbox/pom.xml> to org.apache.pdfbox/pdfbox/4.0.0-SNAPSHOT/pdfbox-4.0.0-SNAPSHOT.pom
[JENKINS] Archiving <https://ci-builds.apache.org/job/PDFBox/job/PDFBox-Trunk-jdk21/ws/debugger-app/pom.xml> to org.apache.pdfbox/debugger-app/4.0.0-SNAPSHOT/debugger-app-4.0.0-SNAPSHOT.pom
[JENKINS] Archiving <https://ci-builds.apache.org/job/PDFBox/job/PDFBox-Trunk-jdk21/ws/io/pom.xml> to org.apache.pdfbox/pdfbox-io/4.0.0-SNAPSHOT/pdfbox-io-4.0.0-SNAPSHOT.pom
[JENKINS] Archiving <https://ci-builds.apache.org/job/PDFBox/job/PDFBox-Trunk-jdk21/ws/fontbox/pom.xml> to org.apache.pdfbox/fontbox/4.0.0-SNAPSHOT/fontbox-4.0.0-SNAPSHOT.pom
No mail will be sent out, as 'PDFBox » PDFBox-Trunk-jdk21 » Apache XmpBox #952' does not have a result yet. Please make sure you set a proper result in case of pipeline/build scripts.
No mail will be sent out, as 'PDFBox » PDFBox-Trunk-jdk21 » Apache PDFBox tools #952' does not have a result yet. Please make sure you set a proper result in case of pipeline/build scripts.
No mail will be sent out, as 'PDFBox » PDFBox-Trunk-jdk21 » Apache PDFBox Debugger #952' does not have a result yet. Please make sure you set a proper result in case of pipeline/build scripts.
No mail will be sent out, as 'PDFBox » PDFBox-Trunk-jdk21 » Apache PDFBox application #952' does not have a result yet. Please make sure you set a proper result in case of pipeline/build scripts.
No mail will be sent out, as 'PDFBox » PDFBox-Trunk-jdk21 » Apache PDFBox examples #952' does not have a result yet. Please make sure you set a proper result in case of pipeline/build scripts.
No mail will be sent out, as 'PDFBox » PDFBox-Trunk-jdk21 » Apache PDFBox release #952' does not have a result yet. Please make sure you set a proper result in case of pipeline/build scripts.
Sending e-mails to: dev@pdfbox.apache.org
No mail will be sent out, as 'PDFBox » PDFBox-Trunk-jdk21 » Apache PDFBox #952' does not have a result yet. Please make sure you set a proper result in case of pipeline/build scripts.
No mail will be sent out, as 'PDFBox » PDFBox-Trunk-jdk21 » Apache PDFBox Debugger application #952' does not have a result yet. Please make sure you set a proper result in case of pipeline/build scripts.
No mail will be sent out, as 'PDFBox » PDFBox-Trunk-jdk21 » Apache PDFBox io #952' does not have a result yet. Please make sure you set a proper result in case of pipeline/build scripts.
No mail will be sent out, as 'PDFBox » PDFBox-Trunk-jdk21 » Apache FontBox #952' does not have a result yet. Please make sure you set a proper result in case of pipeline/build scripts.
channel stopped
Archiving artifacts
---------------------------------------------------------------------
To unsubscribe, e-mail: dev-unsubscribe@pdfbox.apache.org
For additional commands, e-mail: dev-help@pdfbox.apache.org