You are viewing a plain text version of this content. The canonical link for it is here.
Posted to builds@solr.apache.org by Policeman Jenkins Server <je...@thetaphi.de> on 2022/04/18 00:08:04 UTC
[JENKINS] Solr-main-Linux (64bit/jdk-11.0.13) - Build # 4170 - Still Unstable!
Build: https://jenkins.thetaphi.de/job/Solr-main-Linux/4170/
Java: 64bit/jdk-11.0.13 -XX:-UseCompressedOops -XX:+UseParallelGC
2 tests failed.
FAILED: org.apache.solr.client.solrj.impl.HttpClusterStateSSLTest.classMethod
Error Message:
com.carrotsearch.randomizedtesting.ThreadLeakError: 1 thread leaked from SUITE scope at org.apache.solr.client.solrj.impl.HttpClusterStateSSLTest:
1) Thread[id=920, name=ProcessThread(sid:0 cport:37771):, state=WAITING, group=TGRP-HttpClusterStateSSLTest]
at java.base@11.0.13/jdk.internal.misc.Unsafe.park(Native Method)
at java.base@11.0.13/java.util.concurrent.locks.LockSupport.park(LockSupport.java:194)
at java.base@11.0.13/java.util.concurrent.locks.AbstractQueuedSynchronizer$ConditionObject.await(AbstractQueuedSynchronizer.java:2081)
at java.base@11.0.13/java.util.concurrent.LinkedBlockingQueue.take(LinkedBlockingQueue.java:433)
at app//org.apache.zookeeper.server.PrepRequestProcessor.run(PrepRequestProcessor.java:141)
Stack Trace:
com.carrotsearch.randomizedtesting.ThreadLeakError: 1 thread leaked from SUITE scope at org.apache.solr.client.solrj.impl.HttpClusterStateSSLTest:
1) Thread[id=920, name=ProcessThread(sid:0 cport:37771):, state=WAITING, group=TGRP-HttpClusterStateSSLTest]
at java.base@11.0.13/jdk.internal.misc.Unsafe.park(Native Method)
at java.base@11.0.13/java.util.concurrent.locks.LockSupport.park(LockSupport.java:194)
at java.base@11.0.13/java.util.concurrent.locks.AbstractQueuedSynchronizer$ConditionObject.await(AbstractQueuedSynchronizer.java:2081)
at java.base@11.0.13/java.util.concurrent.LinkedBlockingQueue.take(LinkedBlockingQueue.java:433)
at app//org.apache.zookeeper.server.PrepRequestProcessor.run(PrepRequestProcessor.java:141)
at __randomizedtesting.SeedInfo.seed([89F58BEE0695116E]:0)
FAILED: org.apache.solr.s3.S3BackupRepositoryTest.classMethod
Error Message:
com.carrotsearch.randomizedtesting.ThreadLeakError: 22 threads leaked from SUITE scope at org.apache.solr.s3.S3BackupRepositoryTest:
1) Thread[id=51, name=qtp1056745788-51, state=TERMINATED, group={null group}]
at (empty stack)
2) Thread[id=37, name=qtp1056745788-37, state=TERMINATED, group={null group}]
at java.base@11.0.13/jdk.internal.misc.Unsafe.park(Native Method)
at java.base@11.0.13/java.util.concurrent.locks.LockSupport.park(LockSupport.java:194)
at java.base@11.0.13/java.util.concurrent.locks.AbstractQueuedSynchronizer.parkAndCheckInterrupt(AbstractQueuedSynchronizer.java:885)
at java.base@11.0.13/java.util.concurrent.locks.AbstractQueuedSynchronizer.acquireQueued(AbstractQueuedSynchronizer.java:917)
at java.base@11.0.13/java.util.concurrent.locks.AbstractQueuedSynchronizer$ConditionObject.awaitNanos(AbstractQueuedSynchronizer.java:2128)
at app//org.eclipse.jetty.util.BlockingArrayQueue.poll(BlockingArrayQueue.java:382)
at app//org.eclipse.jetty.util.thread.QueuedThreadPool$Runner.idleJobPoll(QueuedThreadPool.java:974)
at app//org.eclipse.jetty.util.thread.QueuedThreadPool$Runner.run(QueuedThreadPool.java:1018)
at java.base@11.0.13/java.lang.Thread.run(Thread.java:829)
3) Thread[id=46, name=qtp1056745788-46, state=TERMINATED, group={null group}]
at (empty stack)
4) Thread[id=57, name=qtp1056745788-57, state=TERMINATED, group={null group}]
at (empty stack)
5) Thread[id=48, name=qtp1056745788-48, state=TERMINATED, group={null group}]
at (empty stack)
6) Thread[id=56, name=qtp1056745788-56, state=TERMINATED, group={null group}]
at (empty stack)
7) Thread[id=50, name=qtp1056745788-50, state=TERMINATED, group={null group}]
at (empty stack)
8) Thread[id=35, name=qtp1056745788-35, state=TERMINATED, group={null group}]
at (empty stack)
9) Thread[id=53, name=qtp1056745788-53, state=TERMINATED, group={null group}]
at app//org.eclipse.jetty.util.thread.QueuedThreadPool$Runner.run(QueuedThreadPool.java:1040)
at java.base@11.0.13/java.lang.Thread.run(Thread.java:829)
10) Thread[id=45, name=qtp1056745788-45, state=TERMINATED, group={null group}]
at java.base@11.0.13/java.lang.System.arraycopy(Native Method)
at java.base@11.0.13/java.lang.ThreadGroup.remove(ThreadGroup.java:967)
at java.base@11.0.13/java.lang.ThreadGroup.threadTerminated(ThreadGroup.java:940)
at java.base@11.0.13/java.lang.Thread.exit(Thread.java:842)
Stack Trace:
com.carrotsearch.randomizedtesting.ThreadLeakError: 22 threads leaked from SUITE scope at org.apache.solr.s3.S3BackupRepositoryTest:
1) Thread[id=51, name=qtp1056745788-51, state=TERMINATED, group={null group}]
at (empty stack)
2) Thread[id=37, name=qtp1056745788-37, state=TERMINATED, group={null group}]
at java.base@11.0.13/jdk.internal.misc.Unsafe.park(Native Method)
at java.base@11.0.13/java.util.concurrent.locks.LockSupport.park(LockSupport.java:194)
at java.base@11.0.13/java.util.concurrent.locks.AbstractQueuedSynchronizer.parkAndCheckInterrupt(AbstractQueuedSynchronizer.java:885)
at java.base@11.0.13/java.util.concurrent.locks.AbstractQueuedSynchronizer.acquireQueued(AbstractQueuedSynchronizer.java:917)
at java.base@11.0.13/java.util.concurrent.locks.AbstractQueuedSynchronizer$ConditionObject.awaitNanos(AbstractQueuedSynchronizer.java:2128)
at app//org.eclipse.jetty.util.BlockingArrayQueue.poll(BlockingArrayQueue.java:382)
at app//org.eclipse.jetty.util.thread.QueuedThreadPool$Runner.idleJobPoll(QueuedThreadPool.java:974)
at app//org.eclipse.jetty.util.thread.QueuedThreadPool$Runner.run(QueuedThreadPool.java:1018)
at java.base@11.0.13/java.lang.Thread.run(Thread.java:829)
3) Thread[id=46, name=qtp1056745788-46, state=TERMINATED, group={null group}]
at (empty stack)
4) Thread[id=57, name=qtp1056745788-57, state=TERMINATED, group={null group}]
at (empty stack)
5) Thread[id=48, name=qtp1056745788-48, state=TERMINATED, group={null group}]
at (empty stack)
6) Thread[id=56, name=qtp1056745788-56, state=TERMINATED, group={null group}]
at (empty stack)
7) Thread[id=50, name=qtp1056745788-50, state=TERMINATED, group={null group}]
at (empty stack)
8) Thread[id=35, name=qtp1056745788-35, state=TERMINATED, group={null group}]
at (empty stack)
9) Thread[id=53, name=qtp1056745788-53, state=TERMINATED, group={null group}]
at app//org.eclipse.jetty.util.thread.QueuedThreadPool$Runner.run(QueuedThreadPool.java:1040)
at java.base@11.0.13/java.lang.Thread.run(Thread.java:829)
10) Thread[id=45, name=qtp1056745788-45, state=TERMINATED, group={null group}]
at java.base@11.0.13/java.lang.System.arraycopy(Native Method)
at java.base@11.0.13/java.lang.ThreadGroup.remove(ThreadGroup.java:967)
at java.base@11.0.13/java.lang.ThreadGroup.threadTerminated(ThreadGroup.java:940)
at java.base@11.0.13/java.lang.Thread.exit(Thread.java:842)
at __randomizedtesting.SeedInfo.seed([89F58BEE0695116E]:0)
[JENKINS] Solr-main-Linux (64bit/jdk-11.0.13) - Build # 4171 - Still Unstable!
Posted by Policeman Jenkins Server <je...@thetaphi.de>.
Build: https://jenkins.thetaphi.de/job/Solr-main-Linux/4171/
Java: 64bit/jdk-11.0.13 -XX:+UseCompressedOops -XX:+UseParallelGC
2 tests failed.
FAILED: org.apache.solr.client.solrj.impl.CloudHttp2SolrClientBuilderTest.classMethod
Error Message:
com.carrotsearch.randomizedtesting.ThreadLeakError: 1 thread leaked from SUITE scope at org.apache.solr.client.solrj.impl.CloudHttp2SolrClientBuilderTest:
1) Thread[id=847, name=h2sc-432-thread-1, state=RUNNABLE, group=TGRP-CloudHttp2SolrClientBuilderTest]
at java.base@11.0.13/jdk.internal.misc.Unsafe.unpark(Native Method)
at java.base@11.0.13/java.util.concurrent.locks.LockSupport.unpark(LockSupport.java:160)
at java.base@11.0.13/java.util.concurrent.locks.AbstractQueuedSynchronizer.unparkSuccessor(AbstractQueuedSynchronizer.java:709)
at java.base@11.0.13/java.util.concurrent.locks.AbstractQueuedSynchronizer.release(AbstractQueuedSynchronizer.java:1305)
at java.base@11.0.13/java.util.concurrent.locks.ReentrantLock.unlock(ReentrantLock.java:439)
at java.base@11.0.13/java.util.concurrent.ThreadPoolExecutor.tryTerminate(ThreadPoolExecutor.java:726)
at java.base@11.0.13/java.util.concurrent.ThreadPoolExecutor.processWorkerExit(ThreadPoolExecutor.java:994)
at java.base@11.0.13/java.util.concurrent.ThreadPoolExecutor.runWorker(ThreadPoolExecutor.java:1142)
at java.base@11.0.13/java.util.concurrent.ThreadPoolExecutor$Worker.run(ThreadPoolExecutor.java:628)
at java.base@11.0.13/java.lang.Thread.run(Thread.java:829)
Stack Trace:
com.carrotsearch.randomizedtesting.ThreadLeakError: 1 thread leaked from SUITE scope at org.apache.solr.client.solrj.impl.CloudHttp2SolrClientBuilderTest:
1) Thread[id=847, name=h2sc-432-thread-1, state=RUNNABLE, group=TGRP-CloudHttp2SolrClientBuilderTest]
at java.base@11.0.13/jdk.internal.misc.Unsafe.unpark(Native Method)
at java.base@11.0.13/java.util.concurrent.locks.LockSupport.unpark(LockSupport.java:160)
at java.base@11.0.13/java.util.concurrent.locks.AbstractQueuedSynchronizer.unparkSuccessor(AbstractQueuedSynchronizer.java:709)
at java.base@11.0.13/java.util.concurrent.locks.AbstractQueuedSynchronizer.release(AbstractQueuedSynchronizer.java:1305)
at java.base@11.0.13/java.util.concurrent.locks.ReentrantLock.unlock(ReentrantLock.java:439)
at java.base@11.0.13/java.util.concurrent.ThreadPoolExecutor.tryTerminate(ThreadPoolExecutor.java:726)
at java.base@11.0.13/java.util.concurrent.ThreadPoolExecutor.processWorkerExit(ThreadPoolExecutor.java:994)
at java.base@11.0.13/java.util.concurrent.ThreadPoolExecutor.runWorker(ThreadPoolExecutor.java:1142)
at java.base@11.0.13/java.util.concurrent.ThreadPoolExecutor$Worker.run(ThreadPoolExecutor.java:628)
at java.base@11.0.13/java.lang.Thread.run(Thread.java:829)
at __randomizedtesting.SeedInfo.seed([D8FF10A4357C0653]:0)
FAILED: org.apache.solr.util.OrderedExecutorTest.classMethod
Error Message:
com.carrotsearch.randomizedtesting.ThreadLeakError: 1 thread leaked from SUITE scope at org.apache.solr.util.OrderedExecutorTest:
1) Thread[id=513, name=executeInOrderTest-300-thread-2, state=RUNNABLE, group=TGRP-OrderedExecutorTest]
at java.base@11.0.13/jdk.internal.misc.Unsafe.unpark(Native Method)
at java.base@11.0.13/java.util.concurrent.locks.LockSupport.unpark(LockSupport.java:160)
at java.base@11.0.13/java.util.concurrent.locks.AbstractQueuedSynchronizer.unparkSuccessor(AbstractQueuedSynchronizer.java:709)
at java.base@11.0.13/java.util.concurrent.locks.AbstractQueuedSynchronizer.release(AbstractQueuedSynchronizer.java:1305)
at java.base@11.0.13/java.util.concurrent.locks.ReentrantLock.unlock(ReentrantLock.java:439)
at java.base@11.0.13/java.util.concurrent.ThreadPoolExecutor.tryTerminate(ThreadPoolExecutor.java:726)
at java.base@11.0.13/java.util.concurrent.ThreadPoolExecutor.processWorkerExit(ThreadPoolExecutor.java:994)
at java.base@11.0.13/java.util.concurrent.ThreadPoolExecutor.runWorker(ThreadPoolExecutor.java:1142)
at java.base@11.0.13/java.util.concurrent.ThreadPoolExecutor$Worker.run(ThreadPoolExecutor.java:628)
at java.base@11.0.13/java.lang.Thread.run(Thread.java:829)
Stack Trace:
com.carrotsearch.randomizedtesting.ThreadLeakError: 1 thread leaked from SUITE scope at org.apache.solr.util.OrderedExecutorTest:
1) Thread[id=513, name=executeInOrderTest-300-thread-2, state=RUNNABLE, group=TGRP-OrderedExecutorTest]
at java.base@11.0.13/jdk.internal.misc.Unsafe.unpark(Native Method)
at java.base@11.0.13/java.util.concurrent.locks.LockSupport.unpark(LockSupport.java:160)
at java.base@11.0.13/java.util.concurrent.locks.AbstractQueuedSynchronizer.unparkSuccessor(AbstractQueuedSynchronizer.java:709)
at java.base@11.0.13/java.util.concurrent.locks.AbstractQueuedSynchronizer.release(AbstractQueuedSynchronizer.java:1305)
at java.base@11.0.13/java.util.concurrent.locks.ReentrantLock.unlock(ReentrantLock.java:439)
at java.base@11.0.13/java.util.concurrent.ThreadPoolExecutor.tryTerminate(ThreadPoolExecutor.java:726)
at java.base@11.0.13/java.util.concurrent.ThreadPoolExecutor.processWorkerExit(ThreadPoolExecutor.java:994)
at java.base@11.0.13/java.util.concurrent.ThreadPoolExecutor.runWorker(ThreadPoolExecutor.java:1142)
at java.base@11.0.13/java.util.concurrent.ThreadPoolExecutor$Worker.run(ThreadPoolExecutor.java:628)
at java.base@11.0.13/java.lang.Thread.run(Thread.java:829)
at __randomizedtesting.SeedInfo.seed([D8FF10A4357C0653]:0)