You are viewing a plain text version of this content. The canonical link for it is here.
Posted to builds@lucene.apache.org by Apache Jenkins Server <je...@builds.apache.org> on 2019/10/25 14:27:28 UTC

[JENKINS] Lucene-Solr-BadApples-NightlyTests-8.x - Build # 40 - Unstable

Build: https://builds.apache.org/job/Lucene-Solr-BadApples-NightlyTests-8.x/40/

1 tests failed.
FAILED:  org.apache.solr.cloud.MoveReplicaHDFSTest.test

Error Message:
expected not same

Stack Trace:
java.lang.AssertionError: expected not same
	at __randomizedtesting.SeedInfo.seed([D299982DB3E11D17:5ACDA7F71D1D70EF]:0)
	at org.junit.Assert.fail(Assert.java:88)
	at org.junit.Assert.failSame(Assert.java:819)
	at org.junit.Assert.assertNotSame(Assert.java:798)
	at org.junit.Assert.assertNotSame(Assert.java:811)
	at org.apache.solr.cloud.MoveReplicaTest.test(MoveReplicaTest.java:147)
	at sun.reflect.NativeMethodAccessorImpl.invoke0(Native Method)
	at sun.reflect.NativeMethodAccessorImpl.invoke(NativeMethodAccessorImpl.java:62)
	at sun.reflect.DelegatingMethodAccessorImpl.invoke(DelegatingMethodAccessorImpl.java:43)
	at java.lang.reflect.Method.invoke(Method.java:498)
	at com.carrotsearch.randomizedtesting.RandomizedRunner.invoke(RandomizedRunner.java:1750)
	at com.carrotsearch.randomizedtesting.RandomizedRunner$8.evaluate(RandomizedRunner.java:938)
	at com.carrotsearch.randomizedtesting.RandomizedRunner$9.evaluate(RandomizedRunner.java:974)
	at com.carrotsearch.randomizedtesting.RandomizedRunner$10.evaluate(RandomizedRunner.java:988)
	at com.carrotsearch.randomizedtesting.rules.SystemPropertiesRestoreRule$1.evaluate(SystemPropertiesRestoreRule.java:57)
	at org.apache.lucene.util.TestRuleSetupTeardownChained$1.evaluate(TestRuleSetupTeardownChained.java:49)
	at org.apache.lucene.util.AbstractBeforeAfterRule$1.evaluate(AbstractBeforeAfterRule.java:45)
	at org.apache.lucene.util.TestRuleThreadAndTestName$1.evaluate(TestRuleThreadAndTestName.java:48)
	at org.apache.lucene.util.TestRuleIgnoreAfterMaxFailures$1.evaluate(TestRuleIgnoreAfterMaxFailures.java:64)
	at org.apache.lucene.util.TestRuleMarkFailure$1.evaluate(TestRuleMarkFailure.java:47)
	at com.carrotsearch.randomizedtesting.rules.StatementAdapter.evaluate(StatementAdapter.java:36)
	at com.carrotsearch.randomizedtesting.ThreadLeakControl$StatementRunner.run(ThreadLeakControl.java:368)
	at com.carrotsearch.randomizedtesting.ThreadLeakControl.forkTimeoutingTask(ThreadLeakControl.java:817)
	at com.carrotsearch.randomizedtesting.ThreadLeakControl$3.evaluate(ThreadLeakControl.java:468)
	at com.carrotsearch.randomizedtesting.RandomizedRunner.runSingleTest(RandomizedRunner.java:947)
	at com.carrotsearch.randomizedtesting.RandomizedRunner$5.evaluate(RandomizedRunner.java:832)
	at com.carrotsearch.randomizedtesting.RandomizedRunner$6.evaluate(RandomizedRunner.java:883)
	at com.carrotsearch.randomizedtesting.RandomizedRunner$7.evaluate(RandomizedRunner.java:894)
	at com.carrotsearch.randomizedtesting.rules.StatementAdapter.evaluate(StatementAdapter.java:36)
	at com.carrotsearch.randomizedtesting.rules.SystemPropertiesRestoreRule$1.evaluate(SystemPropertiesRestoreRule.java:57)
	at org.apache.lucene.util.AbstractBeforeAfterRule$1.evaluate(AbstractBeforeAfterRule.java:45)
	at com.carrotsearch.randomizedtesting.rules.StatementAdapter.evaluate(StatementAdapter.java:36)
	at org.apache.lucene.util.TestRuleStoreClassName$1.evaluate(TestRuleStoreClassName.java:41)
	at com.carrotsearch.randomizedtesting.rules.NoShadowingOrOverridesOnMethodsRule$1.evaluate(NoShadowingOrOverridesOnMethodsRule.java:40)
	at com.carrotsearch.randomizedtesting.rules.NoShadowingOrOverridesOnMethodsRule$1.evaluate(NoShadowingOrOverridesOnMethodsRule.java:40)
	at com.carrotsearch.randomizedtesting.rules.StatementAdapter.evaluate(StatementAdapter.java:36)
	at com.carrotsearch.randomizedtesting.rules.StatementAdapter.evaluate(StatementAdapter.java:36)
	at com.carrotsearch.randomizedtesting.rules.StatementAdapter.evaluate(StatementAdapter.java:36)
	at org.apache.lucene.util.TestRuleAssertionsRequired$1.evaluate(TestRuleAssertionsRequired.java:53)
	at org.apache.lucene.util.TestRuleMarkFailure$1.evaluate(TestRuleMarkFailure.java:47)
	at org.apache.lucene.util.TestRuleIgnoreAfterMaxFailures$1.evaluate(TestRuleIgnoreAfterMaxFailures.java:64)
	at org.apache.lucene.util.TestRuleIgnoreTestSuites$1.evaluate(TestRuleIgnoreTestSuites.java:54)
	at com.carrotsearch.randomizedtesting.rules.StatementAdapter.evaluate(StatementAdapter.java:36)
	at com.carrotsearch.randomizedtesting.ThreadLeakControl$StatementRunner.run(ThreadLeakControl.java:368)
	at java.lang.Thread.run(Thread.java:748)




Build Log:
[...truncated 15430 lines...]
   [junit4] Suite: org.apache.solr.cloud.MoveReplicaHDFSTest
   [junit4]   1> Formatting using clusterid: testClusterID
   [junit4]   2> 2656688 WARN  (SUITE-MoveReplicaHDFSTest-seed#[D299982DB3E11D17]-worker) [     ] o.a.h.m.i.MetricsConfig Cannot locate configuration: tried hadoop-metrics2-namenode.properties,hadoop-metrics2.properties
   [junit4]   2> 2656702 WARN  (SUITE-MoveReplicaHDFSTest-seed#[D299982DB3E11D17]-worker) [     ] o.a.h.h.HttpRequestLog Jetty request log can only be enabled using Log4j
   [junit4]   2> 2656704 INFO  (SUITE-MoveReplicaHDFSTest-seed#[D299982DB3E11D17]-worker) [     ] o.e.j.s.Server jetty-9.4.19.v20190610; built: 2019-06-10T16:30:51.723Z; git: afcf563148970e98786327af5e07c261fda175d3; jvm 1.8.0_191-b12
   [junit4]   2> 2656742 INFO  (SUITE-MoveReplicaHDFSTest-seed#[D299982DB3E11D17]-worker) [     ] o.e.j.s.session DefaultSessionIdManager workerName=node0
   [junit4]   2> 2656742 INFO  (SUITE-MoveReplicaHDFSTest-seed#[D299982DB3E11D17]-worker) [     ] o.e.j.s.session No SessionScavenger set, using defaults
   [junit4]   2> 2656742 INFO  (SUITE-MoveReplicaHDFSTest-seed#[D299982DB3E11D17]-worker) [     ] o.e.j.s.session node0 Scavenging every 600000ms
   [junit4]   2> 2656750 INFO  (SUITE-MoveReplicaHDFSTest-seed#[D299982DB3E11D17]-worker) [     ] o.e.j.s.h.ContextHandler Started o.e.j.s.ServletContextHandler@d2bd39{static,/static,jar:file:/home/jenkins/.ivy2/cache/org.apache.hadoop/hadoop-hdfs/tests/hadoop-hdfs-3.2.0-tests.jar!/webapps/static,AVAILABLE}
   [junit4]   2> 2656845 INFO  (SUITE-MoveReplicaHDFSTest-seed#[D299982DB3E11D17]-worker) [     ] o.e.j.s.h.ContextHandler Started o.e.j.w.WebAppContext@35b91bc6{hdfs,/,file:///home/jenkins/jenkins-slave/workspace/Lucene-Solr-BadApples-NightlyTests-8.x/checkout/solr/build/solr-core/test/J2/temp/jetty-localhost.localdomain-43973-hdfs-_-any-7617801106762816313.dir/webapp/,AVAILABLE}{/hdfs}
   [junit4]   2> 2656845 INFO  (SUITE-MoveReplicaHDFSTest-seed#[D299982DB3E11D17]-worker) [     ] o.e.j.s.AbstractConnector Started ServerConnector@43c8c518{HTTP/1.1,[http/1.1]}{localhost.localdomain:43973}
   [junit4]   2> 2656845 INFO  (SUITE-MoveReplicaHDFSTest-seed#[D299982DB3E11D17]-worker) [     ] o.e.j.s.Server Started @2656872ms
   [junit4]   2> 2657030 WARN  (SUITE-MoveReplicaHDFSTest-seed#[D299982DB3E11D17]-worker) [     ] o.a.h.h.HttpRequestLog Jetty request log can only be enabled using Log4j
   [junit4]   2> 2657031 INFO  (SUITE-MoveReplicaHDFSTest-seed#[D299982DB3E11D17]-worker) [     ] o.e.j.s.Server jetty-9.4.19.v20190610; built: 2019-06-10T16:30:51.723Z; git: afcf563148970e98786327af5e07c261fda175d3; jvm 1.8.0_191-b12
   [junit4]   2> 2657065 INFO  (SUITE-MoveReplicaHDFSTest-seed#[D299982DB3E11D17]-worker) [     ] o.e.j.s.session DefaultSessionIdManager workerName=node0
   [junit4]   2> 2657065 INFO  (SUITE-MoveReplicaHDFSTest-seed#[D299982DB3E11D17]-worker) [     ] o.e.j.s.session No SessionScavenger set, using defaults
   [junit4]   2> 2657065 INFO  (SUITE-MoveReplicaHDFSTest-seed#[D299982DB3E11D17]-worker) [     ] o.e.j.s.session node0 Scavenging every 660000ms
   [junit4]   2> 2657075 INFO  (SUITE-MoveReplicaHDFSTest-seed#[D299982DB3E11D17]-worker) [     ] o.e.j.s.h.ContextHandler Started o.e.j.s.ServletContextHandler@160165a5{static,/static,jar:file:/home/jenkins/.ivy2/cache/org.apache.hadoop/hadoop-hdfs/tests/hadoop-hdfs-3.2.0-tests.jar!/webapps/static,AVAILABLE}
   [junit4]   2> 2657259 INFO  (SUITE-MoveReplicaHDFSTest-seed#[D299982DB3E11D17]-worker) [     ] o.e.j.s.h.ContextHandler Started o.e.j.w.WebAppContext@363ab698{datanode,/,file:///home/jenkins/jenkins-slave/workspace/Lucene-Solr-BadApples-NightlyTests-8.x/checkout/solr/build/solr-core/test/J2/temp/jetty-localhost-44219-datanode-_-any-298344904196535166.dir/webapp/,AVAILABLE}{/datanode}
   [junit4]   2> 2657259 INFO  (SUITE-MoveReplicaHDFSTest-seed#[D299982DB3E11D17]-worker) [     ] o.e.j.s.AbstractConnector Started ServerConnector@690972d0{HTTP/1.1,[http/1.1]}{localhost:44219}
   [junit4]   2> 2657259 INFO  (SUITE-MoveReplicaHDFSTest-seed#[D299982DB3E11D17]-worker) [     ] o.e.j.s.Server Started @2657286ms
   [junit4]   2> 2657364 WARN  (SUITE-MoveReplicaHDFSTest-seed#[D299982DB3E11D17]-worker) [     ] o.a.h.h.HttpRequestLog Jetty request log can only be enabled using Log4j
   [junit4]   2> 2657365 INFO  (SUITE-MoveReplicaHDFSTest-seed#[D299982DB3E11D17]-worker) [     ] o.e.j.s.Server jetty-9.4.19.v20190610; built: 2019-06-10T16:30:51.723Z; git: afcf563148970e98786327af5e07c261fda175d3; jvm 1.8.0_191-b12
   [junit4]   2> 2657366 INFO  (SUITE-MoveReplicaHDFSTest-seed#[D299982DB3E11D17]-worker) [     ] o.e.j.s.session DefaultSessionIdManager workerName=node0
   [junit4]   2> 2657366 INFO  (SUITE-MoveReplicaHDFSTest-seed#[D299982DB3E11D17]-worker) [     ] o.e.j.s.session No SessionScavenger set, using defaults
   [junit4]   2> 2657366 INFO  (SUITE-MoveReplicaHDFSTest-seed#[D299982DB3E11D17]-worker) [     ] o.e.j.s.session node0 Scavenging every 600000ms
   [junit4]   2> 2657366 INFO  (SUITE-MoveReplicaHDFSTest-seed#[D299982DB3E11D17]-worker) [     ] o.e.j.s.h.ContextHandler Started o.e.j.s.ServletContextHandler@13e22dfe{static,/static,jar:file:/home/jenkins/.ivy2/cache/org.apache.hadoop/hadoop-hdfs/tests/hadoop-hdfs-3.2.0-tests.jar!/webapps/static,AVAILABLE}
   [junit4]   2> 2657459 INFO  (SUITE-MoveReplicaHDFSTest-seed#[D299982DB3E11D17]-worker) [     ] o.e.j.s.h.ContextHandler Started o.e.j.w.WebAppContext@49477789{datanode,/,file:///home/jenkins/jenkins-slave/workspace/Lucene-Solr-BadApples-NightlyTests-8.x/checkout/solr/build/solr-core/test/J2/temp/jetty-localhost-40373-datanode-_-any-3136451276348580749.dir/webapp/,AVAILABLE}{/datanode}
   [junit4]   2> 2657483 INFO  (SUITE-MoveReplicaHDFSTest-seed#[D299982DB3E11D17]-worker) [     ] o.e.j.s.AbstractConnector Started ServerConnector@610825c2{HTTP/1.1,[http/1.1]}{localhost:40373}
   [junit4]   2> 2657483 INFO  (SUITE-MoveReplicaHDFSTest-seed#[D299982DB3E11D17]-worker) [     ] o.e.j.s.Server Started @2657509ms
   [junit4]   2> 2657582 INFO  (Block report processor) [     ] BlockStateChange BLOCK* processReport 0x87ff77ca2d88b20d: Processing first storage report for DS-704df30b-595b-4592-adbc-6bc88ae704a1 from datanode a71c9bc0-8755-493c-93a7-c8fa7a5ba57b
   [junit4]   2> 2657582 INFO  (Block report processor) [     ] BlockStateChange BLOCK* processReport 0x87ff77ca2d88b20d: from storage DS-704df30b-595b-4592-adbc-6bc88ae704a1 node DatanodeRegistration(127.0.0.1:44661, datanodeUuid=a71c9bc0-8755-493c-93a7-c8fa7a5ba57b, infoPort=44909, infoSecurePort=0, ipcPort=42239, storageInfo=lv=-57;cid=testClusterID;nsid=693333864;c=1572009705553), blocks: 0, hasStaleStorage: true, processing time: 0 msecs, invalidatedBlocks: 0
   [junit4]   2> 2657588 INFO  (Block report processor) [     ] BlockStateChange BLOCK* processReport 0x87ff77ca2d88b20d: Processing first storage report for DS-2b4ed6c0-b426-44e1-b84f-0cd542b9b968 from datanode a71c9bc0-8755-493c-93a7-c8fa7a5ba57b
   [junit4]   2> 2657588 INFO  (Block report processor) [     ] BlockStateChange BLOCK* processReport 0x87ff77ca2d88b20d: from storage DS-2b4ed6c0-b426-44e1-b84f-0cd542b9b968 node DatanodeRegistration(127.0.0.1:44661, datanodeUuid=a71c9bc0-8755-493c-93a7-c8fa7a5ba57b, infoPort=44909, infoSecurePort=0, ipcPort=42239, storageInfo=lv=-57;cid=testClusterID;nsid=693333864;c=1572009705553), blocks: 0, hasStaleStorage: false, processing time: 0 msecs, invalidatedBlocks: 0
   [junit4]   2> 2657672 INFO  (Block report processor) [     ] BlockStateChange BLOCK* processReport 0xb14dbcda5dec7f46: Processing first storage report for DS-696e26ff-4619-4a1a-8fcc-164e318aa811 from datanode c4b702fb-6261-452b-b7d8-751dc184c0ac
   [junit4]   2> 2657672 INFO  (Block report processor) [     ] BlockStateChange BLOCK* processReport 0xb14dbcda5dec7f46: from storage DS-696e26ff-4619-4a1a-8fcc-164e318aa811 node DatanodeRegistration(127.0.0.1:43005, datanodeUuid=c4b702fb-6261-452b-b7d8-751dc184c0ac, infoPort=44339, infoSecurePort=0, ipcPort=37461, storageInfo=lv=-57;cid=testClusterID;nsid=693333864;c=1572009705553), blocks: 0, hasStaleStorage: true, processing time: 0 msecs, invalidatedBlocks: 0
   [junit4]   2> 2657672 INFO  (Block report processor) [     ] BlockStateChange BLOCK* processReport 0xb14dbcda5dec7f46: Processing first storage report for DS-0bfa3d92-0fdb-4c92-87ce-f05619bddb14 from datanode c4b702fb-6261-452b-b7d8-751dc184c0ac
   [junit4]   2> 2657672 INFO  (Block report processor) [     ] BlockStateChange BLOCK* processReport 0xb14dbcda5dec7f46: from storage DS-0bfa3d92-0fdb-4c92-87ce-f05619bddb14 node DatanodeRegistration(127.0.0.1:43005, datanodeUuid=c4b702fb-6261-452b-b7d8-751dc184c0ac, infoPort=44339, infoSecurePort=0, ipcPort=37461, storageInfo=lv=-57;cid=testClusterID;nsid=693333864;c=1572009705553), blocks: 0, hasStaleStorage: false, processing time: 0 msecs, invalidatedBlocks: 0
   [junit4] IGNOR/A 0.00s J2 | MoveReplicaHDFSTest.testFailedMove
   [junit4]    > Assumption #1: 'awaitsfix' test group is disabled (@AwaitsFix(bugUrl=https://issues.apache.org/jira/browse/SOLR-12080))
   [junit4]   2> 2657820 INFO  (TEST-MoveReplicaHDFSTest.testNormalFailedMove-seed#[D299982DB3E11D17]) [     ] o.a.s.c.MiniSolrCloudCluster Starting cluster of 4 servers in /home/jenkins/jenkins-slave/workspace/Lucene-Solr-BadApples-NightlyTests-8.x/checkout/solr/build/solr-core/test/J2/temp/solr.cloud.MoveReplicaHDFSTest_D299982DB3E11D17-001/tempDir-002
   [junit4]   2> 2657820 INFO  (TEST-MoveReplicaHDFSTest.testNormalFailedMove-seed#[D299982DB3E11D17]) [     ] o.a.s.c.ZkTestServer STARTING ZK TEST SERVER
   [junit4]   2> 2657820 INFO  (ZkTestServer Run Thread) [     ] o.a.s.c.ZkTestServer client port:0.0.0.0/0.0.0.0:0
   [junit4]   2> 2657820 INFO  (ZkTestServer Run Thread) [     ] o.a.s.c.ZkTestServer Starting server
   [junit4]   2> 2657920 INFO  (TEST-MoveReplicaHDFSTest.testNormalFailedMove-seed#[D299982DB3E11D17]) [     ] o.a.s.c.ZkTestServer start zk server on port:45937
   [junit4]   2> 2657920 INFO  (TEST-MoveReplicaHDFSTest.testNormalFailedMove-seed#[D299982DB3E11D17]) [     ] o.a.s.c.ZkTestServer waitForServerUp: 127.0.0.1:45937
   [junit4]   2> 2657920 INFO  (TEST-MoveReplicaHDFSTest.testNormalFailedMove-seed#[D299982DB3E11D17]) [     ] o.a.s.c.ZkTestServer parse host and port list: 127.0.0.1:45937
   [junit4]   2> 2657920 INFO  (TEST-MoveReplicaHDFSTest.testNormalFailedMove-seed#[D299982DB3E11D17]) [     ] o.a.s.c.ZkTestServer connecting to 127.0.0.1 45937
   [junit4]   2> 2657922 INFO  (TEST-MoveReplicaHDFSTest.testNormalFailedMove-seed#[D299982DB3E11D17]) [     ] o.a.s.c.c.ConnectionManager Waiting for client to connect to ZooKeeper
   [junit4]   2> 2657926 INFO  (zkConnectionManagerCallback-8765-thread-1) [     ] o.a.s.c.c.ConnectionManager zkClient has connected
   [junit4]   2> 2657926 INFO  (TEST-MoveReplicaHDFSTest.testNormalFailedMove-seed#[D299982DB3E11D17]) [     ] o.a.s.c.c.ConnectionManager Client is connected to ZooKeeper
   [junit4]   2> 2657929 INFO  (TEST-MoveReplicaHDFSTest.testNormalFailedMove-seed#[D299982DB3E11D17]) [     ] o.a.s.c.c.ConnectionManager Waiting for client to connect to ZooKeeper
   [junit4]   2> 2657930 INFO  (zkConnectionManagerCallback-8767-thread-1) [     ] o.a.s.c.c.ConnectionManager zkClient has connected
   [junit4]   2> 2657930 INFO  (TEST-MoveReplicaHDFSTest.testNormalFailedMove-seed#[D299982DB3E11D17]) [     ] o.a.s.c.c.ConnectionManager Client is connected to ZooKeeper
   [junit4]   2> 2657931 INFO  (TEST-MoveReplicaHDFSTest.testNormalFailedMove-seed#[D299982DB3E11D17]) [     ] o.a.s.c.c.ConnectionManager Waiting for client to connect to ZooKeeper
   [junit4]   2> 2657931 INFO  (zkConnectionManagerCallback-8769-thread-1) [     ] o.a.s.c.c.ConnectionManager zkClient has connected
   [junit4]   2> 2657931 INFO  (TEST-MoveReplicaHDFSTest.testNormalFailedMove-seed#[D299982DB3E11D17]) [     ] o.a.s.c.c.ConnectionManager Client is connected to ZooKeeper
   [junit4]   2> 2658034 WARN  (jetty-launcher-8770-thread-2) [     ] o.e.j.s.AbstractConnector Ignoring deprecated socket close linger time
   [junit4]   2> 2658034 WARN  (jetty-launcher-8770-thread-4) [     ] o.e.j.s.AbstractConnector Ignoring deprecated socket close linger time
   [junit4]   2> 2658034 WARN  (jetty-launcher-8770-thread-3) [     ] o.e.j.s.AbstractConnector Ignoring deprecated socket close linger time
   [junit4]   2> 2658034 INFO  (jetty-launcher-8770-thread-2) [     ] o.a.s.c.s.e.JettySolrRunner Start Jetty (configured port=0, binding port=0)
   [junit4]   2> 2658034 INFO  (jetty-launcher-8770-thread-4) [     ] o.a.s.c.s.e.JettySolrRunner Start Jetty (configured port=0, binding port=0)
   [junit4]   2> 2658034 INFO  (jetty-launcher-8770-thread-4) [     ] o.a.s.c.s.e.JettySolrRunner Trying to start Jetty on port 0 try number 1 ...
   [junit4]   2> 2658034 INFO  (jetty-launcher-8770-thread-2) [     ] o.a.s.c.s.e.JettySolrRunner Trying to start Jetty on port 0 try number 1 ...
   [junit4]   2> 2658034 INFO  (jetty-launcher-8770-thread-2) [     ] o.e.j.s.Server jetty-9.4.19.v20190610; built: 2019-06-10T16:30:51.723Z; git: afcf563148970e98786327af5e07c261fda175d3; jvm 1.8.0_191-b12
   [junit4]   2> 2658034 INFO  (jetty-launcher-8770-thread-4) [     ] o.e.j.s.Server jetty-9.4.19.v20190610; built: 2019-06-10T16:30:51.723Z; git: afcf563148970e98786327af5e07c261fda175d3; jvm 1.8.0_191-b12
   [junit4]   2> 2658035 INFO  (jetty-launcher-8770-thread-4) [     ] o.e.j.s.session DefaultSessionIdManager workerName=node0
   [junit4]   2> 2658035 INFO  (jetty-launcher-8770-thread-4) [     ] o.e.j.s.session No SessionScavenger set, using defaults
   [junit4]   2> 2658035 INFO  (jetty-launcher-8770-thread-4) [     ] o.e.j.s.session node0 Scavenging every 660000ms
   [junit4]   2> 2658035 INFO  (jetty-launcher-8770-thread-2) [     ] o.e.j.s.session DefaultSessionIdManager workerName=node0
   [junit4]   2> 2658035 INFO  (jetty-launcher-8770-thread-2) [     ] o.e.j.s.session No SessionScavenger set, using defaults
   [junit4]   2> 2658035 INFO  (jetty-launcher-8770-thread-2) [     ] o.e.j.s.session node0 Scavenging every 660000ms
   [junit4]   2> 2658036 INFO  (jetty-launcher-8770-thread-4) [     ] o.e.j.s.h.ContextHandler Started o.e.j.s.ServletContextHandler@4316f3eb{/solr,null,AVAILABLE}
   [junit4]   2> 2658036 INFO  (jetty-launcher-8770-thread-2) [     ] o.e.j.s.h.ContextHandler Started o.e.j.s.ServletContextHandler@6e4a19e0{/solr,null,AVAILABLE}
   [junit4]   2> 2658036 WARN  (jetty-launcher-8770-thread-1) [     ] o.e.j.s.AbstractConnector Ignoring deprecated socket close linger time
   [junit4]   2> 2658036 INFO  (jetty-launcher-8770-thread-2) [     ] o.e.j.s.AbstractConnector Started ServerConnector@42a3eac7{SSL,[ssl, http/1.1]}{127.0.0.1:42005}
   [junit4]   2> 2658036 INFO  (jetty-launcher-8770-thread-4) [     ] o.e.j.s.AbstractConnector Started ServerConnector@6bdc1c79{SSL,[ssl, http/1.1]}{127.0.0.1:40819}
   [junit4]   2> 2658036 INFO  (jetty-launcher-8770-thread-2) [     ] o.e.j.s.Server Started @2658063ms
   [junit4]   2> 2658036 INFO  (jetty-launcher-8770-thread-4) [     ] o.e.j.s.Server Started @2658063ms
   [junit4]   2> 2658036 INFO  (jetty-launcher-8770-thread-2) [     ] o.a.s.c.s.e.JettySolrRunner Jetty properties: {hostContext=/solr, hostPort=42005}
   [junit4]   2> 2658036 INFO  (jetty-launcher-8770-thread-4) [     ] o.a.s.c.s.e.JettySolrRunner Jetty properties: {hostContext=/solr, hostPort=40819}
   [junit4]   2> 2658036 ERROR (jetty-launcher-8770-thread-4) [     ] o.a.s.u.StartupLoggingUtils Missing Java Option solr.log.dir. Logging may be missing or incomplete.
   [junit4]   2> 2658036 INFO  (jetty-launcher-8770-thread-4) [     ] o.a.s.s.SolrDispatchFilter Using logger factory org.apache.logging.slf4j.Log4jLoggerFactory
   [junit4]   2> 2658036 ERROR (jetty-launcher-8770-thread-2) [     ] o.a.s.u.StartupLoggingUtils Missing Java Option solr.log.dir. Logging may be missing or incomplete.
   [junit4]   2> 2658036 INFO  (jetty-launcher-8770-thread-2) [     ] o.a.s.s.SolrDispatchFilter Using logger factory org.apache.logging.slf4j.Log4jLoggerFactory
   [junit4]   2> 2658037 INFO  (jetty-launcher-8770-thread-2) [     ] o.a.s.s.SolrDispatchFilter  ___      _       Welcome to Apache Solr? version 8.4.0
   [junit4]   2> 2658037 INFO  (jetty-launcher-8770-thread-4) [     ] o.a.s.s.SolrDispatchFilter  ___      _       Welcome to Apache Solr? version 8.4.0
   [junit4]   2> 2658037 INFO  (jetty-launcher-8770-thread-2) [     ] o.a.s.s.SolrDispatchFilter / __| ___| |_ _   Starting in cloud mode on port null
   [junit4]   2> 2658037 INFO  (jetty-launcher-8770-thread-2) [     ] o.a.s.s.SolrDispatchFilter \__ \/ _ \ | '_|  Install dir: null
   [junit4]   2> 2658037 INFO  (jetty-launcher-8770-thread-4) [     ] o.a.s.s.SolrDispatchFilter / __| ___| |_ _   Starting in cloud mode on port null
   [junit4]   2> 2658037 INFO  (jetty-launcher-8770-thread-4) [     ] o.a.s.s.SolrDispatchFilter \__ \/ _ \ | '_|  Install dir: null
   [junit4]   2> 2658037 INFO  (jetty-launcher-8770-thread-2) [     ] o.a.s.s.SolrDispatchFilter |___/\___/_|_|    Start time: 2019-10-25T13:21:46.954Z
   [junit4]   2> 2658037 INFO  (jetty-launcher-8770-thread-4) [     ] o.a.s.s.SolrDispatchFilter |___/\___/_|_|    Start time: 2019-10-25T13:21:46.954Z
   [junit4]   2> 2658037 INFO  (jetty-launcher-8770-thread-3) [     ] o.a.s.c.s.e.JettySolrRunner Start Jetty (configured port=0, binding port=0)
   [junit4]   2> 2658037 INFO  (jetty-launcher-8770-thread-3) [     ] o.a.s.c.s.e.JettySolrRunner Trying to start Jetty on port 0 try number 1 ...
   [junit4]   2> 2658037 INFO  (jetty-launcher-8770-thread-3) [     ] o.e.j.s.Server jetty-9.4.19.v20190610; built: 2019-06-10T16:30:51.723Z; git: afcf563148970e98786327af5e07c261fda175d3; jvm 1.8.0_191-b12
   [junit4]   2> 2658038 INFO  (jetty-launcher-8770-thread-1) [     ] o.a.s.c.s.e.JettySolrRunner Start Jetty (configured port=0, binding port=0)
   [junit4]   2> 2658038 INFO  (jetty-launcher-8770-thread-1) [     ] o.a.s.c.s.e.JettySolrRunner Trying to start Jetty on port 0 try number 1 ...
   [junit4]   2> 2658038 INFO  (jetty-launcher-8770-thread-1) [     ] o.e.j.s.Server jetty-9.4.19.v20190610; built: 2019-06-10T16:30:51.723Z; git: afcf563148970e98786327af5e07c261fda175d3; jvm 1.8.0_191-b12
   [junit4]   2> 2658041 INFO  (jetty-launcher-8770-thread-2) [     ] o.a.s.c.c.ConnectionManager Waiting for client to connect to ZooKeeper
   [junit4]   2> 2658042 INFO  (jetty-launcher-8770-thread-4) [     ] o.a.s.c.c.ConnectionManager Waiting for client to connect to ZooKeeper
   [junit4]   2> 2658042 INFO  (zkConnectionManagerCallback-8773-thread-1) [     ] o.a.s.c.c.ConnectionManager zkClient has connected
   [junit4]   2> 2658042 INFO  (jetty-launcher-8770-thread-2) [     ] o.a.s.c.c.ConnectionManager Client is connected to ZooKeeper
   [junit4]   2> 2658043 INFO  (zkConnectionManagerCallback-8774-thread-1) [     ] o.a.s.c.c.ConnectionManager zkClient has connected
   [junit4]   2> 2658043 INFO  (jetty-launcher-8770-thread-4) [     ] o.a.s.c.c.ConnectionManager Client is connected to ZooKeeper
   [junit4]   2> 2658043 INFO  (jetty-launcher-8770-thread-2) [     ] o.a.s.s.SolrDispatchFilter solr.xml found in ZooKeeper. Loading...
   [junit4]   2> 2658043 INFO  (jetty-launcher-8770-thread-4) [     ] o.a.s.s.SolrDispatchFilter solr.xml found in ZooKeeper. Loading...
   [junit4]   2> 2658043 INFO  (jetty-launcher-8770-thread-3) [     ] o.e.j.s.session DefaultSessionIdManager workerName=node0
   [junit4]   2> 2658043 INFO  (jetty-launcher-8770-thread-3) [     ] o.e.j.s.session No SessionScavenger set, using defaults
   [junit4]   2> 2658043 INFO  (jetty-launcher-8770-thread-3) [     ] o.e.j.s.session node0 Scavenging every 660000ms
   [junit4]   2> 2658043 INFO  (jetty-launcher-8770-thread-3) [     ] o.e.j.s.h.ContextHandler Started o.e.j.s.ServletContextHandler@3db8a03f{/solr,null,AVAILABLE}
   [junit4]   2> 2658044 INFO  (jetty-launcher-8770-thread-3) [     ] o.e.j.s.AbstractConnector Started ServerConnector@11af1e6e{SSL,[ssl, http/1.1]}{127.0.0.1:34003}
   [junit4]   2> 2658044 INFO  (jetty-launcher-8770-thread-3) [     ] o.e.j.s.Server Started @2658070ms
   [junit4]   2> 2658044 INFO  (jetty-launcher-8770-thread-3) [     ] o.a.s.c.s.e.JettySolrRunner Jetty properties: {hostContext=/solr, hostPort=34003}
   [junit4]   2> 2658044 ERROR (jetty-launcher-8770-thread-3) [     ] o.a.s.u.StartupLoggingUtils Missing Java Option solr.log.dir. Logging may be missing or incomplete.
   [junit4]   2> 2658044 INFO  (jetty-launcher-8770-thread-3) [     ] o.a.s.s.SolrDispatchFilter Using logger factory org.apache.logging.slf4j.Log4jLoggerFactory
   [junit4]   2> 2658044 INFO  (jetty-launcher-8770-thread-3) [     ] o.a.s.s.SolrDispatchFilter  ___      _       Welcome to Apache Solr? version 8.4.0
   [junit4]   2> 2658044 INFO  (jetty-launcher-8770-thread-3) [     ] o.a.s.s.SolrDispatchFilter / __| ___| |_ _   Starting in cloud mode on port null
   [junit4]   2> 2658044 INFO  (jetty-launcher-8770-thread-3) [     ] o.a.s.s.SolrDispatchFilter \__ \/ _ \ | '_|  Install dir: null
   [junit4]   2> 2658044 INFO  (jetty-launcher-8770-thread-3) [     ] o.a.s.s.SolrDispatchFilter |___/\___/_|_|    Start time: 2019-10-25T13:21:46.961Z
   [junit4]   2> 2658046 INFO  (jetty-launcher-8770-thread-2) [     ] o.a.s.c.SolrXmlConfig Configuration parameter autoReplicaFailoverWorkLoopDelay is ignored
   [junit4]   2> 2658046 INFO  (jetty-launcher-8770-thread-4) [     ] o.a.s.c.SolrXmlConfig Configuration parameter autoReplicaFailoverWorkLoopDelay is ignored
   [junit4]   2> 2658046 INFO  (jetty-launcher-8770-thread-4) [     ] o.a.s.c.SolrXmlConfig Configuration parameter autoReplicaFailoverBadNodeExpiration is ignored
   [junit4]   2> 2658046 INFO  (jetty-launcher-8770-thread-2) [     ] o.a.s.c.SolrXmlConfig Configuration parameter autoReplicaFailoverBadNodeExpiration is ignored
   [junit4]   2> 2658049 INFO  (jetty-launcher-8770-thread-1) [     ] o.e.j.s.session DefaultSessionIdManager workerName=node0
   [junit4]   2> 2658049 INFO  (jetty-launcher-8770-thread-1) [     ] o.e.j.s.session No SessionScavenger set, using defaults
   [junit4]   2> 2658049 INFO  (jetty-launcher-8770-thread-1) [     ] o.e.j.s.session node0 Scavenging every 660000ms
   [junit4]   2> 2658049 INFO  (jetty-launcher-8770-thread-3) [     ] o.a.s.c.c.ConnectionManager Waiting for client to connect to ZooKeeper
   [junit4]   2> 2658049 INFO  (jetty-launcher-8770-thread-4) [     ] o.a.s.c.SolrXmlConfig MBean server found: com.sun.jmx.mbeanserver.JmxMBeanServer@67dcbf95, but no JMX reporters were configured - adding default JMX reporter.
   [junit4]   2> 2658050 INFO  (jetty-launcher-8770-thread-2) [     ] o.a.s.c.SolrXmlConfig MBean server found: com.sun.jmx.mbeanserver.JmxMBeanServer@67dcbf95, but no JMX reporters were configured - adding default JMX reporter.
   [junit4]   2> 2658050 INFO  (jetty-launcher-8770-thread-1) [     ] o.e.j.s.h.ContextHandler Started o.e.j.s.ServletContextHandler@12481304{/solr,null,AVAILABLE}
   [junit4]   2> 2658050 INFO  (zkConnectionManagerCallback-8776-thread-1) [     ] o.a.s.c.c.ConnectionManager zkClient has connected
   [junit4]   2> 2658050 INFO  (jetty-launcher-8770-thread-3) [     ] o.a.s.c.c.ConnectionManager Client is connected to ZooKeeper
   [junit4]   2> 2658051 INFO  (jetty-launcher-8770-thread-1) [     ] o.e.j.s.AbstractConnector Started ServerConnector@5bd216a2{SSL,[ssl, http/1.1]}{127.0.0.1:44423}
   [junit4]   2> 2658051 INFO  (jetty-launcher-8770-thread-1) [     ] o.e.j.s.Server Started @2658077ms
   [junit4]   2> 2658051 INFO  (jetty-launcher-8770-thread-1) [     ] o.a.s.c.s.e.JettySolrRunner Jetty properties: {hostContext=/solr, hostPort=44423}
   [junit4]   2> 2658051 ERROR (jetty-launcher-8770-thread-1) [     ] o.a.s.u.StartupLoggingUtils Missing Java Option solr.log.dir. Logging may be missing or incomplete.
   [junit4]   2> 2658051 INFO  (jetty-launcher-8770-thread-1) [     ] o.a.s.s.SolrDispatchFilter Using logger factory org.apache.logging.slf4j.Log4jLoggerFactory
   [junit4]   2> 2658051 INFO  (jetty-launcher-8770-thread-1) [     ] o.a.s.s.SolrDispatchFilter  ___      _       Welcome to Apache Solr? version 8.4.0
   [junit4]   2> 2658051 INFO  (jetty-launcher-8770-thread-1) [     ] o.a.s.s.SolrDispatchFilter / __| ___| |_ _   Starting in cloud mode on port null
   [junit4]   2> 2658051 INFO  (jetty-launcher-8770-thread-1) [     ] o.a.s.s.SolrDispatchFilter \__ \/ _ \ | '_|  Install dir: null
   [junit4]   2> 2658051 INFO  (jetty-launcher-8770-thread-1) [     ] o.a.s.s.SolrDispatchFilter |___/\___/_|_|    Start time: 2019-10-25T13:21:46.968Z
   [junit4]   2> 2658051 INFO  (jetty-launcher-8770-thread-1) [     ] o.a.s.c.c.ConnectionManager Waiting for client to connect to ZooKeeper
   [junit4]   2> 2658052 INFO  (zkConnectionManagerCallback-8778-thread-1) [     ] o.a.s.c.c.ConnectionManager zkClient has connected
   [junit4]   2> 2658052 INFO  (jetty-launcher-8770-thread-1) [     ] o.a.s.c.c.ConnectionManager Client is connected to ZooKeeper
   [junit4]   2> 2658151 INFO  (jetty-launcher-8770-thread-1) [     ] o.a.s.s.SolrDispatchFilter solr.xml found in ZooKeeper. Loading...
   [junit4]   2> 2658151 INFO  (jetty-launcher-8770-thread-3) [     ] o.a.s.s.SolrDispatchFilter solr.xml found in ZooKeeper. Loading...
   [junit4]   2> 2658153 INFO  (jetty-launcher-8770-thread-1) [     ] o.a.s.c.SolrXmlConfig Configuration parameter autoReplicaFailoverWorkLoopDelay is ignored
   [junit4]   2> 2658153 INFO  (jetty-launcher-8770-thread-1) [     ] o.a.s.c.SolrXmlConfig Configuration parameter autoReplicaFailoverBadNodeExpiration is ignored
   [junit4]   2> 2658153 INFO  (jetty-launcher-8770-thread-3) [     ] o.a.s.c.SolrXmlConfig Configuration parameter autoReplicaFailoverWorkLoopDelay is ignored
   [junit4]   2> 2658153 INFO  (jetty-launcher-8770-thread-3) [     ] o.a.s.c.SolrXmlConfig Configuration parameter autoReplicaFailoverBadNodeExpiration is ignored
   [junit4]   2> 2658154 INFO  (jetty-launcher-8770-thread-1) [     ] o.a.s.c.SolrXmlConfig MBean server found: com.sun.jmx.mbeanserver.JmxMBeanServer@67dcbf95, but no JMX reporters were configured - adding default JMX reporter.
   [junit4]   2> 2658155 INFO  (jetty-launcher-8770-thread-3) [     ] o.a.s.c.SolrXmlConfig MBean server found: com.sun.jmx.mbeanserver.JmxMBeanServer@67dcbf95, but no JMX reporters were configured - adding default JMX reporter.
   [junit4]   2> 2658216 INFO  (jetty-launcher-8770-thread-4) [     ] o.a.s.h.c.HttpShardHandlerFactory Host whitelist initialized: WhitelistHostChecker [whitelistHosts=null, whitelistHostCheckingEnabled=true]
   [junit4]   2> 2658217 WARN  (jetty-launcher-8770-thread-4) [     ] o.a.s.c.s.i.Http2SolrClient Create Http2SolrClient with HTTP/1.1 transport since Java 8 or lower versions does not support SSL + HTTP/2
   [junit4]   2> 2658217 WARN  (jetty-launcher-8770-thread-4) [     ] o.e.j.u.s.S.config Trusting all certificates configured for Client@76a86d17[provider=null,keyStore=null,trustStore=null]
   [junit4]   2> 2658217 WARN  (jetty-launcher-8770-thread-4) [     ] o.e.j.u.s.S.config No Client EndPointIdentificationAlgorithm configured for Client@76a86d17[provider=null,keyStore=null,trustStore=null]
   [junit4]   2> 2658222 WARN  (jetty-launcher-8770-thread-4) [     ] o.a.s.c.s.i.Http2SolrClient Create Http2SolrClient with HTTP/1.1 transport since Java 8 or lower versions does not support SSL + HTTP/2
   [junit4]   2> 2658223 WARN  (jetty-launcher-8770-thread-4) [     ] o.e.j.u.s.S.config Trusting all certificates configured for Client@29391677[provider=null,keyStore=null,trustStore=null]
   [junit4]   2> 2658223 WARN  (jetty-launcher-8770-thread-4) [     ] o.e.j.u.s.S.config No Client EndPointIdentificationAlgorithm configured for Client@29391677[provider=null,keyStore=null,trustStore=null]
   [junit4]   2> 2658224 INFO  (jetty-launcher-8770-thread-4) [     ] o.a.s.c.ZkContainer Zookeeper client=127.0.0.1:45937/solr
   [junit4]   2> 2658224 INFO  (jetty-launcher-8770-thread-4) [     ] o.a.s.c.c.ConnectionManager Waiting for client to connect to ZooKeeper
   [junit4]   2> 2658225 INFO  (zkConnectionManagerCallback-8785-thread-1) [     ] o.a.s.c.c.ConnectionManager zkClient has connected
   [junit4]   2> 2658225 INFO  (jetty-launcher-8770-thread-4) [     ] o.a.s.c.c.ConnectionManager Client is connected to ZooKeeper
   [junit4]   2> 2658356 INFO  (jetty-launcher-8770-thread-4) [n:127.0.0.1:40819_solr     ] o.a.s.c.c.ConnectionManager Waiting for client to connect to ZooKeeper
   [junit4]   2> 2658357 INFO  (zkConnectionManagerCallback-8788-thread-1) [     ] o.a.s.c.c.ConnectionManager zkClient has connected
   [junit4]   2> 2658357 INFO  (jetty-launcher-8770-thread-4) [n:127.0.0.1:40819_solr     ] o.a.s.c.c.ConnectionManager Client is connected to ZooKeeper
   [junit4]   2> 2658380 INFO  (jetty-launcher-8770-thread-2) [     ] o.a.s.h.c.HttpShardHandlerFactory Host whitelist initialized: WhitelistHostChecker [whitelistHosts=null, whitelistHostCheckingEnabled=true]
   [junit4]   2> 2658382 WARN  (jetty-launcher-8770-thread-2) [     ] o.a.s.c.s.i.Http2SolrClient Create Http2SolrClient with HTTP/1.1 transport since Java 8 or lower versions does not support SSL + HTTP/2
   [junit4]   2> 2658385 WARN  (jetty-launcher-8770-thread-2) [     ] o.e.j.u.s.S.config Trusting all certificates configured for Client@2ff3b417[provider=null,keyStore=null,trustStore=null]
   [junit4]   2> 2658385 WARN  (jetty-launcher-8770-thread-2) [     ] o.e.j.u.s.S.config No Client EndPointIdentificationAlgorithm configured for Client@2ff3b417[provider=null,keyStore=null,trustStore=null]
   [junit4]   2> 2658387 WARN  (jetty-launcher-8770-thread-2) [     ] o.a.s.c.s.i.Http2SolrClient Create Http2SolrClient with HTTP/1.1 transport since Java 8 or lower versions does not support SSL + HTTP/2
   [junit4]   2> 2658388 WARN  (jetty-launcher-8770-thread-2) [     ] o.e.j.u.s.S.config Trusting all certificates configured for Client@5306b09b[provider=null,keyStore=null,trustStore=null]
   [junit4]   2> 2658388 WARN  (jetty-launcher-8770-thread-2) [     ] o.e.j.u.s.S.config No Client EndPointIdentificationAlgorithm configured for Client@5306b09b[provider=null,keyStore=null,trustStore=null]
   [junit4]   2> 2658389 INFO  (jetty-launcher-8770-thread-2) [     ] o.a.s.c.ZkContainer Zookeeper client=127.0.0.1:45937/solr
   [junit4]   2> 2658389 INFO  (jetty-launcher-8770-thread-2) [     ] o.a.s.c.c.ConnectionManager Waiting for client to connect to ZooKeeper
   [junit4]   2> 2658390 INFO  (zkConnectionManagerCallback-8796-thread-1) [     ] o.a.s.c.c.ConnectionManager zkClient has connected
   [junit4]   2> 2658390 INFO  (jetty-launcher-8770-thread-2) [     ] o.a.s.c.c.ConnectionManager Client is connected to ZooKeeper
   [junit4]   2> 2658411 INFO  (jetty-launcher-8770-thread-4) [n:127.0.0.1:40819_solr     ] o.a.s.c.OverseerElectionContext I am going to be the leader 127.0.0.1:40819_solr
   [junit4]   2> 2658411 INFO  (jetty-launcher-8770-thread-4) [n:127.0.0.1:40819_solr     ] o.a.s.c.Overseer Overseer (id=72610147713679368-127.0.0.1:40819_solr-n_0000000000) starting
   [junit4]   2> 2658415 INFO  (OverseerStateUpdate-72610147713679368-127.0.0.1:40819_solr-n_0000000000) [n:127.0.0.1:40819_solr     ] o.a.s.c.Overseer Starting to work on the main queue : 127.0.0.1:40819_solr
   [junit4]   2> 2658415 INFO  (jetty-launcher-8770-thread-4) [n:127.0.0.1:40819_solr     ] o.a.s.c.ZkController Register node as live in ZooKeeper:/live_nodes/127.0.0.1:40819_solr
   [junit4]   2> 2658416 INFO  (OverseerStateUpdate-72610147713679368-127.0.0.1:40819_solr-n_0000000000) [n:127.0.0.1:40819_solr     ] o.a.s.c.c.ZkStateReader Updated live nodes from ZooKeeper... (0) -> (1)
   [junit4]   2> 2658432 INFO  (jetty-launcher-8770-thread-4) [n:127.0.0.1:40819_solr     ] o.a.s.h.a.MetricsHistoryHandler No .system collection, keeping metrics history in memory.
   [junit4]   2> 2658444 INFO  (jetty-launcher-8770-thread-4) [n:127.0.0.1:40819_solr     ] o.a.s.m.r.SolrJmxReporter JMX monitoring for 'solr.node' (registry 'solr.node') enabled at server: com.sun.jmx.mbeanserver.JmxMBeanServer@67dcbf95
   [junit4]   2> 2658449 INFO  (jetty-launcher-8770-thread-4) [n:127.0.0.1:40819_solr     ] o.a.s.m.r.SolrJmxReporter JMX monitoring for 'solr.jvm' (registry 'solr.jvm') enabled at server: com.sun.jmx.mbeanserver.JmxMBeanServer@67dcbf95
   [junit4]   2> 2658449 INFO  (jetty-launcher-8770-thread-4) [n:127.0.0.1:40819_solr     ] o.a.s.m.r.SolrJmxReporter JMX monitoring for 'solr.jetty' (registry 'solr.jetty') enabled at server: com.sun.jmx.mbeanserver.JmxMBeanServer@67dcbf95
   [junit4]   2> 2658450 INFO  (jetty-launcher-8770-thread-4) [n:127.0.0.1:40819_solr     ] o.a.s.c.CorePropertiesLocator Found 0 core definitions underneath /home/jenkins/jenkins-slave/workspace/Lucene-Solr-BadApples-NightlyTests-8.x/checkout/solr/build/solr-core/test/J2/temp/solr.cloud.MoveReplicaHDFSTest_D299982DB3E11D17-001/tempDir-002/node4/.
   [junit4]   2> 2658617 INFO  (jetty-launcher-8770-thread-1) [     ] o.a.s.h.c.HttpShardHandlerFactory Host whitelist initialized: WhitelistHostChecker [whitelistHosts=null, whitelistHostCheckingEnabled=true]
   [junit4]   2> 2658617 WARN  (jetty-launcher-8770-thread-1) [     ] o.a.s.c.s.i.Http2SolrClient Create Http2SolrClient with HTTP/1.1 transport since Java 8 or lower versions does not support SSL + HTTP/2
   [junit4]   2> 2658618 WARN  (jetty-launcher-8770-thread-1) [     ] o.e.j.u.s.S.config Trusting all certificates configured for Client@106088d3[provider=null,keyStore=null,trustStore=null]
   [junit4]   2> 2658618 WARN  (jetty-launcher-8770-thread-1) [     ] o.e.j.u.s.S.config No Client EndPointIdentificationAlgorithm configured for Client@106088d3[provider=null,keyStore=null,trustStore=null]
   [junit4]   2> 2658631 WARN  (jetty-launcher-8770-thread-1) [     ] o.a.s.c.s.i.Http2SolrClient Create Http2SolrClient with HTTP/1.1 transport since Java 8 or lower versions does not support SSL + HTTP/2
   [junit4]   2> 2658635 WARN  (jetty-launcher-8770-thread-1) [     ] o.e.j.u.s.S.config Trusting all certificates configured for Client@4ed03c70[provider=null,keyStore=null,trustStore=null]
   [junit4]   2> 2658635 WARN  (jetty-launcher-8770-thread-1) [     ] o.e.j.u.s.S.config No Client EndPointIdentificationAlgorithm configured for Client@4ed03c70[provider=null,keyStore=null,trustStore=null]
   [junit4]   2> 2658636 INFO  (jetty-launcher-8770-thread-1) [     ] o.a.s.c.ZkContainer Zookeeper client=127.0.0.1:45937/solr
   [junit4]   2> 2658640 INFO  (jetty-launcher-8770-thread-1) [     ] o.a.s.c.c.ConnectionManager Waiting for client to connect to ZooKeeper
   [junit4]   2> 2658646 INFO  (zkConnectionManagerCallback-8806-thread-1) [     ] o.a.s.c.c.ConnectionManager zkClient has connected
   [junit4]   2> 2658646 INFO  (jetty-launcher-8770-thread-1) [     ] o.a.s.c.c.ConnectionManager Client is connected to ZooKeeper
   [junit4]   2> 2658658 INFO  (jetty-launcher-8770-thread-2) [n:127.0.0.1:42005_solr     ] o.a.s.c.c.ConnectionManager Waiting for client to connect to ZooKeeper
   [junit4]   2> 2658666 INFO  (zkConnectionManagerCallback-8808-thread-1) [     ] o.a.s.c.c.ConnectionManager zkClient has connected
   [junit4]   2> 2658666 INFO  (jetty-launcher-8770-thread-2) [n:127.0.0.1:42005_solr     ] o.a.s.c.c.ConnectionManager Client is connected to ZooKeeper
   [junit4]   2> 2658669 INFO  (jetty-launcher-8770-thread-2) [n:127.0.0.1:42005_solr     ] o.a.s.c.c.ZkStateReader Updated live nodes from ZooKeeper... (0) -> (1)
   [junit4]   2> 2658671 INFO  (jetty-launcher-8770-thread-2) [n:127.0.0.1:42005_solr     ] o.a.s.c.ZkController Publish node=127.0.0.1:42005_solr as DOWN
   [junit4]   2> 2658672 INFO  (jetty-launcher-8770-thread-2) [n:127.0.0.1:42005_solr     ] o.a.s.c.TransientSolrCoreCacheDefault Allocating transient cache for 4 transient cores
   [junit4]   2> 2658672 INFO  (jetty-launcher-8770-thread-2) [n:127.0.0.1:42005_solr     ] o.a.s.c.ZkController Register node as live in ZooKeeper:/live_nodes/127.0.0.1:42005_solr
   [junit4]   2> 2658672 INFO  (zkCallback-8787-thread-1) [     ] o.a.s.c.c.ZkStateReader Updated live nodes from ZooKeeper... (1) -> (2)
   [junit4]   2> 2658678 INFO  (zkCallback-8807-thread-1) [     ] o.a.s.c.c.ZkStateReader Updated live nodes from ZooKeeper... (1) -> (2)
   [junit4]   2> 2658686 INFO  (jetty-launcher-8770-thread-2) [n:127.0.0.1:42005_solr     ] o.a.s.h.a.MetricsHistoryHandler No .system collection, keeping metrics history in memory.
   [junit4]   2> 2658697 INFO  (jetty-launcher-8770-thread-2) [n:127.0.0.1:42005_solr     ] o.a.s.m.r.SolrJmxReporter JMX monitoring for 'solr.node' (registry 'solr.node') enabled at server: com.sun.jmx.mbeanserver.JmxMBeanServer@67dcbf95
   [junit4]   2> 2658704 INFO  (jetty-launcher-8770-thread-2) [n:127.0.0.1:42005_solr     ] o.a.s.m.r.SolrJmxReporter JMX monitoring for 'solr.jvm' (registry 'solr.jvm') enabled at server: com.sun.jmx.mbeanserver.JmxMBeanServer@67dcbf95
   [junit4]   2> 2658704 INFO  (jetty-launcher-8770-thread-2) [n:127.0.0.1:42005_solr     ] o.a.s.m.r.SolrJmxReporter JMX monitoring for 'solr.jetty' (registry 'solr.jetty') enabled at server: com.sun.jmx.mbeanserver.JmxMBeanServer@67dcbf95
   [junit4]   2> 2658704 INFO  (jetty-launcher-8770-thread-2) [n:127.0.0.1:42005_solr     ] o.a.s.c.CorePropertiesLocator Found 0 core definitions underneath /home/jenkins/jenkins-slave/workspace/Lucene-Solr-BadApples-NightlyTests-8.x/checkout/solr/build/solr-core/test/J2/temp/solr.cloud.MoveReplicaHDFSTest_D299982DB3E11D17-001/tempDir-002/node2/.
   [junit4]   2> 2658726 INFO  (jetty-launcher-8770-thread-3) [     ] o.a.s.h.c.HttpShardHandlerFactory Host whitelist initialized: WhitelistHostChecker [whitelistHosts=null, whitelistHostCheckingEnabled=true]
   [junit4]   2> 2658727 WARN  (jetty-launcher-8770-thread-3) [     ] o.a.s.c.s.i.Http2SolrClient Create Http2SolrClient with HTTP/1.1 transport since Java 8 or lower versions does not support SSL + HTTP/2
   [junit4]   2> 2658727 WARN  (jetty-launcher-8770-thread-3) [     ] o.e.j.u.s.S.config Trusting all certificates configured for Client@1dcc3863[provider=null,keyStore=null,trustStore=null]
   [junit4]   2> 2658727 WARN  (jetty-launcher-8770-thread-3) [     ] o.e.j.u.s.S.config No Client EndPointIdentificationAlgorithm configured for Client@1dcc3863[provider=null,keyStore=null,trustStore=null]
   [junit4]   2> 2658729 WARN  (jetty-launcher-8770-thread-3) [     ] o.a.s.c.s.i.Http2SolrClient Create Http2SolrClient with HTTP/1.1 transport since Java 8 or lower versions does not support SSL + HTTP/2
   [junit4]   2> 2658730 WARN  (jetty-launcher-8770-thread-3) [     ] o.e.j.u.s.S.config Trusting all certificates configured for Client@73279e21[provider=null,keyStore=null,trustStore=null]
   [junit4]   2> 2658730 WARN  (jetty-launcher-8770-thread-3) [     ] o.e.j.u.s.S.config No Client EndPointIdentificationAlgorithm configured for Client@73279e21[provider=null,keyStore=null,trustStore=null]
   [junit4]   2> 2658731 INFO  (jetty-launcher-8770-thread-3) [     ] o.a.s.c.ZkContainer Zookeeper client=127.0.0.1:45937/solr
   [junit4]   2> 2658736 INFO  (jetty-launcher-8770-thread-3) [     ] o.a.s.c.c.ConnectionManager Waiting for client to connect to ZooKeeper
   [junit4]   2> 2658736 INFO  (zkConnectionManagerCallback-8818-thread-1) [     ] o.a.s.c.c.ConnectionManager zkClient has connected
   [junit4]   2> 2658736 INFO  (jetty-launcher-8770-thread-3) [     ] o.a.s.c.c.ConnectionManager Client is connected to ZooKeeper
   [junit4]   2> 2658757 INFO  (jetty-launcher-8770-thread-1) [n:127.0.0.1:44423_solr     ] o.a.s.c.c.ConnectionManager Waiting for client to connect to ZooKeeper
   [junit4]   2> 2658757 INFO  (zkConnectionManagerCallback-8820-thread-1) [     ] o.a.s.c.c.ConnectionManager zkClient has connected
   [junit4]   2> 2658757 INFO  (jetty-launcher-8770-thread-1) [n:127.0.0.1:44423_solr     ] o.a.s.c.c.ConnectionManager Client is connected to ZooKeeper
   [junit4]   2> 2658761 INFO  (jetty-launcher-8770-thread-1) [n:127.0.0.1:44423_solr     ] o.a.s.c.c.ZkStateReader Updated live nodes from ZooKeeper... (0) -> (2)
   [junit4]   2> 2658767 INFO  (jetty-launcher-8770-thread-1) [n:127.0.0.1:44423_solr     ] o.a.s.c.ZkController Publish node=127.0.0.1:44423_solr as DOWN
   [junit4]   2> 2658767 INFO  (jetty-launcher-8770-thread-1) [n:127.0.0.1:44423_solr     ] o.a.s.c.TransientSolrCoreCacheDefault Allocating transient cache for 4 transient cores
   [junit4]   2> 2658767 INFO  (jetty-launcher-8770-thread-1) [n:127.0.0.1:44423_solr     ] o.a.s.c.ZkController Register node as live in ZooKeeper:/live_nodes/127.0.0.1:44423_solr
   [junit4]   2> 2658768 INFO  (zkCallback-8807-thread-1) [     ] o.a.s.c.c.ZkStateReader Updated live nodes from ZooKeeper... (2) -> (3)
   [junit4]   2> 2658768 INFO  (zkCallback-8787-thread-1) [     ] o.a.s.c.c.ZkStateReader Updated live nodes from ZooKeeper... (2) -> (3)
   [junit4]   2> 2658780 INFO  (zkCallback-8819-thread-1) [     ] o.a.s.c.c.ZkStateReader Updated live nodes from ZooKeeper... (2) -> (3)
   [junit4]   2> 2658780 INFO  (jetty-launcher-8770-thread-1) [n:127.0.0.1:44423_solr     ] o.a.s.h.a.MetricsHistoryHandler No .system collection, keeping metrics history in memory.
   [junit4]   2> 2658791 INFO  (jetty-launcher-8770-thread-1) [n:127.0.0.1:44423_solr     ] o.a.s.m.r.SolrJmxReporter JMX monitoring for 'solr.node' (registry 'solr.node') enabled at server: com.sun.jmx.mbeanserver.JmxMBeanServer@67dcbf95
   [junit4]   2> 2658798 INFO  (jetty-launcher-8770-thread-1) [n:127.0.0.1:44423_solr     ] o.a.s.m.r.SolrJmxReporter JMX monitoring for 'solr.jvm' (registry 'solr.jvm') enabled at server: com.sun.jmx.mbeanserver.JmxMBeanServer@67dcbf95
   [junit4]   2> 2658798 INFO  (jetty-launcher-8770-thread-1) [n:127.0.0.1:44423_solr     ] o.a.s.m.r.SolrJmxReporter JMX monitoring for 'solr.jetty' (registry 'solr.jetty') enabled at server: com.sun.jmx.mbeanserver.JmxMBeanServer@67dcbf95
   [junit4]   2> 2658799 INFO  (jetty-launcher-8770-thread-1) [n:127.0.0.1:44423_solr     ] o.a.s.c.CorePropertiesLocator Found 0 core definitions underneath /home/jenkins/jenkins-slave/workspace/Lucene-Solr-BadApples-NightlyTests-8.x/checkout/solr/build/solr-core/test/J2/temp/solr.cloud.MoveReplicaHDFSTest_D299982DB3E11D17-001/tempDir-002/node1/.
   [junit4]   2> 2658857 INFO  (jetty-launcher-8770-thread-3) [n:127.0.0.1:34003_solr     ] o.a.s.c.c.ConnectionManager Waiting for client to connect to ZooKeeper
   [junit4]   2> 2658858 INFO  (zkConnectionManagerCallback-8826-thread-1) [     ] o.a.s.c.c.ConnectionManager zkClient has connected
   [junit4]   2> 2658858 INFO  (jetty-launcher-8770-thread-3) [n:127.0.0.1:34003_solr     ] o.a.s.c.c.ConnectionManager Client is connected to ZooKeeper
   [junit4]   2> 2658861 INFO  (jetty-launcher-8770-thread-3) [n:127.0.0.1:34003_solr     ] o.a.s.c.c.ZkStateReader Updated live nodes from ZooKeeper... (0) -> (3)
   [junit4]   2> 2658864 INFO  (jetty-launcher-8770-thread-3) [n:127.0.0.1:34003_solr     ] o.a.s.c.ZkController Publish node=127.0.0.1:34003_solr as DOWN
   [junit4]   2> 2658865 INFO  (jetty-launcher-8770-thread-3) [n:127.0.0.1:34003_solr     ] o.a.s.c.TransientSolrCoreCacheDefault Allocating transient cache for 4 transient cores
   [junit4]   2> 2658865 INFO  (jetty-launcher-8770-thread-3) [n:127.0.0.1:34003_solr     ] o.a.s.c.ZkController Register node as live in ZooKeeper:/live_nodes/127.0.0.1:34003_solr
   [junit4]   2> 2658865 INFO  (zkCallback-8787-thread-1) [     ] o.a.s.c.c.ZkStateReader Updated live nodes from ZooKeeper... (3) -> (4)
   [junit4]   2> 2658865 INFO  (zkCallback-8807-thread-1) [     ] o.a.s.c.c.ZkStateReader Updated live nodes from ZooKeeper... (3) -> (4)
   [junit4]   2> 2658865 INFO  (zkCallback-8819-thread-1) [     ] o.a.s.c.c.ZkStateReader Updated live nodes from ZooKeeper... (3) -> (4)
   [junit4]   2> 2658865 INFO  (zkCallback-8825-thread-1) [     ] o.a.s.c.c.ZkStateReader Updated live nodes from ZooKeeper... (3) -> (4)
   [junit4]   2> 2658877 INFO  (jetty-launcher-8770-thread-3) [n:127.0.0.1:34003_solr     ] o.a.s.h.a.MetricsHistoryHandler No .system collection, keeping metrics history in memory.
   [junit4]   2> 2658891 INFO  (jetty-launcher-8770-thread-3) [n:127.0.0.1:34003_solr     ] o.a.s.m.r.SolrJmxReporter JMX monitoring for 'solr.node' (registry 'solr.node') enabled at server: com.sun.jmx.mbeanserver.JmxMBeanServer@67dcbf95
   [junit4]   2> 2658898 INFO  (jetty-launcher-8770-thread-3) [n:127.0.0.1:34003_solr     ] o.a.s.m.r.SolrJmxReporter JMX monitoring for 'solr.jvm' (registry 'solr.jvm') enabled at server: com.sun.jmx.mbeanserver.JmxMBeanServer@67dcbf95
   [junit4]   2> 2658898 INFO  (jetty-launcher-8770-thread-3) [n:127.0.0.1:34003_solr     ] o.a.s.m.r.SolrJmxReporter JMX monitoring for 'solr.jetty' (registry 'solr.jetty') enabled at server: com.sun.jmx.mbeanserver.JmxMBeanServer@67dcbf95
   [junit4]   2> 2658899 INFO  (jetty-launcher-8770-thread-3) [n:127.0.0.1:34003_solr     ] o.a.s.c.CorePropertiesLocator Found 0 core definitions underneath /home/jenkins/jenkins-slave/workspace/Lucene-Solr-BadApples-NightlyTests-8.x/checkout/solr/build/solr-core/test/J2/temp/solr.cloud.MoveReplicaHDFSTest_D299982DB3E11D17-001/tempDir-002/node3/.
   [junit4]   2> 2658928 INFO  (TEST-MoveReplicaHDFSTest.testNormalFailedMove-seed#[D299982DB3E11D17]) [     ] o.a.s.c.MiniSolrCloudCluster waitForAllNodes: numServers=4
   [junit4]   2> 2658929 INFO  (TEST-MoveReplicaHDFSTest.testNormalFailedMove-seed#[D299982DB3E11D17]) [     ] o.a.s.c.c.ConnectionManager Waiting for client to connect to ZooKeeper
   [junit4]   2> 2658930 INFO  (zkConnectionManagerCallback-8835-thread-1) [     ] o.a.s.c.c.ConnectionManager zkClient has connected
   [junit4]   2> 2658930 INFO  (TEST-MoveReplicaHDFSTest.testNormalFailedMove-seed#[D299982DB3E11D17]) [     ] o.a.s.c.c.ConnectionManager Client is connected to ZooKeeper
   [junit4]   2> 2658930 INFO  (TEST-MoveReplicaHDFSTest.testNormalFailedMove-seed#[D299982DB3E11D17]) [     ] o.a.s.c.c.ZkStateReader Updated live nodes from ZooKeeper... (0) -> (4)
   [junit4]   2> 2658931 INFO  (TEST-MoveReplicaHDFSTest.testNormalFailedMove-seed#[D299982DB3E11D17]) [     ] o.a.s.c.s.i.ZkClientClusterStateProvider Cluster at 127.0.0.1:45937/solr ready
   [junit4]   2> 2658946 INFO  (qtp223940391-255601) [n:127.0.0.1:42005_solr     ] o.a.s.h.a.CollectionsHandler Invoked Collection Action :overseerstatus with params action=OVERSEERSTATUS&wt=javabin&version=2 and sendToOCPQueue=true
   [junit4]   2> 2658951 INFO  (qtp223940391-255601) [n:127.0.0.1:42005_solr     ] o.a.s.s.HttpSolrCall [admin] webapp=null path=/admin/collections params={action=OVERSEERSTATUS&wt=javabin&version=2} status=0 QTime=4
   [junit4]   2> 2658952 INFO  (qtp223940391-255593) [n:127.0.0.1:42005_solr     ] o.a.s.h.a.CollectionsHandler Invoked Collection Action :create with params pullReplicas=0&collection.configName=conf1&autoAddReplicas=false&name=MoveReplicaHDFSTest_failed_coll_false&nrtReplicas=1&action=CREATE&numShards=2&tlogReplicas=1&wt=javabin&version=2 and sendToOCPQueue=true
   [junit4]   2> 2658957 INFO  (OverseerThreadFactory-9996-thread-2-processing-n:127.0.0.1:40819_solr) [n:127.0.0.1:40819_solr     ] o.a.s.c.a.c.CreateCollectionCmd Create collection MoveReplicaHDFSTest_failed_coll_false
   [junit4]   2> 2658957 INFO  (OverseerCollectionConfigSetProcessor-72610147713679368-127.0.0.1:40819_solr-n_0000000000) [n:127.0.0.1:40819_solr     ] o.a.s.c.OverseerTaskQueue Response ZK path: /overseer/collection-queue-work/qnr-0000000000 doesn't exist.  Requestor may have disconnected from ZooKeeper
   [junit4]   2> 2659062 INFO  (OverseerStateUpdate-72610147713679368-127.0.0.1:40819_solr-n_0000000000) [n:127.0.0.1:40819_solr     ] o.a.s.c.o.SliceMutator createReplica() {
   [junit4]   2>   "operation":"ADDREPLICA",
   [junit4]   2>   "collection":"MoveReplicaHDFSTest_failed_coll_false",
   [junit4]   2>   "shard":"shard1",
   [junit4]   2>   "core":"MoveReplicaHDFSTest_failed_coll_false_shard1_replica_n1",
   [junit4]   2>   "state":"down",
   [junit4]   2>   "base_url":"https://127.0.0.1:44423/solr",
   [junit4]   2>   "type":"NRT",
   [junit4]   2>   "waitForFinalState":"false"} 
   [junit4]   2> 2659064 INFO  (OverseerStateUpdate-72610147713679368-127.0.0.1:40819_solr-n_0000000000) [n:127.0.0.1:40819_solr     ] o.a.s.c.o.SliceMutator createReplica() {
   [junit4]   2>   "operation":"ADDREPLICA",
   [junit4]   2>   "collection":"MoveReplicaHDFSTest_failed_coll_false",
   [junit4]   2>   "shard":"shard1",
   [junit4]   2>   "core":"MoveReplicaHDFSTest_failed_coll_false_shard1_replica_t2",
   [junit4]   2>   "state":"down",
   [junit4]   2>   "base_url":"https://127.0.0.1:34003/solr",
   [junit4]   2>   "type":"TLOG",
   [junit4]   2>   "waitForFinalState":"false"} 
   [junit4]   2> 2659065 INFO  (OverseerStateUpdate-72610147713679368-127.0.0.1:40819_solr-n_0000000000) [n:127.0.0.1:40819_solr     ] o.a.s.c.o.SliceMutator createReplica() {
   [junit4]   2>   "operation":"ADDREPLICA",
   [junit4]   2>   "collection":"MoveReplicaHDFSTest_failed_coll_false",
   [junit4]   2>   "shard":"shard2",
   [junit4]   2>   "core":"MoveReplicaHDFSTest_failed_coll_false_shard2_replica_n4",
   [junit4]   2>   "state":"down",
   [junit4]   2>   "base_url":"https://127.0.0.1:42005/solr",
   [junit4]   2>   "type":"NRT",
   [junit4]   2>   "waitForFinalState":"false"} 
   [junit4]   2> 2659067 INFO  (OverseerStateUpdate-72610147713679368-127.0.0.1:40819_solr-n_0000000000) [n:127.0.0.1:40819_solr     ] o.a.s.c.o.SliceMutator createReplica() {
   [junit4]   2>   "operation":"ADDREPLICA",
   [junit4]   2>   "collection":"MoveReplicaHDFSTest_failed_coll_false",
   [junit4]   2>   "shard":"shard2",
   [junit4]   2>   "core":"MoveReplicaHDFSTest_failed_coll_false_shard2_replica_t6",
   [junit4]   2>   "state":"down",
   [junit4]   2>   "base_url":"https://127.0.0.1:40819/solr",
   [junit4]   2>   "type":"TLOG",
   [junit4]   2>   "waitForFinalState":"false"} 
   [junit4]   2> 2659279 INFO  (qtp223940391-255600) [n:127.0.0.1:42005_solr    x:MoveReplicaHDFSTest_failed_coll_false_shard2_replica_n4 ] o.a.s.h.a.CoreAdminOperation core create command qt=/admin/cores&coreNodeName=core_node7&collection.configName=conf1&newCollection=true&name=MoveReplicaHDFSTest_failed_coll_false_shard2_replica_n4&action=CREATE&numShards=2&collection=MoveReplicaHDFSTest_failed_coll_false&shard=shard2&wt=javabin&version=2&replicaType=NRT
   [junit4]   2> 2659287 INFO  (qtp1582686703-255623) [n:127.0.0.1:34003_solr    x:MoveReplicaHDFSTest_failed_coll_false_shard1_replica_t2 ] o.a.s.h.a.CoreAdminOperation core create command qt=/admin/cores&coreNodeName=core_node5&collection.configName=conf1&newCollection=true&name=MoveReplicaHDFSTest_failed_coll_false_shard1_replica_t2&action=CREATE&numShards=2&collection=MoveReplicaHDFSTest_failed_coll_false&shard=shard1&wt=javabin&version=2&replicaType=TLOG
   [junit4]   2> 2659295 INFO  (qtp606530742-255599) [n:127.0.0.1:40819_solr    x:MoveReplicaHDFSTest_failed_coll_false_shard2_replica_t6 ] o.a.s.h.a.CoreAdminOperation core create command qt=/admin/cores&coreNodeName=core_node8&collection.configName=conf1&newCollection=true&name=MoveReplicaHDFSTest_failed_coll_false_shard2_replica_t6&action=CREATE&numShards=2&collection=MoveReplicaHDFSTest_failed_coll_false&shard=shard2&wt=javabin&version=2&replicaType=TLOG
   [junit4]   2> 2659295 INFO  (qtp606530742-255599) [n:127.0.0.1:40819_solr    x:MoveReplicaHDFSTest_failed_coll_false_shard2_replica_t6 ] o.a.s.c.TransientSolrCoreCacheDefault Allocating transient cache for 4 transient cores
   [junit4]   2> 2659298 INFO  (qtp338223212-255626) [n:127.0.0.1:44423_solr    x:MoveReplicaHDFSTest_failed_coll_false_shard1_replica_n1 ] o.a.s.h.a.CoreAdminOperation core create command qt=/admin/cores&coreNodeName=core_node3&collection.configName=conf1&newCollection=true&name=MoveReplicaHDFSTest_failed_coll_false_shard1_replica_n1&action=CREATE&numShards=2&collection=MoveReplicaHDFSTest_failed_coll_false&shard=shard1&wt=javabin&version=2&replicaType=NRT
   [junit4]   2> 2660297 INFO  (qtp223940391-255600) [n:127.0.0.1:42005_solr c:MoveReplicaHDFSTest_failed_coll_false s:shard2 r:core_node7 x:MoveReplicaHDFSTest_failed_coll_false_shard2_replica_n4 ] o.a.s.c.SolrConfig Using Lucene MatchVersion: 8.4.0
   [junit4]   2> 2660299 INFO  (qtp1582686703-255623) [n:127.0.0.1:34003_solr c:MoveReplicaHDFSTest_failed_coll_false s:shard1 r:core_node5 x:MoveReplicaHDFSTest_failed_coll_false_shard1_replica_t2 ] o.a.s.c.SolrConfig Using Lucene MatchVersion: 8.4.0
   [junit4]   2> 2660303 INFO  (qtp606530742-255599) [n:127.0.0.1:40819_solr c:MoveReplicaHDFSTest_failed_coll_false s:shard2 r:core_node8 x:MoveReplicaHDFSTest_failed_coll_false_shard2_replica_t6 ] o.a.s.c.SolrConfig Using Lucene MatchVersion: 8.4.0
   [junit4]   2> 2660304 INFO  (qtp223940391-255600) [n:127.0.0.1:42005_solr c:MoveReplicaHDFSTest_failed_coll_false s:shard2 r:core_node7 x:MoveReplicaHDFSTest_failed_coll_false_shard2_replica_n4 ] o.a.s.s.IndexSchema [MoveReplicaHDFSTest_failed_coll_false_shard2_replica_n4] Schema name=minimal
   [junit4]   2> 2660306 INFO  (qtp223940391-255600) [n:127.0.0.1:42005_solr c:MoveReplicaHDFSTest_failed_coll_false s:shard2 r:core_node7 x:MoveReplicaHDFSTest_failed_coll_false_shard2_replica_n4 ] o.a.s.s.IndexSchema Loaded schema minimal/1.1 with uniqueid field id
   [junit4]   2> 2660306 INFO  (qtp223940391-255600) [n:127.0.0.1:42005_solr c:MoveReplicaHDFSTest_failed_coll_false s:shard2 r:core_node7 x:MoveReplicaHDFSTest_failed_coll_false_shard2_replica_n4 ] o.a.s.c.CoreContainer Creating SolrCore 'MoveReplicaHDFSTest_failed_coll_false_shard2_replica_n4' using configuration from collection MoveReplicaHDFSTest_failed_coll_false, trusted=true
   [junit4]   2> 2660307 INFO  (qtp338223212-255626) [n:127.0.0.1:44423_solr c:MoveReplicaHDFSTest_failed_coll_false s:shard1 r:core_node3 x:MoveReplicaHDFSTest_failed_coll_false_shard1_replica_n1 ] o.a.s.c.SolrConfig Using Lucene MatchVersion: 8.4.0
   [junit4]   2> 2660307 INFO  (qtp223940391-255600) [n:127.0.0.1:42005_solr c:MoveReplicaHDFSTest_failed_coll_false s:shard2 r:core_node7 x:MoveReplicaHDFSTest_failed_coll_false_shard2_replica_n4 ] o.a.s.m.r.SolrJmxReporter JMX monitoring for 'solr.core.MoveReplicaHDFSTest_failed_coll_false.shard2.replica_n4' (registry 'solr.core.MoveReplicaHDFSTest_failed_coll_false.shard2.replica_n4') enabled at server: com.sun.jmx.mbeanserver.JmxMBeanServer@67dcbf95
   [junit4]   2> 2660322 INFO  (qtp606530742-255599) [n:127.0.0.1:40819_solr c:MoveReplicaHDFSTest_failed_coll_false s:shard2 r:core_node8 x:MoveReplicaHDFSTest_failed_coll_false_shard2_replica_t6 ] o.a.s.s.IndexSchema [MoveReplicaHDFSTest_failed_coll_false_shard2_replica_t6] Schema name=minimal
   [junit4]   2> 2660324 INFO  (qtp606530742-255599) [n:127.0.0.1:40819_solr c:MoveReplicaHDFSTest_failed_coll_false s:shard2 r:core_node8 x:MoveReplicaHDFSTest_failed_coll_false_shard2_replica_t6 ] o.a.s.s.IndexSchema Loaded schema minimal/1.1 with uniqueid field id
   [junit4]   2> 2660324 INFO  (qtp606530742-255599) [n:127.0.0.1:40819_solr c:MoveReplicaHDFSTest_failed_coll_false s:shard2 r:core_node8 x:MoveReplicaHDFSTest_failed_coll_false_shard2_replica_t6 ] o.a.s.c.CoreContainer Creating SolrCore 'MoveReplicaHDFSTest_failed_coll_false_shard2_replica_t6' using configuration from collection MoveReplicaHDFSTest_failed_coll_false, trusted=true
   [junit4]   2> 2660324 INFO  (qtp606530742-255599) [n:127.0.0.1:40819_solr c:MoveReplicaHDFSTest_failed_coll_false s:shard2 r:core_node8 x:MoveReplicaHDFSTest_failed_coll_false_shard2_replica_t6 ] o.a.s.m.r.SolrJmxReporter JMX monitoring for 'solr.core.MoveReplicaHDFSTest_failed_coll_false.shard2.replica_t6' (registry 'solr.core.MoveReplicaHDFSTest_failed_coll_false.shard2.replica_t6') enabled at server: com.sun.jmx.mbeanserver.JmxMBeanServer@67dcbf95
   [junit4]   2> 2660327 INFO  (qtp338223212-255626) [n:127.0.0.1:44423_solr c:MoveReplicaHDFSTest_failed_coll_false s:shard1 r:core_node3 x:MoveReplicaHDFSTest_failed_coll_false_shard1_replica_n1 ] o.a.s.s.IndexSchema [MoveReplicaHDFSTest_failed_coll_false_shard1_replica_n1] Schema name=minimal
   [junit4]   2> 2660328 INFO  (qtp338223212-255626) [n:127.0.0.1:44423_solr c:MoveReplicaHDFSTest_failed_coll_false s:shard1 r:core_node3 x:MoveReplicaHDFSTest_failed_coll_false_shard1_replica_n1 ] o.a.s.s.IndexSchema Loaded schema minimal/1.1 with uniqueid field id
   [junit4]   2> 2660328 INFO  (qtp338223212-255626) [n:127.0.0.1:44423_solr c:MoveReplicaHDFSTest_failed_coll_false s:shard1 r:core_node3 x:MoveReplicaHDFSTest_failed_coll_false_shard1_replica_n1 ] o.a.s.c.CoreContainer Creating SolrCore 'MoveReplicaHDFSTest_failed_coll_false_shard1_replica_n1' using configuration from collection MoveReplicaHDFSTest_failed_coll_false, trusted=true
   [junit4]   2> 2660328 INFO  (qtp338223212-255626) [n:127.0.0.1:44423_solr c:MoveReplicaHDFSTest_failed_coll_false s:shard1 r:core_node3 x:MoveReplicaHDFSTest_failed_coll_false_shard1_replica_n1 ] o.a.s.m.r.SolrJmxReporter JMX monitoring for 'solr.core.MoveReplicaHDFSTest_failed_coll_false.shard1.replica_n1' (registry 'solr.core.MoveReplicaHDFSTest_failed_coll_false.shard1.replica_n1') enabled at server: com.sun.jmx.mbeanserver.JmxMBeanServer@67dcbf95
   [junit4]   2> 2660328 INFO  (qtp1582686703-255623) [n:127.0.0.1:34003_solr c:MoveReplicaHDFSTest_failed_coll_false s:shard1 r:core_node5 x:MoveReplicaHDFSTest_failed_coll_false_shard1_replica_t2 ] o.a.s.s.IndexSchema [MoveReplicaHDFSTest_failed_coll_false_shard1_replica_t2] Schema name=minimal
   [junit4]   2> 2660330 INFO  (qtp1582686703-255623) [n:127.0.0.1:34003_solr c:MoveReplicaHDFSTest_failed_coll_false s:shard1 r:core_node5 x:MoveReplicaHDFSTest_failed_coll_false_shard1_replica_t2 ] o.a.s.s.IndexSchema Loaded schema minimal/1.1 with uniqueid field id
   [junit4]   2> 2660330 INFO  (qtp1582686703-255623) [n:127.0.0.1:34003_solr c:MoveReplicaHDFSTest_failed_coll_false s:shard1 r:core_node5 x:MoveReplicaHDFSTest_failed_coll_false_shard1_replica_t2 ] o.a.s.c.CoreContainer Creating SolrCore 'MoveReplicaHDFSTest_failed_coll_false_shard1_replica_t2' using configuration from collection MoveReplicaHDFSTest_failed_coll_false, trusted=true
   [junit4]   2> 2660330 INFO  (qtp1582686703-255623) [n:127.0.0.1:34003_solr c:MoveReplicaHDFSTest_failed_coll_false s:shard1 r:core_node5 x:MoveReplicaHDFSTest_failed_coll_false_shard1_replica_t2 ] o.a.s.m.r.SolrJmxReporter JMX monitoring for 'solr.core.MoveReplicaHDFSTest_failed_coll_false.shard1.replica_t2' (registry 'solr.core.MoveReplicaHDFSTest_failed_coll_false.shard1.replica_t2') enabled at server: com.sun.jmx.mbeanserver.JmxMBeanServer@67dcbf95
   [junit4]   2> 2660333 INFO  (qtp223940391-255600) [n:127.0.0.1:42005_solr c:MoveReplicaHDFSTest_failed_coll_false s:shard2 r:core_node7 x:MoveReplicaHDFSTest_failed_coll_false_shard2_replica_n4 ] o.a.s.c.HdfsDirectoryFactory solr.hdfs.home=hdfs://localhost.localdomain:42125/solr_hdfs_home
   [junit4]   2> 2660333 INFO  (qtp223940391-255600) [n:127.0.0.1:42005_solr c:MoveReplicaHDFSTest_failed_coll_false s:shard2 r:core_node7 x:MoveReplicaHDFSTest_failed_coll_false_shard2_replica_n4 ] o.a.s.c.HdfsDirectoryFactory Solr Kerberos Authentication disabled
   [junit4]   2> 2660333 INFO  (qtp223940391-255600) [n:127.0.0.1:42005_solr c:MoveReplicaHDFSTest_failed_coll_false s:shard2 r:core_node7 x:MoveReplicaHDFSTest_failed_coll_false_shard2_replica_n4 ] o.a.s.c.SolrCore [[MoveReplicaHDFSTest_failed_coll_false_shard2_replica_n4] ] Opening new SolrCore at [/home/jenkins/jenkins-slave/workspace/Lucene-Solr-BadApples-NightlyTests-8.x/checkout/solr/build/solr-core/test/J2/temp/solr.cloud.MoveReplicaHDFSTest_D299982DB3E11D17-001/tempDir-002/node2/MoveReplicaHDFSTest_failed_coll_false_shard2_replica_n4], dataDir=[hdfs://localhost.localdomain:42125/solr_hdfs_home/MoveReplicaHDFSTest_failed_coll_false/core_node7/data/]
   [junit4]   2> 2660333 INFO  (qtp338223212-255626) [n:127.0.0.1:44423_solr c:MoveReplicaHDFSTest_failed_coll_false s:shard1 r:core_node3 x:MoveReplicaHDFSTest_failed_coll_false_shard1_replica_n1 ] o.a.s.c.HdfsDirectoryFactory solr.hdfs.home=hdfs://localhost.localdomain:42125/solr_hdfs_home
   [junit4]   2> 2660333 INFO  (qtp338223212-255626) [n:127.0.0.1:44423_solr c:MoveReplicaHDFSTest_failed_coll_false s:shard1 r:core_node3 x:MoveReplicaHDFSTest_failed_coll_false_shard1_replica_n1 ] o.a.s.c.HdfsDirectoryFactory Solr Kerberos Authentication disabled
   [junit4]   2> 2660333 INFO  (qtp338223212-255626) [n:127.0.0.1:44423_solr c:MoveReplicaHDFSTest_failed_coll_false s:shard1 r:core_node3 x:MoveReplicaHDFSTest_failed_coll_false_shard1_replica_n1 ] o.a.s.c.SolrCore [[MoveReplicaHDFSTest_failed_coll_false_shard1_replica_n1] ] Opening new SolrCore at [/home/jenkins/jenkins-slave/workspace/Lucene-Solr-BadApples-NightlyTests-8.x/checkout/solr/build/solr-core/test/J2/temp/solr.cloud.MoveReplicaHDFSTest_D299982DB3E11D17-001/tempDir-002/node1/MoveReplicaHDFSTest_failed_coll_false_shard1_replica_n1], dataDir=[hdfs://localhost.localdomain:42125/solr_hdfs_home/MoveReplicaHDFSTest_failed_coll_false/core_node3/data/]
   [junit4]   2> 2660334 INFO  (qtp223940391-255600) [n:127.0.0.1:42005_solr c:MoveReplicaHDFSTest_failed_coll_false s:shard2 r:core_node7 x:MoveReplicaHDFSTest_failed_coll_false_shard2_replica_n4 ] o.a.s.c.HdfsDirectoryFactory creating directory factory for path hdfs://localhost.localdomain:42125/solr_hdfs_home/MoveReplicaHDFSTest_failed_coll_false/core_node7/data/snapshot_metadata
   [junit4]   2> 2660334 INFO  (qtp1582686703-255623) [n:127.0.0.1:34003_solr c:MoveReplicaHDFSTest_failed_coll_false s:shard1 r:core_node5 x:MoveReplicaHDFSTest_failed_coll_false_shard1_replica_t2 ] o.a.s.c.HdfsDirectoryFactory solr.hdfs.home=hdfs://localhost.localdomain:42125/solr_hdfs_home
   [junit4]   2> 2660334 INFO  (qtp1582686703-255623) [n:127.0.0.1:34003_solr c:MoveReplicaHDFSTest_failed_coll_false s:shard1 r:core_node5 x:MoveReplicaHDFSTest_failed_coll_false_shard1_replica_t2 ] o.a.s.c.HdfsDirectoryFactory Solr Kerberos Authentication disabled
   [junit4]   2> 2660334 INFO  (qtp338223212-255626) [n:127.0.0.1:44423_solr c:MoveReplicaHDFSTest_failed_coll_false s:shard1 r:core_node3 x:MoveReplicaHDFSTest_failed_coll_false_shard1_replica_n1 ] o.a.s.c.HdfsDirectoryFactory creating directory factory for path hdfs://localhost.localdomain:42125/solr_hdfs_home/MoveReplicaHDFSTest_failed_coll_false/core_node3/data/snapshot_metadata
   [junit4]   2> 2660334 INFO  (qtp1582686703-255623) [n:127.0.0.1:34003_solr c:MoveReplicaHDFSTest_failed_coll_false s:shard1 r:core_node5 x:MoveReplicaHDFSTest_failed_coll_false_shard1_replica_t2 ] o.a.s.c.SolrCore [[MoveReplicaHDFSTest_failed_coll_false_shard1_replica_t2] ] Opening new SolrCore at [/home/jenkins/jenkins-slave/workspace/Lucene-Solr-BadApples-NightlyTests-8.x/checkout/solr/build/solr-core/test/J2/temp/solr.cloud.MoveReplicaHDFSTest_D299982DB3E11D17-001/tempDir-002/node3/MoveReplicaHDFSTest_failed_coll_false_shard1_replica_t2], dataDir=[hdfs://localhost.localdomain:42125/solr_hdfs_home/MoveReplicaHDFSTest_failed_coll_false/core_node5/data/]
   [junit4]   2> 2660335 INFO  (qtp1582686703-255623) [n:127.0.0.1:34003_solr c:MoveReplicaHDFSTest_failed_coll_false s:shard1 r:core_node5 x:MoveReplicaHDFSTest_failed_coll_false_shard1_replica_t2 ] o.a.s.c.HdfsDirectoryFactory creating directory factory for path hdfs://localhost.localdomain:42125/solr_hdfs_home/MoveReplicaHDFSTest_failed_coll_false/core_node5/data/snapshot_metadata
   [junit4]   2> 2660335 INFO  (qtp606530742-255599) [n:127.0.0.1:40819_solr c:MoveReplicaHDFSTest_failed_coll_false s:shard2 r:core_node8 x:MoveReplicaHDFSTest_failed_coll_false_shard2_replica_t6 ] o.a.s.c.HdfsDirectoryFactory solr.hdfs.home=hdfs://localhost.localdomain:42125/solr_hdfs_home
   [junit4]   2> 2660335 INFO  (qtp606530742-255599) [n:127.0.0.1:40819_solr c:MoveReplicaHDFSTest_failed_coll_false s:shard2 r:core_node8 x:MoveReplicaHDFSTest_failed_coll_false_shard2_replica_t6 ] o.a.s.c.HdfsDirectoryFactory Solr Kerberos Authentication disabled
   [junit4]   2> 2660335 INFO  (qtp606530742-255599) [n:127.0.0.1:40819_solr c:MoveReplicaHDFSTest_failed_coll_false s:shard2 r:core_node8 x:MoveReplicaHDFSTest_failed_coll_false_shard2_replica_t6 ] o.a.s.c.SolrCore [[MoveReplicaHDFSTest_failed_coll_false_shard2_replica_t6] ] Opening new SolrCore at [/home/jenkins/jenkins-slave/workspace/Lucene-Solr-BadApples-NightlyTests-8.x/checkout/solr/build/solr-core/test/J2/temp/solr.cloud.MoveReplicaHDFSTest_D299982DB3E11D17-001/tempDir-002/node4/MoveReplicaHDFSTest_failed_coll_false_shard2_replica_t6], dataDir=[hdfs://localhost.localdomain:42125/solr_hdfs_home/MoveReplicaHDFSTest_failed_coll_false/core_node8/data/]
   [junit4]   2> 2660335 INFO  (qtp606530742-255599) [n:127.0.0.1:40819_solr c:MoveReplicaHDFSTest_failed_coll_false s:shard2 r:core_node8 x:MoveReplicaHDFSTest_failed_coll_false_shard2_replica_t6 ] o.a.s.c.HdfsDirectoryFactory creating directory factory for path hdfs://localhost.localdomain:42125/solr_hdfs_home/MoveReplicaHDFSTest_failed_coll_false/core_node8/data/snapshot_metadata
   [junit4]   2> 2660339 INFO  (qtp223940391-255600) [n:127.0.0.1:42005_solr c:MoveReplicaHDFSTest_failed_coll_false s:shard2 r:core_node7 x:MoveReplicaHDFSTest_failed_coll_false_shard2_replica_n4 ] o.a.s.c.HdfsDirectoryFactory Number of slabs of block cache [1] with direct memory allocation set to [true]
   [junit4]   2> 2660339 INFO  (qtp1582686703-255623) [n:127.0.0.1:34003_solr c:MoveReplicaHDFSTest_failed_coll_false s:shard1 r:core_node5 x:MoveReplicaHDFSTest_failed_coll_false_shard1_replica_t2 ] o.a.s.c.HdfsDirectoryFactory Number of slabs of block cache [1] with direct memory allocation set to [true]
   [junit4]   2> 2660339 INFO  (qtp223940391-255600) [n:127.0.0.1:42005_solr c:MoveReplicaHDFSTest_failed_coll_false s:shard2 r:core_node7 x:MoveReplicaHDFSTest_failed_coll_false_shard2_replica_n4 ] o.a.s.c.HdfsDirectoryFactory Block cache target memory usage, slab size of [33554432] will allocate [1] slabs and use ~[33554432] bytes
   [junit4]   2> 2660339 INFO  (qtp1582686703-255623) [n:127.0.0.1:34003_solr c:MoveReplicaHDFSTest_failed_coll_false s:shard1 r:core_node5 x:MoveReplicaHDFSTest_failed_coll_false_shard1_replica_t2 ] o.a.s.c.HdfsDirectoryFactory Block cache target memory usage, slab size of [33554432] will allocate [1] slabs and use ~[33554432] bytes
   [junit4]   2> 2660341 INFO  (qtp223940391-255600) [n:127.0.0.1:42005_solr c:MoveReplicaHDFSTest_failed_coll_false s:shard2 r:core_node7 x:MoveReplicaHDFSTest_failed_coll_false_shard2_replica_n4 ] o.a.s.s.b.BlockDirectory Block cache on write is disabled
   [junit4]   2> 2660341 INFO  (qtp1582686703-255623) [n:127.0.0.1:34003_solr c:MoveReplicaHDFSTest_failed_coll_false s:shard1 r:core_node5 x:MoveReplicaHDFSTest_failed_coll_false_shard1_replica_t2 ] o.a.s.s.b.BlockDirectory Block cache on write is disabled
   [junit4]   2> 2660342 INFO  (qtp223940391-255600) [n:127.0.0.1:42005_solr c:MoveReplicaHDFSTest_failed_coll_false s:shard2 r:core_node7 x:MoveReplicaHDFSTest_failed_coll_false_shard2_replica_n4 ] o.a.s.c.HdfsDirectoryFactory creating directory factory for path hdfs://localhost.localdomain:42125/solr_hdfs_home/MoveReplicaHDFSTest_failed_coll_false/core_node7/data
   [junit4]   2> 2660342 INFO  (qtp1582686703-255623) [n:127.0.0.1:34003_solr c:MoveReplicaHDFSTest_failed_coll_false s:shard1 r:core_node5 x:MoveReplicaHDFSTest_failed_coll_false_shard1_replica_t2 ] o.a.s.c.HdfsDirectoryFactory creating directory factory for path hdfs://localhost.localdomain:42125/solr_hdfs_home/MoveReplicaHDFSTest_failed_coll_false/core_node5/data
   [junit4]   2> 2660342 INFO  (qtp606530742-255599) [n:127.0.0.1:40819_solr c:MoveReplicaHDFSTest_failed_coll_false s:shard2 r:core_node8 x:MoveReplicaHDFSTest_failed_coll_false_shard2_replica_t6 ] o.a.s.c.HdfsDirectoryFactory Number of slabs of block cache [1] with direct memory allocation set to [true]
   [junit4]   2> 2660342 INFO  (qtp606530742-255599) [n:127.0.0.1:40819_solr c:MoveReplicaHDFSTest_failed_coll_false s:shard2 r:core_node8 x:MoveReplicaHDFSTest_failed_coll_false_shard2_replica_t6 ] o.a.s.c.HdfsDirectoryFactory Block cache target memory usage, slab size of [33554432] will allocate [1] slabs and use ~[33554432] bytes
   [junit4]   2> 2660344 INFO  (qtp338223212-255626) [n:127.0.0.1:44423_solr c:MoveReplicaHDFSTest_failed_coll_false s:shard1 r:core_node3 x:MoveReplicaHDFSTest_failed_coll_false_shard1_replica_n1 ] o.a.s.c.HdfsDirectoryFactory Number of slabs of block cache [1] with direct memory allocation set to [true]
   [junit4]   2> 2660344 INFO  (qtp338223212-255626) [n:127.0.0.1:44423_solr c:MoveReplicaHDFSTest_failed_coll_false s:shard1 r:core_node3 x:MoveReplicaHDFSTest_failed_coll_false_shard1_replica_n1 ] o.a.s.c.HdfsDirectoryFactory Block cache target memory usage, slab size of [33554432] will allocate [1] slabs and use ~[33554432] bytes
   [junit4]   2> 2660346 INFO  (qtp606530742-255599) [n:127.0.0.1:40819_solr c:MoveReplicaHDFSTest_failed_coll_false s:shard2 r:core_node8 x:MoveReplicaHDFSTest_failed_coll_false_shard2_replica_t6 ] o.a.s.s.b.BlockDirectory Block cache on write is disabled
   [junit4]   2> 2660346 INFO  (qtp338223212-255626) [n:127.0.0.1:44423_solr c:MoveReplicaHDFSTest_failed_coll_false s:shard1 r:core_node3 x:MoveReplicaHDFSTest_failed_coll_false_shard1_replica_n1 ] o.a.s.s.b.BlockDirectory Block cache on write is disabled
   [junit4]   2> 2660346 INFO  (qtp606530742-255599) [n:127.0.0.1:40819_solr c:MoveReplicaHDFSTest_failed_coll_false s:shard2 r:core_node8 x:MoveReplicaHDFSTest_failed_coll_false_shard2_replica_t6 ] o.a.s.c.HdfsDirectoryFactory creating directory factory for path hdfs://localhost.localdomain:42125/solr_hdfs_home/MoveReplicaHDFSTest_failed_coll_false/core_node8/data
   [junit4]   2> 2660350 INFO  (qtp338223212-255626) [n:127.0.0.1:44423_solr c:MoveReplicaHDFSTest_failed_coll_false s:shard1 r:core_node3 x:MoveReplicaHDFSTest_failed_coll_false_shard1_replica_n1 ] o.a.s.c.HdfsDirectoryFactory creating directory factory for path hdfs://localhost.localdomain:42125/solr_hdfs_home/MoveReplicaHDFSTest_failed_coll_false/core_node3/data
   [junit4]   2> 2660356 INFO  (qtp606530742-255599) [n:127.0.0.1:40819_solr c:MoveReplicaHDFSTest_failed_coll_false s:shard2 r:core_node8 x:MoveReplicaHDFSTest_failed_coll_false_shard2_replica_t6 ] o.a.s.c.HdfsDirectoryFactory creating directory factory for path hdfs://localhost.localdomain:42125/solr_hdfs_home/MoveReplicaHDFSTest_failed_coll_false/core_node8/data/index
   [junit4]   2> 2660361 INFO  (qtp606530742-255599) [n:127.0.0.1:40819_solr c:MoveReplicaHDFSTest_failed_coll_false s:shard2 r:core_node8 x:MoveReplicaHDFSTest_failed_coll_false_shard2_replica_t6 ] o.a.s.c.HdfsDirectoryFactory Number of slabs of block cache [1] with direct memory allocation set to [true]
   [junit4]   2> 2660361 INFO  (qtp606530742-255599) [n:127.0.0.1:40819_solr c:MoveReplicaHDFSTest_failed_coll_false s:shard2 r:core_node8 x:MoveReplicaHDFSTest_failed_coll_false_shard2_replica_t6 ] o.a.s.c.HdfsDirectoryFactory Block cache target memory usage, slab size of [33554432] will allocate [1] slabs and use ~[33554432] bytes
   [junit4]   2> 2660361 INFO  (qtp1582686703-255623) [n:127.0.0.1:34003_solr c:MoveReplicaHDFSTest_failed_coll_false s:shard1 r:core_node5 x:MoveReplicaHDFSTest_failed_coll_false_shard1_replica_t2 ] o.a.s.c.HdfsDirectoryFactory creating directory factory for path hdfs://localhost.localdomain:42125/solr_hdfs_home/MoveReplicaHDFSTest_failed_coll_false/core_node5/data/index
   [junit4]   2> 2660362 INFO  (qtp223940391-255600) [n:127.0.0.1:42005_solr c:MoveReplicaHDFSTest_failed_coll_false s:shard2 r:core_node7 x:MoveReplicaHDFSTest_failed_coll_false_shard2_replica_n4 ] o.a.s.c.HdfsDirectoryFactory creating directory factory for path hdfs://localhost.localdomain:42125/solr_hdfs_home/MoveReplicaHDFSTest_failed_coll_false/core_node7/data/index
   [junit4]   2> 2660362 INFO  (qtp606530742-255599) [n:127.0.0.1:40819_solr c:MoveReplicaHDFSTest_failed_coll_false s:shard2 r:core_node8 x:MoveReplicaHDFSTest_failed_coll_false_shard2_replica_t6 ] o.a.s.s.b.BlockDirectory Block cache on write is disabled
   [junit4]   2> 2660367 INFO  (qtp338223212-255626) [n:127.0.0.1:44423_solr c:MoveReplicaHDFSTest_failed_coll_false s:shard1 r:core_node3 x:MoveReplicaHDFSTest_failed_coll_false_shard1_replica_n1 ] o.a.s.c.HdfsDirectoryFactory creating directory factory for path hdfs://localhost.localdomain:42125/solr_hdfs_home/MoveReplicaHDFSTest_failed_coll_false/core_node3/data/index
   [junit4]   2> 2660369 INFO  (qtp223940391-255600) [n:127.0.0.1:42005_solr c:MoveReplicaHDFSTest_failed_coll_false s:shard2 r:core_node7 x:MoveReplicaHDFSTest_failed_coll_false_shard2_replica_n4 ] o.a.s.c.HdfsDirectoryFactory Number of slabs of block cache [1] with direct memory allocation set to [true]
   [junit4]   2> 2660370 INFO  (qtp223940391-255600) [n:127.0.0.1:42005_solr c:MoveReplicaHDFSTest_failed_coll_false s:shard2 r:core_node7 x:MoveReplicaHDFSTest_failed_coll_false_shard2_replica_n4 ] o.a.s.c.HdfsDirectoryFactory Block cache target memory usage, slab size of [33554432] will allocate [1] slabs and use ~[33554432] bytes
   [junit4]   2> 2660371 INFO  (qtp1582686703-255623) [n:127.0.0.1:34003_solr c:MoveReplicaHDFSTest_failed_coll_false s:shard1 r:core_node5 x:MoveReplicaHDFSTest_failed_coll_false_shard1_replica_t2 ] o.a.s.c.HdfsDirectoryFactory Number of slabs of block cache [1] with direct memory allocation set to [true]
   [junit4]   2> 2660371 INFO  (qtp1582686703-255623) [n:127.0.0.1:34003_solr c:MoveReplicaHDFSTest_failed_coll_false s:shard1 r:core_node5 x:MoveReplicaHDFSTest_failed_coll_false_shard1_replica_t2 ] o.a.s.c.HdfsDirectoryFactory Block cache target memory usage, slab size of [33554432] will allocate [1] slabs and use ~[33554432] bytes
   [junit4]   2> 2660371 INFO  (qtp223940391-255600) [n:127.0.0.1:42005_solr c:MoveReplicaHDFSTest_failed_coll_false s:shard2 r:core_node7 x:MoveReplicaHDFSTest_failed_coll_false_shard2_replica_n4 ] o.a.s.s.b.BlockDirectory Block cache on write is disabled
   [junit4]   2> 2660372 INFO  (qtp338223212-255626) [n:127.0.0.1:44423_solr c:MoveReplicaHDFSTest_failed_coll_false s:shard1 r:core_node3 x:MoveReplicaHDFSTest_failed_coll_false_shard1_replica_n1 ] o.a.s.c.HdfsDirectoryFactory Number of slabs of block cache [1] with direct memory allocation set to [true]
   [junit4]   2> 2660372 INFO  (qtp338223212-255626) [n:127.0.0.1:44423_solr c:MoveReplicaHDFSTest_failed_coll_false s:shard1 r:core_node3 x:MoveReplicaHDFSTest_failed_coll_false_shard1_replica_n1 ] o.a.s.c.HdfsDirectoryFactory Block cache target memory usage, slab size of [33554432] will allocate [1] slabs and use ~[33554432] bytes
   [junit4]   2> 2660372 INFO  (qtp1582686703-255623) [n:127.0.0.1:34003_solr c:MoveReplicaHDFSTest_failed_coll_false s:shard1 r:core_node5 x:MoveReplicaHDFSTest_failed_coll_false_shard1_replica_t2 ] o.a.s.s.b.BlockDirectory Block cache on write is disabled
   [junit4]   2> 2660373 INFO  (qtp338223212-255626) [n:127.0.0.1:44423_solr c:MoveReplicaHDFSTest_failed_coll_false s:shard1 r:core_node3 x:MoveReplicaHDFSTest_failed_coll_false_shard1_replica_n1 ] o.a.s.s.b.BlockDirectory Block cache on write is disabled
   [junit4]   2> 2660444 INFO  (qtp606530742-255599) [n:127.0.0.1:40819_solr c:MoveReplicaHDFSTest_failed_coll_false s:shard2 r:core_node8 x:MoveReplicaHDFSTest_failed_coll_false_shard2_replica_t6 ] o.a.s.u.UpdateHandler Using UpdateLog implementation: org.apache.solr.update.HdfsUpdateLog
   [junit4]   2> 2660444 INFO  (qtp606530742-255599) [n:127.0.0.1:40819_solr c:MoveReplicaHDFSTest_failed_coll_false s:shard2 r:core_node8 x:MoveReplicaHDFSTest_failed_coll_false_shard2_replica_t6 ] o.a.s.u.UpdateLog Initializing UpdateLog: dataDir=null defaultSyncLevel=FLUSH numRecordsToKeep=100 maxNumLogsToKeep=10 numVersionBuckets=65536
   [junit4]   2> 2660444 INFO  (qtp606530742-255599) [n:127.0.0.1:40819_solr c:MoveReplicaHDFSTest_failed_coll_false s:shard2 r:core_node8 x:MoveReplicaHDFSTest_failed_coll_false_shard2_replica_t6 ] o.a.s.u.HdfsUpdateLog Initializing HdfsUpdateLog: tlogDfsReplication=3
   [junit4]   2> 2660451 INFO  (qtp606530742-255599) [n:127.0.0.1:40819_solr c:MoveReplicaHDFSTest_failed_coll_false s:shard2 r:core_node8 x:MoveReplicaHDFSTest_failed_coll_false_shard2_replica_t6 ] o.a.s.u.CommitTracker Hard AutoCommit: disabled
   [junit4]   2> 2660451 INFO  (qtp606530742-255599) [n:127.0.0.1:40819_solr c:MoveReplicaHDFSTest_failed_coll_false s:shard2 r:core_node8 x:MoveReplicaHDFSTest_failed_coll_false_shard2_replica_t6 ] o.a.s.u.CommitTracker Soft AutoCommit: disabled
   [junit4]   2> 2660472 INFO  (qtp1582686703-255623) [n:127.0.0.1:34003_solr c:MoveReplicaHDFSTest_failed_coll_false s:shard1 r:core_node5 x:MoveReplicaHDFSTest_failed_coll_false_shard1_replica_t2 ] o.a.s.u.UpdateHandler Using UpdateLog implementation: org.apache.solr.update.HdfsUpdateLog
   [junit4]   2> 2660472 INFO  (qtp1582686703-255623) [n:127.0.0.1:34003_solr c:MoveReplicaHDFSTest_failed_coll_false s:shard1 r:core_node5 x:MoveReplicaHDFSTest_failed_coll_false_shard1_replica_t2 ] o.a.s.u.UpdateLog Initializing UpdateLog: dataDir=null defaultSyncLevel=FLUSH numRecordsToKeep=100 maxNumLogsToKeep=10 numVersionBuckets=65536
   [junit4]   2> 2660472 INFO  (qtp1582686703-255623) [n:127.0.0.1:34003_solr c:MoveReplicaHDFSTest_failed_coll_false s:shard1 r:core_node5 x:MoveReplicaHDFSTest_failed_coll_false_shard1_replica_t2 ] o.a.s.u.HdfsUpdateLog Initializing HdfsUpdateLog: tlogDfsReplication=3
   [junit4]   2> 2660473 INFO  (qtp606530742-255599) [n:127.0.0.1:40819_solr c:MoveReplicaHDFSTest_failed_coll_false s:shard2 r:core_node8 x:MoveReplicaHDFSTest_failed_coll_false_shard2_replica_t6 ] o.a.s.s.SolrIndexSearcher Opening [Searcher@4610c79a[MoveReplicaHDFSTest_failed_coll_false_shard2_replica_t6] main]
   [junit4]   2> 2660474 INFO  (qtp606530742-255599) [n:127.0.0.1:40819_solr c:MoveReplicaHDFSTest_failed_coll_false s:shard2 r:core_node8 x:MoveReplicaHDFSTest_failed_coll_false_shard2_replica_t6 ] o.a.s.r.ManagedResourceStorage Configured ZooKeeperStorageIO with znodeBase: /configs/conf1
   [junit4]   2> 2660474 INFO  (qtp606530742-255599) [n:127.0.0.1:40819_solr c:MoveReplicaHDFSTest_failed_coll_false s:shard2 r:core_node8 x:MoveReplicaHDFSTest_failed_coll_false_shard2_replica_t6 ] o.a.s.r.ManagedResourceStorage Loaded null at path _rest_managed.json using ZooKeeperStorageIO:path=/configs/conf1
   [junit4]   2> 2660475 INFO  (qtp606530742-255599) [n:127.0.0.1:40819_solr c:MoveReplicaHDFSTest_failed_coll_false s:shard2 r:core_node8 x:MoveReplicaHDFSTest_failed_coll_false_shard2_replica_t6 ] o.a.s.h.ReplicationHandler Commits will be reserved for 10000ms.
   [junit4]   2> 2660475 INFO  (qtp606530742-255599) [n:127.0.0.1:40819_solr c:MoveReplicaHDFSTest_failed_coll_false s:shard2 r:core_node8 x:MoveReplicaHDFSTest_failed_coll_false_shard2_replica_t6 ] o.a.s.u.UpdateLog Could not find max version in index or recent updates, using new clock 1648371653035425792
   [junit4]   2> 2660476 INFO  (qtp338223212-255626) [n:127.0.0.1:44423_solr c:MoveReplicaHDFSTest_failed_coll_false s:shard1 r:core_node3 x:MoveReplicaHDFSTest_failed_coll_false_shard1_replica_n1 ] o.a.s.u.UpdateHandler Using UpdateLog implementation: org.apache.solr.update.HdfsUpdateLog
   [junit4]   2> 2660476 INFO  (qtp338223212-255626) [n:127.0.0.1:44423_solr c:MoveReplicaHDFSTest_failed_coll_false s:shard1 r:core_node3 x:MoveReplicaHDFSTest_failed_coll_false_shard1_replica_n1 ] o.a.s.u.UpdateLog Initializing UpdateLog: dataDir=null defaultSyncLevel=FLUSH numRecordsToKeep=100 maxNumLogsToKeep=10 numVersionBuckets=65536
   [junit4]   2> 2660476 INFO  (qtp338223212-255626) [n:127.0.0.1:44423_solr c:MoveReplicaHDFSTest_failed_coll_false s:shard1 r:core_node3 x:MoveReplicaHDFSTest_failed_coll_false_shard1_replica_n1 ] o.a.s.u.HdfsUpdateLog Initializing HdfsUpdateLog: tlogDfsReplication=3
   [junit4]   2> 2660477 INFO  (searcherExecutor-10024-thread-1-processing-n:127.0.0.1:40819_solr x:MoveReplicaHDFSTest_failed_coll_false_shard2_replica_t6 c:MoveReplicaHDFSTest_failed_coll_false s:shard2 r:core_node8) [n:127.0.0.1:40819_solr c:MoveReplicaHDFSTest_failed_coll_false s:shard2 r:core_node8 x:MoveReplicaHDFSTest_failed_coll_false_shard2_replica_t6 ] o.a.s.c.SolrCore [MoveReplicaHDFSTest_failed_coll_false_shard2_replica_t6] Registered new searcher Searcher@4610c79a[MoveReplicaHDFSTest_failed_coll_false_shard2_replica_t6] main{ExitableDirectoryReader(UninvertingDirectoryReader())}
   [junit4]   2> 2660478 INFO  (qtp223940391-255600) [n:127.0.0.1:42005_solr c:MoveReplicaHDFSTest_failed_coll_false s:shard2 r:core_node7 x:MoveReplicaHDFSTest_failed_coll_false_shard2_replica_n4 ] o.a.s.u.UpdateHandler Using UpdateLog implementation: org.apache.solr.update.HdfsUpdateLog
   [junit4]   2> 2660478 INFO  (qtp223940391-255600) [n:127.0.0.1:42005_solr c:MoveReplicaHDFSTest_failed_coll_false s:shard2 r:core_node7 x:MoveReplicaHDFSTest_failed_coll_false_shard2_replica_n4 ] o.a.s.u.UpdateLog Initializing UpdateLog: dataDir=null defaultSyncLevel=FLUSH numRecordsToKeep=100 maxNumLogsToKeep=10 numVersionBuckets=65536
   [junit4]   2> 2660478 INFO  (qtp223940391-255600) [n:127.0.0.1:42005_solr c:MoveReplicaHDFSTest_failed_coll_false s:shard2 r:core_node7 x:MoveReplicaHDFSTest_failed_coll_false_shard2_replica_n4 ] o.a.s.u.HdfsUpdateLog Initializing HdfsUpdateLog: tlogDfsReplication=3
   [junit4]   2> 2660482 INFO  (qtp1582686703-255623) [n:127.0.0.1:34003_solr c:MoveReplicaHDFSTest_failed_coll_false s:shard1 r:core_node5 x:MoveReplicaHDFSTest_failed_coll_false_shard1_replica_t2 ] o.a.s.u.CommitTracker Hard AutoCommit: disabled
   [junit4]   2> 2660482 INFO  (qtp1582686703-255623) [n:127.0.0.1:34003_solr c:MoveReplicaHDFSTest_failed_coll_false s:shard1 r:core_node5 x:MoveReplicaHDFSTest_failed_coll_false_shard1_replica_t2 ] o.a.s.u.CommitTracker Soft AutoCommit: disabled
   [junit4]   2> 2660483 INFO  (qtp606530742-255599) [n:127.0.0.1:40819_solr c:MoveReplicaHDFSTest_failed_coll_false s:shard2 r:core_node8 x:MoveReplicaHDFSTest_failed_coll_false_shard2_replica_t6 ] o.a.s.c.ZkShardTerms Successful update of terms at /collections/MoveReplicaHDFSTest_failed_coll_false/terms/shard2 to Terms{values={core_node8=0}, version=0}
   [junit4]   2> 2660483 INFO  (qtp606530742-255599) [n:127.0.0.1:40819_solr c:MoveReplicaHDFSTest_failed_coll_false s:shard2 r:core_node8 x:MoveReplicaHDFSTest_failed_coll_false_shard2_replica_t6 ] o.a.s.c.ShardLeaderElectionContextBase make sure parent is created /collections/MoveReplicaHDFSTest_failed_coll_false/leaders/shard2
   [junit4]   2> 2660485 INFO  (qtp606530742-255599) [n:127.0.0.1:40819_solr c:MoveReplicaHDFSTest_failed_coll_false s:shard2 r:core_node8 x:MoveReplicaHDFSTest_failed_coll_false_shard2_replica_t6 ] o.a.s.c.ShardLeaderElectionContext Waiting until we see more replicas up for shard shard2: total=2 found=1 timeoutin=14999ms
   [junit4]   2> 2660486 INFO  (qtp338223212-255626) [n:127.0.0.1:44423_solr c:MoveReplicaHDFSTest_failed_coll_false s:shard1 r:core_node3 x:MoveReplicaHDFSTest_failed_coll_false_shard1_replica_n1 ] o.a.s.u.CommitTracker Hard AutoCommit: disabled
   [junit4]   2> 2660486 INFO  (qtp338223212-255626) [n:127.0.0.1:44423_solr c:MoveReplicaHDFSTest_failed_coll_false s:shard1 r:core_node3 x:MoveReplicaHDFSTest_failed_coll_false_shard1_replica_n1 ] o.a.s.u.CommitTracker Soft AutoCommit: disabled
   [junit4]   2> 2660487 INFO  (qtp223940391-255600) [n:127.0.0.1:42005_solr c:MoveReplicaHDFSTest_failed_coll_false s:shard2 r:core_node7 x:MoveReplicaHDFSTest_failed_coll_false_shard2_replica_n4 ] o.a.s.u.CommitTracker Hard AutoCommit: disabled
   [junit4]   2> 2660487 INFO  (qtp223940391-255600) [n:127.0.0.1:42005_solr c:MoveReplicaHDFSTest_failed_coll_false s:shard2 r:core_node7 x:MoveReplicaHDFSTest_failed_coll_false_shard2_replica_n4 ] o.a.s.u.CommitTracker Soft AutoCommit: disabled
   [junit4]   2> 2660489 INFO  (qtp1582686703-255623) [n:127.0.0.1:34003_solr c:MoveReplicaHDFSTest_failed_coll_false s:shard1 r:core_node5 x:MoveReplicaHDFSTest_failed_coll_false_shard1_replica_t2 ] o.a.s.s.SolrIndexSearcher Opening [Searcher@52876a76[MoveReplicaHDFSTest_failed_coll_false_shard1_replica_t2] main]
   [junit4]   2> 2660490 INFO  (qtp1582686703-255623) [n:127.0.0.1:34003_solr c:MoveReplicaHDFSTest_failed_coll_false s:shard1 r:core_node5 x:MoveReplicaHDFSTest_failed_coll_false_shard1_replica_t2 ] o.a.s.r.ManagedResourceStorage Configured ZooKeeperStorageIO with znodeBase: /configs/conf1
   [junit4]   2> 2660490 INFO  (qtp1582686703-255623) [n:127.0.0.1:34003_solr c:MoveReplicaHDFSTest_failed_coll_false s:shard1 r:core_node5 x:MoveReplicaHDFSTest_failed_coll_false_shard1_replica_t2 ] o.a.s.r.ManagedResourceStorage Loaded null at path _rest_managed.json using ZooKeeperStorageIO:path=/configs/conf1
   [junit4]   2> 2660490 INFO  (qtp1582686703-255623) [n:127.0.0.1:34003_solr c:MoveReplicaHDFSTest_failed_coll_false s:shard1 r:core_node5 x:MoveReplicaHDFSTest_failed_coll_false_shard1_replica_t2 ] o.a.s.h.ReplicationHandler Commits will be reserved for 10000ms.
   [junit4]   2> 2660490 INFO  (qtp1582686703-255623) [n:127.0.0.1:34003_solr c:MoveReplicaHDFSTest_failed_coll_false s:shard1 r:core_node5 x:MoveReplicaHDFSTest_failed_coll_false_shard1_replica_t2 ] o.a.s.u.UpdateLog Could not find max version in index or recent updates, using new clock 1648371653051154432
   [junit4]   2> 2660494 INFO  (searcherExecutor-10026-thread-1-proc

[...truncated too long message...]

estNormalMove-seed#[D299982DB3E11D17]) [     ] o.a.s.c.ZkTestServer parse host and port list: 127.0.0.1:37353
   [junit4]   2> 2725065 INFO  (TEST-MoveReplicaHDFSTest.testNormalMove-seed#[D299982DB3E11D17]) [     ] o.a.s.c.ZkTestServer connecting to 127.0.0.1 37353
   [junit4]   2> 2725068 WARN  (SUITE-MoveReplicaHDFSTest-seed#[D299982DB3E11D17]-worker) [     ] o.a.h.h.s.d.DirectoryScanner DirectoryScanner: shutdown has been called
   [junit4]   2> 2725118 INFO  (SUITE-MoveReplicaHDFSTest-seed#[D299982DB3E11D17]-worker) [     ] o.e.j.s.h.ContextHandler Stopped o.e.j.w.WebAppContext@49477789{datanode,/,null,UNAVAILABLE}{/datanode}
   [junit4]   2> 2725120 INFO  (SUITE-MoveReplicaHDFSTest-seed#[D299982DB3E11D17]-worker) [     ] o.e.j.s.AbstractConnector Stopped ServerConnector@610825c2{HTTP/1.1,[http/1.1]}{localhost:0}
   [junit4]   2> 2725120 INFO  (SUITE-MoveReplicaHDFSTest-seed#[D299982DB3E11D17]-worker) [     ] o.e.j.s.session node0 Stopped scavenging
   [junit4]   2> 2725120 INFO  (SUITE-MoveReplicaHDFSTest-seed#[D299982DB3E11D17]-worker) [     ] o.e.j.s.h.ContextHandler Stopped o.e.j.s.ServletContextHandler@13e22dfe{static,/static,jar:file:/home/jenkins/.ivy2/cache/org.apache.hadoop/hadoop-hdfs/tests/hadoop-hdfs-3.2.0-tests.jar!/webapps/static,UNAVAILABLE}
   [junit4]   2> 2725130 WARN  (BP-133296468-10.41.0.5-1572009705553 heartbeating to localhost.localdomain/127.0.0.1:42125) [     ] o.a.h.h.s.d.IncrementalBlockReportManager IncrementalBlockReportManager interrupted
   [junit4]   2> 2725130 WARN  (BP-133296468-10.41.0.5-1572009705553 heartbeating to localhost.localdomain/127.0.0.1:42125) [     ] o.a.h.h.s.d.DataNode Ending block pool service for: Block pool BP-133296468-10.41.0.5-1572009705553 (Datanode Uuid c4b702fb-6261-452b-b7d8-751dc184c0ac) service to localhost.localdomain/127.0.0.1:42125
   [junit4]   2> 2725159 WARN  (refreshUsed-/home/jenkins/jenkins-slave/workspace/Lucene-Solr-BadApples-NightlyTests-8.x/checkout/solr/build/solr-core/test/J2/temp/solr.cloud.MoveReplicaHDFSTest_D299982DB3E11D17-001/tempDir-001/hdfsBaseDir/data/data3/current/BP-133296468-10.41.0.5-1572009705553) [     ] o.a.h.f.CachingGetSpaceUsed Thread Interrupted waiting to refresh disk information: sleep interrupted
   [junit4]   2> 2725165 WARN  (refreshUsed-/home/jenkins/jenkins-slave/workspace/Lucene-Solr-BadApples-NightlyTests-8.x/checkout/solr/build/solr-core/test/J2/temp/solr.cloud.MoveReplicaHDFSTest_D299982DB3E11D17-001/tempDir-001/hdfsBaseDir/data/data4/current/BP-133296468-10.41.0.5-1572009705553) [     ] o.a.h.f.CachingGetSpaceUsed Thread Interrupted waiting to refresh disk information: sleep interrupted
   [junit4]   2> 2725169 WARN  (SUITE-MoveReplicaHDFSTest-seed#[D299982DB3E11D17]-worker) [     ] o.a.h.h.s.d.DirectoryScanner DirectoryScanner: shutdown has been called
   [junit4]   2> 2725358 INFO  (SUITE-MoveReplicaHDFSTest-seed#[D299982DB3E11D17]-worker) [     ] o.e.j.s.h.ContextHandler Stopped o.e.j.w.WebAppContext@363ab698{datanode,/,null,UNAVAILABLE}{/datanode}
   [junit4]   2> 2725359 INFO  (SUITE-MoveReplicaHDFSTest-seed#[D299982DB3E11D17]-worker) [     ] o.e.j.s.AbstractConnector Stopped ServerConnector@690972d0{HTTP/1.1,[http/1.1]}{localhost:0}
   [junit4]   2> 2725359 INFO  (SUITE-MoveReplicaHDFSTest-seed#[D299982DB3E11D17]-worker) [     ] o.e.j.s.session node0 Stopped scavenging
   [junit4]   2> 2725359 INFO  (SUITE-MoveReplicaHDFSTest-seed#[D299982DB3E11D17]-worker) [     ] o.e.j.s.h.ContextHandler Stopped o.e.j.s.ServletContextHandler@160165a5{static,/static,jar:file:/home/jenkins/.ivy2/cache/org.apache.hadoop/hadoop-hdfs/tests/hadoop-hdfs-3.2.0-tests.jar!/webapps/static,UNAVAILABLE}
   [junit4]   2> 2725585 WARN  (BP-133296468-10.41.0.5-1572009705553 heartbeating to localhost.localdomain/127.0.0.1:42125) [     ] o.a.h.h.s.d.IncrementalBlockReportManager IncrementalBlockReportManager interrupted
   [junit4]   2> 2725585 WARN  (BP-133296468-10.41.0.5-1572009705553 heartbeating to localhost.localdomain/127.0.0.1:42125) [     ] o.a.h.h.s.d.DataNode Ending block pool service for: Block pool BP-133296468-10.41.0.5-1572009705553 (Datanode Uuid a71c9bc0-8755-493c-93a7-c8fa7a5ba57b) service to localhost.localdomain/127.0.0.1:42125
   [junit4]   2> 2725597 WARN  (refreshUsed-/home/jenkins/jenkins-slave/workspace/Lucene-Solr-BadApples-NightlyTests-8.x/checkout/solr/build/solr-core/test/J2/temp/solr.cloud.MoveReplicaHDFSTest_D299982DB3E11D17-001/tempDir-001/hdfsBaseDir/data/data1/current/BP-133296468-10.41.0.5-1572009705553) [     ] o.a.h.f.CachingGetSpaceUsed Thread Interrupted waiting to refresh disk information: sleep interrupted
   [junit4]   2> 2725639 WARN  (refreshUsed-/home/jenkins/jenkins-slave/workspace/Lucene-Solr-BadApples-NightlyTests-8.x/checkout/solr/build/solr-core/test/J2/temp/solr.cloud.MoveReplicaHDFSTest_D299982DB3E11D17-001/tempDir-001/hdfsBaseDir/data/data2/current/BP-133296468-10.41.0.5-1572009705553) [     ] o.a.h.f.CachingGetSpaceUsed Thread Interrupted waiting to refresh disk information: sleep interrupted
   [junit4]   2> 2725861 INFO  (SUITE-MoveReplicaHDFSTest-seed#[D299982DB3E11D17]-worker) [     ] o.e.j.s.h.ContextHandler Stopped o.e.j.w.WebAppContext@35b91bc6{hdfs,/,null,UNAVAILABLE}{/hdfs}
   [junit4]   2> 2725867 INFO  (SUITE-MoveReplicaHDFSTest-seed#[D299982DB3E11D17]-worker) [     ] o.e.j.s.AbstractConnector Stopped ServerConnector@43c8c518{HTTP/1.1,[http/1.1]}{localhost.localdomain:0}
   [junit4]   2> 2725867 INFO  (SUITE-MoveReplicaHDFSTest-seed#[D299982DB3E11D17]-worker) [     ] o.e.j.s.session node0 Stopped scavenging
   [junit4]   2> 2725867 INFO  (SUITE-MoveReplicaHDFSTest-seed#[D299982DB3E11D17]-worker) [     ] o.e.j.s.h.ContextHandler Stopped o.e.j.s.ServletContextHandler@d2bd39{static,/static,jar:file:/home/jenkins/.ivy2/cache/org.apache.hadoop/hadoop-hdfs/tests/hadoop-hdfs-3.2.0-tests.jar!/webapps/static,UNAVAILABLE}
   [junit4]   2> NOTE: leaving temporary files on disk at: /home/jenkins/jenkins-slave/workspace/Lucene-Solr-BadApples-NightlyTests-8.x/checkout/solr/build/solr-core/test/J2/temp/solr.cloud.MoveReplicaHDFSTest_D299982DB3E11D17-001
   [junit4]   2> Oct 25, 2019 1:22:56 PM com.carrotsearch.randomizedtesting.ThreadLeakControl checkThreadLeaks
   [junit4]   2> WARNING: Will linger awaiting termination of 1 leaked thread(s).
   [junit4]   2> NOTE: test params are: codec=Asserting(Lucene80): {_root_=PostingsFormat(name=Direct), id=PostingsFormat(name=LuceneVarGapDocFreqInterval)}, docValues:{_version_=DocValuesFormat(name=Lucene80)}, maxPointsInLeafNode=1958, maxMBSortInHeap=7.29690887854834, sim=Asserting(org.apache.lucene.search.similarities.AssertingSimilarity@57bc9aed), locale=zh, timezone=America/Fort_Nelson
   [junit4]   2> NOTE: Linux 4.15.0-54-generic amd64/Oracle Corporation 1.8.0_191 (64-bit)/cpus=4,threads=4,free=83158232,total=498073600
   [junit4]   2> NOTE: All tests run in this JVM: [TestFieldCacheVsDocValues, MergeStrategyTest, TestAnalyzedSuggestions, TestPostingsSolrHighlighter, SolrRrdBackendFactoryTest, DeleteStatusTest, TestRebalanceLeaders, TestHashPartitioner, TestFreeTextSuggestions, ClusterStateTest, TestOrdValues, ComputePlanActionTest, TestPrepRecovery, HttpPartitionTest, BlobRepositoryCloudTest, CachingDirectoryFactoryTest, TestPayloadCheckQParserPlugin, TestSegmentSorting, TestMaxScoreQueryParser, TestConfigsApi, TestSimTriggerIntegration, SuggesterTest, ConjunctionSolrSpellCheckerTest, TestReload, TestCloudJSONFacetJoinDomain, SortSpecParsingTest, TestCloudManagedSchema, RestoreTriggerStateTest, TestSort, JvmMetricsTest, TestNamedUpdateProcessors, SystemInfoHandlerTest, SolrCoreCheckLockOnStartupTest, UninvertDocValuesMergePolicyTest, DistributedIntervalFacetingTest, ShardRoutingCustomTest, DeleteNodeTest, TestLRUStatsCache, IndexSchemaRuntimeFieldTest, RequestHandlersTest, TestStressVersions, LeaderFailureAfterFreshStartTest, LeaderElectionIntegrationTest, CollectionStateFormat2Test, DataDrivenBlockJoinTest, PreAnalyzedUpdateProcessorTest, TestSimDistributedQueue, TestIntervalFaceting, SystemLogListenerTest, DateRangeFieldTest, TestExportWriter, ScheduledTriggerTest, MetricsHandlerTest, MoreLikeThisHandlerTest, TestRawTransformer, TestJsonFacets, TestDocumentBuilder, TestSystemIdResolver, DistributedFacetExistsSmallTest, TolerantUpdateProcessorTest, DistributedFacetPivotSmallAdvancedTest, CopyFieldTest, TestJmxIntegration, DistributedMLTComponentTest, TestManagedSynonymFilterFactory, TestAtomicUpdateErrorCases, TestSolr4Spatial, TestMacros, SortByFunctionTest, UUIDFieldTest, TokenizerChainTest, TaggingAttributeTest, StatelessScriptUpdateProcessorFactoryTest, TestQueryingOnDownCollection, FullSolrCloudDistribCmdsTest, TestRuleBasedAuthorizationPlugin, TestCaffeineCache, RankQueryTest, CollectionTooManyReplicasTest, SubstringBytesRefFilterTest, TestImpersonationWithHadoopAuth, SearchHandlerTest, RoutingToNodesWithPropertiesTest, HdfsNNFailoverTest, DistributedTermsComponentTest, TestDynamicFieldResource, HighlighterConfigTest, ShardSplitTest, TestSimClusterStateProvider, TestSimpleTrackingShardHandler, TestWithCollection, TestConfigOverlay, NumberUtilsTest, TestReloadAndDeleteDocs, TestConfigReload, DimensionalRoutedAliasUpdateProcessorTest, TestUpdate, TestQueryTypes, AssignTest, AtomicUpdateProcessorFactoryTest, StressHdfsTest, ReplicaListTransformerTest, TestSerializedLuceneMatchVersion, JWTVerificationkeyResolverTest, TestLMDirichletSimilarityFactory, BJQParserTest, AddBlockUpdateTest, TestEmbeddedSolrServerConstructors, SliceStateTest, TestConfigSetsAPI, ZkNodePropsTest, WordBreakSolrSpellCheckerTest, TestDistributedGrouping, BasicDistributedZkTest, ScriptEngineTest, SolrXmlInZkTest, UniqFieldsUpdateProcessorFactoryTest, TestPHPSerializedResponseWriter, PrimitiveFieldTypeTest, SearchHandlerTest, LoggingHandlerTest, HdfsBasicDistributedZkTest, TimeZoneUtilsTest, UpdateParamsTest, MoveReplicaHDFSTest]
   [junit4] Completed [506/882 (1!)] on J2 in 71.82s, 4 tests, 1 failure, 1 skipped <<< FAILURES!

[...truncated 53951 lines...]

[JENKINS] Lucene-Solr-BadApples-NightlyTests-8.x - Build # 41 - Failure

Posted by Apache Jenkins Server <je...@builds.apache.org>.
Build: https://builds.apache.org/job/Lucene-Solr-BadApples-NightlyTests-8.x/41/

1 tests failed.
FAILED:  org.apache.lucene.document.TestXYMultiPolygonShapeQueries.testRandomBig

Error Message:
Java heap space

Stack Trace:
java.lang.OutOfMemoryError: Java heap space
	at __randomizedtesting.SeedInfo.seed([6DE89312B039C1C:8189F4BEBA5AE09C]:0)
	at org.apache.lucene.util.bkd.HeapPointWriter.<init>(HeapPointWriter.java:42)
	at org.apache.lucene.util.bkd.BKDRadixSelector.getDeltaPointWriter(BKDRadixSelector.java:490)
	at org.apache.lucene.util.bkd.BKDRadixSelector.buildHistogramAndPartition(BKDRadixSelector.java:256)
	at org.apache.lucene.util.bkd.BKDRadixSelector.select(BKDRadixSelector.java:126)
	at org.apache.lucene.util.bkd.BKDWriter.build(BKDWriter.java:1647)
	at org.apache.lucene.util.bkd.BKDWriter.build(BKDWriter.java:1664)
	at org.apache.lucene.util.bkd.BKDWriter.build(BKDWriter.java:1664)
	at org.apache.lucene.util.bkd.BKDWriter.build(BKDWriter.java:1664)
	at org.apache.lucene.util.bkd.BKDWriter.finish(BKDWriter.java:797)
	at org.apache.lucene.codecs.lucene60.Lucene60PointsWriter.writeField(Lucene60PointsWriter.java:129)
	at org.apache.lucene.codecs.PointsWriter.mergeOneField(PointsWriter.java:62)
	at org.apache.lucene.codecs.PointsWriter.merge(PointsWriter.java:191)
	at org.apache.lucene.codecs.lucene60.Lucene60PointsWriter.merge(Lucene60PointsWriter.java:143)
	at org.apache.lucene.codecs.asserting.AssertingPointsFormat$AssertingPointsWriter.merge(AssertingPointsFormat.java:149)
	at org.apache.lucene.index.SegmentMerger.mergePoints(SegmentMerger.java:202)
	at org.apache.lucene.index.SegmentMerger.merge(SegmentMerger.java:162)
	at org.apache.lucene.index.IndexWriter.mergeMiddle(IndexWriter.java:4463)
	at org.apache.lucene.index.IndexWriter.merge(IndexWriter.java:4057)
	at org.apache.lucene.index.SerialMergeScheduler.merge(SerialMergeScheduler.java:40)
	at org.apache.lucene.index.IndexWriter.maybeMerge(IndexWriter.java:2158)
	at org.apache.lucene.index.IndexWriter.forceMerge(IndexWriter.java:1991)
	at org.apache.lucene.index.IndexWriter.forceMerge(IndexWriter.java:1940)
	at org.apache.lucene.document.BaseShapeTestCase.indexRandomShapes(BaseShapeTestCase.java:242)
	at org.apache.lucene.document.BaseShapeTestCase.verify(BaseShapeTestCase.java:211)
	at org.apache.lucene.document.BaseShapeTestCase.doTestRandom(BaseShapeTestCase.java:137)
	at org.apache.lucene.document.TestXYMultiPolygonShapeQueries.testRandomBig(TestXYMultiPolygonShapeQueries.java:124)
	at sun.reflect.NativeMethodAccessorImpl.invoke0(Native Method)
	at sun.reflect.NativeMethodAccessorImpl.invoke(NativeMethodAccessorImpl.java:62)
	at sun.reflect.DelegatingMethodAccessorImpl.invoke(DelegatingMethodAccessorImpl.java:43)
	at java.lang.reflect.Method.invoke(Method.java:498)
	at com.carrotsearch.randomizedtesting.RandomizedRunner.invoke(RandomizedRunner.java:1750)
	at com.carrotsearch.randomizedtesting.RandomizedRunner$8.evaluate(RandomizedRunner.java:938)




Build Log:
[...truncated 11137 lines...]
   [junit4] Suite: org.apache.lucene.document.TestXYMultiPolygonShapeQueries
   [junit4]   2> NOTE: download the large Jenkins line-docs file by running 'ant get-jenkins-line-docs' in the lucene directory.
   [junit4]   2> NOTE: reproduce with: ant test  -Dtestcase=TestXYMultiPolygonShapeQueries -Dtests.method=testRandomBig -Dtests.seed=6DE89312B039C1C -Dtests.multiplier=2 -Dtests.nightly=true -Dtests.slow=true -Dtests.badapples=true -Dtests.linedocsfile=/home/jenkins/jenkins-slave/workspace/Lucene-Solr-BadApples-NightlyTests-8.x/test-data/enwiki.random.lines.txt -Dtests.locale=is-IS -Dtests.timezone=America/Indiana/Marengo -Dtests.asserts=true -Dtests.file.encoding=UTF-8
   [junit4] ERROR    174s J1 | TestXYMultiPolygonShapeQueries.testRandomBig <<<
   [junit4]    > Throwable #1: java.lang.OutOfMemoryError: Java heap space
   [junit4]    > 	at __randomizedtesting.SeedInfo.seed([6DE89312B039C1C:8189F4BEBA5AE09C]:0)
   [junit4]    > 	at org.apache.lucene.util.bkd.HeapPointWriter.<init>(HeapPointWriter.java:42)
   [junit4]    > 	at org.apache.lucene.util.bkd.BKDRadixSelector.getDeltaPointWriter(BKDRadixSelector.java:490)
   [junit4]    > 	at org.apache.lucene.util.bkd.BKDRadixSelector.buildHistogramAndPartition(BKDRadixSelector.java:256)
   [junit4]    > 	at org.apache.lucene.util.bkd.BKDRadixSelector.select(BKDRadixSelector.java:126)
   [junit4]    > 	at org.apache.lucene.util.bkd.BKDWriter.build(BKDWriter.java:1647)
   [junit4]    > 	at org.apache.lucene.util.bkd.BKDWriter.build(BKDWriter.java:1664)
   [junit4]    > 	at org.apache.lucene.util.bkd.BKDWriter.build(BKDWriter.java:1664)
   [junit4]    > 	at org.apache.lucene.util.bkd.BKDWriter.build(BKDWriter.java:1664)
   [junit4]    > 	at org.apache.lucene.util.bkd.BKDWriter.finish(BKDWriter.java:797)
   [junit4]    > 	at org.apache.lucene.codecs.lucene60.Lucene60PointsWriter.writeField(Lucene60PointsWriter.java:129)
   [junit4]    > 	at org.apache.lucene.codecs.PointsWriter.mergeOneField(PointsWriter.java:62)
   [junit4]    > 	at org.apache.lucene.codecs.PointsWriter.merge(PointsWriter.java:191)
   [junit4]    > 	at org.apache.lucene.codecs.lucene60.Lucene60PointsWriter.merge(Lucene60PointsWriter.java:143)
   [junit4]    > 	at org.apache.lucene.codecs.asserting.AssertingPointsFormat$AssertingPointsWriter.merge(AssertingPointsFormat.java:149)
   [junit4]    > 	at org.apache.lucene.index.SegmentMerger.mergePoints(SegmentMerger.java:202)
   [junit4]    > 	at org.apache.lucene.index.SegmentMerger.merge(SegmentMerger.java:162)
   [junit4]    > 	at org.apache.lucene.index.IndexWriter.mergeMiddle(IndexWriter.java:4463)
   [junit4]    > 	at org.apache.lucene.index.IndexWriter.merge(IndexWriter.java:4057)
   [junit4]    > 	at org.apache.lucene.index.SerialMergeScheduler.merge(SerialMergeScheduler.java:40)
   [junit4]    > 	at org.apache.lucene.index.IndexWriter.maybeMerge(IndexWriter.java:2158)
   [junit4]    > 	at org.apache.lucene.index.IndexWriter.forceMerge(IndexWriter.java:1991)
   [junit4]    > 	at org.apache.lucene.index.IndexWriter.forceMerge(IndexWriter.java:1940)
   [junit4]    > 	at org.apache.lucene.document.BaseShapeTestCase.indexRandomShapes(BaseShapeTestCase.java:242)
   [junit4]    > 	at org.apache.lucene.document.BaseShapeTestCase.verify(BaseShapeTestCase.java:211)
   [junit4]    > 	at org.apache.lucene.document.BaseShapeTestCase.doTestRandom(BaseShapeTestCase.java:137)
   [junit4]    > 	at org.apache.lucene.document.TestXYMultiPolygonShapeQueries.testRandomBig(TestXYMultiPolygonShapeQueries.java:124)
   [junit4]   2> NOTE: leaving temporary files on disk at: /home/jenkins/jenkins-slave/workspace/Lucene-Solr-BadApples-NightlyTests-8.x/checkout/lucene/build/sandbox/test/J1/temp/lucene.document.TestXYMultiPolygonShapeQueries_6DE89312B039C1C-001
   [junit4]   2> NOTE: test params are: codec=Asserting(Lucene80), sim=Asserting(org.apache.lucene.search.similarities.AssertingSimilarity@5e083404), locale=is-IS, timezone=America/Indiana/Marengo
   [junit4]   2> NOTE: Linux 4.15.0-54-generic amd64/Oracle Corporation 1.8.0_191 (64-bit)/cpus=4,threads=1,free=337067136,total=520093696
   [junit4]   2> NOTE: All tests run in this JVM: [TestLatLonPolygonShapeQueries, TestXYLineShapeQueries, TestFieldCacheTermsFilter, TestLatLonMultiPointShapeQueries, TestXYShape, TestHalfFloatPoint, TestXYMultiPolygonShapeQueries]
   [junit4] Completed [38/38 (1!)] on J1 in 368.39s, 5 tests, 1 error <<< FAILURES!

[...truncated 1 lines...]
   [junit4] JVM J1: stdout was not empty, see: /home/jenkins/jenkins-slave/workspace/Lucene-Solr-BadApples-NightlyTests-8.x/checkout/lucene/build/sandbox/test/temp/junit4-J1-20191101_181128_0927690746793762606719.sysout
   [junit4] >>> JVM J1 emitted unexpected output (verbatim) ----
   [junit4] java.lang.OutOfMemoryError: Java heap space
   [junit4] Dumping heap to /home/jenkins/jenkins-slave/workspace/Lucene-Solr-BadApples-NightlyTests-8.x/checkout/heapdumps/java_pid24818.hprof ...
   [junit4] Heap dump file created [460704285 bytes in 0.541 secs]
   [junit4] <<< JVM J1: EOF ----

[...truncated 15030 lines...]
BUILD FAILED
/home/jenkins/jenkins-slave/workspace/Lucene-Solr-BadApples-NightlyTests-8.x/checkout/build.xml:662: The following error occurred while executing this line:
/home/jenkins/jenkins-slave/workspace/Lucene-Solr-BadApples-NightlyTests-8.x/checkout/build.xml:586: Some of the tests produced a heap dump, but did not fail. Maybe a suppressed OutOfMemoryError? Dumps created:
* java_pid24818.hprof

Total time: 274 minutes 17 seconds
Build step 'Invoke Ant' marked build as failure
Archiving artifacts
Recording test results
Email was triggered for: Failure - Any
Sending email for trigger: Failure - Any