You are viewing a plain text version of this content. The canonical link for it is here.
Posted to builds@beam.apache.org by Apache Jenkins Server <je...@builds.apache.org> on 2023/10/27 17:44:18 UTC
Build failed in Jenkins: beam_PostCommit_XVR_Samza #3269
See <https://ci-beam.apache.org/job/beam_PostCommit_XVR_Samza/3269/display/redirect>
Changes:
------------------------------------------
[...truncated 193.12 KB...]
> Run with --stacktrace option to get the stack trace.
> Run with --info or --debug option to get more log output.
> Run with --scan to get full insights.
> Get more help at https://help.gradle.org.
==============================================================================
25: Task failed with an exception.
-----------
* What went wrong:
Execution failed for task ':sdks:java:extensions:sql:copyFmppTemplatesFromCalciteCore'.
> java.io.IOException: No space left on device
* Try:
> Run with --stacktrace option to get the stack trace.
> Run with --info or --debug option to get more log output.
> Run with --scan to get full insights.
> Get more help at https://help.gradle.org.
==============================================================================
26: Task failed with an exception.
-----------
* What went wrong:
Execution failed for task ':sdks:java:extensions:schemaio-expansion-service:test'.
> Could not resolve all dependencies for configuration ':sdks:java:extensions:schemaio-expansion-service:testRuntimeClasspath'.
> Problems writing to Binary store in /home/jenkins/.gradle/.tmp/gradle1531352433783853922.bin (exist: true)
* Try:
> Run with --stacktrace option to get the stack trace.
> Run with --info or --debug option to get more log output.
> Run with --scan to get full insights.
> Get more help at https://help.gradle.org.
==============================================================================
27: Task failed with an exception.
-----------
* What went wrong:
Execution failed for task ':sdks:java:extensions:sql:copyFmppTemplatesFromSrc'.
> Failed to create parent directory '<https://ci-beam.apache.org/job/beam_PostCommit_XVR_Samza/ws/src/sdks/java/extensions/sql/build/templates-fmpp'> when creating directory '<https://ci-beam.apache.org/job/beam_PostCommit_XVR_Samza/ws/src/sdks/java/extensions/sql/build/templates-fmpp/codegen'>
* Try:
> Run with --stacktrace option to get the stack trace.
> Run with --info or --debug option to get more log output.
> Run with --scan to get full insights.
> Get more help at https://help.gradle.org.
==============================================================================
28: Task failed with an exception.
-----------
* What went wrong:
Execution failed for task ':sdks:java:io:mongodb:createCheckerFrameworkManifest'.
> Failed to create parent directory '<https://ci-beam.apache.org/job/beam_PostCommit_XVR_Samza/ws/src/sdks/java/io/mongodb/build'> when creating directory '<https://ci-beam.apache.org/job/beam_PostCommit_XVR_Samza/ws/src/sdks/java/io/mongodb/build/checkerframework/META-INF/gradle'>
* Try:
> Run with --stacktrace option to get the stack trace.
> Run with --info or --debug option to get more log output.
> Run with --scan to get full insights.
> Get more help at https://help.gradle.org.
==============================================================================
29: Task failed with an exception.
-----------
* What went wrong:
Execution failed for task ':sdks:java:extensions:sql:createCheckerFrameworkManifest'.
> Failed to create parent directory '<https://ci-beam.apache.org/job/beam_PostCommit_XVR_Samza/ws/src/sdks/java/extensions/sql/build/checkerframework'> when creating directory '<https://ci-beam.apache.org/job/beam_PostCommit_XVR_Samza/ws/src/sdks/java/extensions/sql/build/checkerframework/META-INF/gradle'>
* Try:
> Run with --stacktrace option to get the stack trace.
> Run with --info or --debug option to get more log output.
> Run with --scan to get full insights.
> Get more help at https://help.gradle.org.
==============================================================================
30: Task failed with an exception.
-----------
* What went wrong:
Execution failed for task ':sdks:java:extensions:sql:udf:createCheckerFrameworkManifest'.
> Failed to create parent directory '<https://ci-beam.apache.org/job/beam_PostCommit_XVR_Samza/ws/src/sdks/java/extensions/sql/udf/build'> when creating directory '<https://ci-beam.apache.org/job/beam_PostCommit_XVR_Samza/ws/src/sdks/java/extensions/sql/udf/build/checkerframework/META-INF/gradle'>
* Try:
> Run with --stacktrace option to get the stack trace.
> Run with --info or --debug option to get more log output.
> Run with --scan to get full insights.
> Get more help at https://help.gradle.org.
==============================================================================
31: Task failed with an exception.
-----------
* What went wrong:
Execution failed for task ':sdks:java:extensions:sql:processResources'.
> Failed to create parent directory '<https://ci-beam.apache.org/job/beam_PostCommit_XVR_Samza/ws/src/sdks/java/extensions/sql/build/resources'> when creating directory '<https://ci-beam.apache.org/job/beam_PostCommit_XVR_Samza/ws/src/sdks/java/extensions/sql/build/resources/main'>
* Try:
> Run with --stacktrace option to get the stack trace.
> Run with --info or --debug option to get more log output.
> Run with --scan to get full insights.
> Get more help at https://help.gradle.org.
==============================================================================
32: Task failed with an exception.
-----------
* What went wrong:
Execution failed for task ':sdks:java:extensions:sql:expansion-service:createCheckerFrameworkManifest'.
> Failed to create parent directory '<https://ci-beam.apache.org/job/beam_PostCommit_XVR_Samza/ws/src/sdks/java/extensions/sql/expansion-service/build'> when creating directory '<https://ci-beam.apache.org/job/beam_PostCommit_XVR_Samza/ws/src/sdks/java/extensions/sql/expansion-service/build/checkerframework/META-INF/gradle'>
* Try:
> Run with --stacktrace option to get the stack trace.
> Run with --info or --debug option to get more log output.
> Run with --scan to get full insights.
> Get more help at https://help.gradle.org.
==============================================================================
33: Task failed with an exception.
-----------
* What went wrong:
Execution failed for task ':sdks:java:extensions:sql:zetasql:createCheckerFrameworkManifest'.
> Failed to create parent directory '<https://ci-beam.apache.org/job/beam_PostCommit_XVR_Samza/ws/src/sdks/java/extensions/sql/zetasql/build'> when creating directory '<https://ci-beam.apache.org/job/beam_PostCommit_XVR_Samza/ws/src/sdks/java/extensions/sql/zetasql/build/checkerframework/META-INF/gradle'>
* Try:
> Run with --stacktrace option to get the stack trace.
> Run with --info or --debug option to get more log output.
> Run with --scan to get full insights.
> Get more help at https://help.gradle.org.
==============================================================================
34: Task failed with an exception.
-----------
* What went wrong:
Execution failed for task ':sdks:java:io:expansion-service:shadowJar'.
> Failed to store cache entry f949d9a7ce393d81dc946eb76d26b3ce for task ':sdks:java:io:expansion-service:shadowJar': No space left on device
* Try:
> Run with --stacktrace option to get the stack trace.
> Run with --info or --debug option to get more log output.
> Run with --scan to get full insights.
> Get more help at https://help.gradle.org.
==============================================================================
35: Task failed with an exception.
-----------
* What went wrong:
Execution failed for task ':sdks:java:testing:kafka-service:buildTestKafkaServiceJar'.
> Failed to store cache entry 827779b2d868a6b636a97053be483f22 for task ':sdks:java:testing:kafka-service:buildTestKafkaServiceJar': No space left on device
* Try:
> Run with --stacktrace option to get the stack trace.
> Run with --info or --debug option to get more log output.
> Run with --scan to get full insights.
> Get more help at https://help.gradle.org.
==============================================================================
36: Task failed with an exception.
-----------
* What went wrong:
Execution failed for task ':sdks:java:io:expansion-service:analyzeClassesDependencies'.
> Could not resolve all dependencies for configuration ':sdks:java:io:expansion-service:permitUnusedDeclared'.
> Problems writing to Binary store in /home/jenkins/.gradle/.tmp/gradle5147193327529031760.bin (exist: true)
* Try:
> Run with --stacktrace option to get the stack trace.
> Run with --info or --debug option to get more log output.
> Run with --scan to get full insights.
> Get more help at https://help.gradle.org.
==============================================================================
37: Task failed with an exception.
-----------
* What went wrong:
Execution failed for task ':sdks:java:io:expansion-service:spotlessJava'.
> Failed to create parent directory '<https://ci-beam.apache.org/job/beam_PostCommit_XVR_Samza/ws/src/sdks/java/io/expansion-service/build/spotless'> when creating directory '<https://ci-beam.apache.org/job/beam_PostCommit_XVR_Samza/ws/src/sdks/java/io/expansion-service/build/spotless/spotlessJava'>
* Try:
> Run with --stacktrace option to get the stack trace.
> Run with --info or --debug option to get more log output.
> Run with --scan to get full insights.
> Get more help at https://help.gradle.org.
==============================================================================
38: Task failed with an exception.
-----------
* What went wrong:
Execution failed for task ':release:go-licenses:java:dockerRun'.
> Process 'command 'docker'' finished with non-zero exit value 1
* Try:
> Run with --stacktrace option to get the stack trace.
> Run with --info or --debug option to get more log output.
> Run with --scan to get full insights.
> Get more help at https://help.gradle.org.
==============================================================================
39: Task failed with an exception.
-----------
* What went wrong:
Execution failed for task ':release:go-licenses:py:dockerRun'.
> Process 'command 'docker'' finished with non-zero exit value 1
* Try:
> Run with --stacktrace option to get the stack trace.
> Run with --info or --debug option to get more log output.
> Run with --scan to get full insights.
> Get more help at https://help.gradle.org.
==============================================================================
40: Task failed with an exception.
-----------
* What went wrong:
Execution failed for task ':release:go-licenses:go:dockerRun'.
> Process 'command 'docker'' finished with non-zero exit value 1
* Try:
> Run with --stacktrace option to get the stack trace.
> Run with --info or --debug option to get more log output.
> Run with --scan to get full insights.
> Get more help at https://help.gradle.org.
==============================================================================
41: Task failed with an exception.
-----------
* What went wrong:
Could not add entry ':sdks:python:sdist' to cache executionHistory.bin (<https://ci-beam.apache.org/job/beam_PostCommit_XVR_Samza/ws/src/.gradle/8.4/executionHistory/executionHistory.bin).>
> java.io.IOException: No space left on device
* Try:
> Run with --stacktrace option to get the stack trace.
> Run with --info or --debug option to get more log output.
> Run with --scan to get full insights.
> Get more help at https://help.gradle.org.
==============================================================================
Deprecated Gradle features were used in this build, making it incompatible with Gradle 9.0.
You can use '--warning-mode all' to show the individual deprecation warnings and determine if they come from your own scripts or plugins.
For more on this, please refer to https://docs.gradle.org/8.4/userguide/command_line_interface.html#sec:command_line_warnings in the Gradle documentation.
BUILD FAILED in 1m 50s
FAILURE: Build failed with an exception.
* What went wrong:
Could not receive a message from the daemon.
* Try:
> Run with --stacktrace option to get the stack trace.
> Run with --info or --debug option to get more log output.
> Run with --scan to get full insights.
> Get more help at https://help.gradle.org.
Build step 'Invoke Gradle script' changed build result to FAILURE
Build step 'Invoke Gradle script' marked build as failure
---------------------------------------------------------------------
To unsubscribe, e-mail: builds-unsubscribe@beam.apache.org
For additional commands, e-mail: builds-help@beam.apache.org
Jenkins build is back to normal : beam_PostCommit_XVR_Samza #3270
Posted by Apache Jenkins Server <je...@builds.apache.org>.
See <https://ci-beam.apache.org/job/beam_PostCommit_XVR_Samza/3270/display/redirect>
---------------------------------------------------------------------
To unsubscribe, e-mail: builds-unsubscribe@beam.apache.org
For additional commands, e-mail: builds-help@beam.apache.org