You are viewing a plain text version of this content. The canonical link for it is here.
Posted to notifications@directory.apache.org by Apache Jenkins Server <je...@builds.apache.org> on 2014/12/19 05:02:51 UTC
Build failed in Jenkins: dir-apacheds-ubuntu-deploy #1545
See <https://builds.apache.org/job/dir-apacheds-ubuntu-deploy/1545/changes>
Changes:
[elecharny] Updated the places where controls are declared
[elecharny] One more fix for DIRAPI-212
[elecharny] One more fix for DIRAPI-212
[elecharny] Reflecting the change done on DIRAPI-212
[elecharny] Fixed the wrong name 'reponse' as it has beenfixed in LDAP API
------------------------------------------
[...truncated 290 lines...]
[INFO] --- maven-deploy-plugin:2.8.1:deploy (default-deploy) @ apacheds-core-constants ---
Downloading: https://repository.apache.org/content/repositories/snapshots/org/apache/directory/server/apacheds-core-constants/2.0.0-M20-SNAPSHOT/maven-metadata.xml
Downloaded: https://repository.apache.org/content/repositories/snapshots/org/apache/directory/server/apacheds-core-constants/2.0.0-M20-SNAPSHOT/maven-metadata.xml (815 B at 2.6 KB/sec)
Uploading: https://repository.apache.org/content/repositories/snapshots/org/apache/directory/server/apacheds-core-constants/2.0.0-M20-SNAPSHOT/apacheds-core-constants-2.0.0-M20-20141219.040217-29.jar
Uploaded: https://repository.apache.org/content/repositories/snapshots/org/apache/directory/server/apacheds-core-constants/2.0.0-M20-SNAPSHOT/apacheds-core-constants-2.0.0-M20-20141219.040217-29.jar (10 KB at 31.0 KB/sec)
Uploading: https://repository.apache.org/content/repositories/snapshots/org/apache/directory/server/apacheds-core-constants/2.0.0-M20-SNAPSHOT/apacheds-core-constants-2.0.0-M20-20141219.040217-29.pom
Uploaded: https://repository.apache.org/content/repositories/snapshots/org/apache/directory/server/apacheds-core-constants/2.0.0-M20-SNAPSHOT/apacheds-core-constants-2.0.0-M20-20141219.040217-29.pom (3 KB at 6.9 KB/sec)
Downloading: https://repository.apache.org/content/repositories/snapshots/org/apache/directory/server/apacheds-core-constants/maven-metadata.xml
Downloaded: https://repository.apache.org/content/repositories/snapshots/org/apache/directory/server/apacheds-core-constants/maven-metadata.xml (462 B at 2.3 KB/sec)
Uploading: https://repository.apache.org/content/repositories/snapshots/org/apache/directory/server/apacheds-core-constants/2.0.0-M20-SNAPSHOT/maven-metadata.xml
Uploaded: https://repository.apache.org/content/repositories/snapshots/org/apache/directory/server/apacheds-core-constants/2.0.0-M20-SNAPSHOT/maven-metadata.xml (815 B at 2.5 KB/sec)
Uploading: https://repository.apache.org/content/repositories/snapshots/org/apache/directory/server/apacheds-core-constants/maven-metadata.xml
Uploaded: https://repository.apache.org/content/repositories/snapshots/org/apache/directory/server/apacheds-core-constants/maven-metadata.xml (462 B at 1.2 KB/sec)
[INFO]
[INFO] --- maven-bundle-plugin:2.5.0:deploy (default-deploy) @ apacheds-core-constants ---
[INFO] Remote OBR update disabled (enable with -DremoteOBR)
[JENKINS] Archiving disabled
[INFO]
[INFO] ------------------------------------------------------------------------
[INFO] Building ApacheDS Core API 2.0.0-M20-SNAPSHOT
[INFO] ------------------------------------------------------------------------
Downloading: http://repository.apache.org/snapshots/org/apache/directory/api/api-i18n/1.0.0-M27-SNAPSHOT/maven-metadata.xml
Downloaded: http://repository.apache.org/snapshots/org/apache/directory/api/api-i18n/1.0.0-M27-SNAPSHOT/maven-metadata.xml (1016 B at 1.9 KB/sec)
Downloading: http://repository.apache.org/snapshots/org/apache/directory/api/api-parent/1.0.0-M27-SNAPSHOT/maven-metadata.xml
Downloaded: http://repository.apache.org/snapshots/org/apache/directory/api/api-parent/1.0.0-M27-SNAPSHOT/maven-metadata.xml (837 B at 2.0 KB/sec)
Downloading: http://repository.apache.org/snapshots/org/apache/directory/api/api-asn1-api/1.0.0-M27-SNAPSHOT/maven-metadata.xml
Downloaded: http://repository.apache.org/snapshots/org/apache/directory/api/api-asn1-api/1.0.0-M27-SNAPSHOT/maven-metadata.xml (1020 B at 3.6 KB/sec)
Downloading: http://repository.apache.org/snapshots/org/apache/directory/api/api-asn1-parent/1.0.0-M27-SNAPSHOT/maven-metadata.xml
Downloaded: http://repository.apache.org/snapshots/org/apache/directory/api/api-asn1-parent/1.0.0-M27-SNAPSHOT/maven-metadata.xml (842 B at 3.1 KB/sec)
Downloading: http://repository.apache.org/snapshots/org/apache/directory/api/api-ldap-client-api/1.0.0-M27-SNAPSHOT/maven-metadata.xml
Downloaded: http://repository.apache.org/snapshots/org/apache/directory/api/api-ldap-client-api/1.0.0-M27-SNAPSHOT/maven-metadata.xml (2 KB at 2.0 KB/sec)
Downloading: http://repository.apache.org/snapshots/org/apache/directory/api/api-ldap-client-parent/1.0.0-M27-SNAPSHOT/maven-metadata.xml
Downloaded: http://repository.apache.org/snapshots/org/apache/directory/api/api-ldap-client-parent/1.0.0-M27-SNAPSHOT/maven-metadata.xml (849 B at 1.3 KB/sec)
Downloading: http://repository.apache.org/snapshots/org/apache/directory/api/api-ldap-parent/1.0.0-M27-SNAPSHOT/maven-metadata.xml
Downloaded: http://repository.apache.org/snapshots/org/apache/directory/api/api-ldap-parent/1.0.0-M27-SNAPSHOT/maven-metadata.xml (842 B at 3.5 KB/sec)
Downloading: http://repository.apache.org/snapshots/org/apache/directory/api/api-ldap-schema-data/1.0.0-M27-SNAPSHOT/maven-metadata.xml
Downloaded: http://repository.apache.org/snapshots/org/apache/directory/api/api-ldap-schema-data/1.0.0-M27-SNAPSHOT/maven-metadata.xml (2 KB at 3.4 KB/sec)
Downloading: http://repository.apache.org/snapshots/org/apache/directory/api/api-ldap-schema-parent/1.0.0-M27-SNAPSHOT/maven-metadata.xml
Downloaded: http://repository.apache.org/snapshots/org/apache/directory/api/api-ldap-schema-parent/1.0.0-M27-SNAPSHOT/maven-metadata.xml (633 B at 1.9 KB/sec)
Downloading: http://repository.apache.org/snapshots/org/apache/directory/api/api-ldap-model/1.0.0-M27-SNAPSHOT/maven-metadata.xml
Downloaded: http://repository.apache.org/snapshots/org/apache/directory/api/api-ldap-model/1.0.0-M27-SNAPSHOT/maven-metadata.xml (1022 B at 3.0 KB/sec)
Downloading: http://repository.apache.org/snapshots/org/apache/directory/api/api-util/1.0.0-M27-SNAPSHOT/maven-metadata.xml
Downloaded: http://repository.apache.org/snapshots/org/apache/directory/api/api-util/1.0.0-M27-SNAPSHOT/maven-metadata.xml (1016 B at 3.8 KB/sec)
Downloading: http://repository.apache.org/snapshots/org/apache/directory/api/api-asn1-ber/1.0.0-M27-SNAPSHOT/maven-metadata.xml
Downloaded: http://repository.apache.org/snapshots/org/apache/directory/api/api-asn1-ber/1.0.0-M27-SNAPSHOT/maven-metadata.xml (1020 B at 3.1 KB/sec)
Downloading: http://repository.apache.org/snapshots/org/apache/directory/api/api-ldap-codec-core/1.0.0-M27-SNAPSHOT/maven-metadata.xml
Downloaded: http://repository.apache.org/snapshots/org/apache/directory/api/api-ldap-codec-core/1.0.0-M27-SNAPSHOT/maven-metadata.xml (2 KB at 3.7 KB/sec)
Downloading: http://repository.apache.org/snapshots/org/apache/directory/api/api-ldap-codec-parent/1.0.0-M27-SNAPSHOT/maven-metadata.xml
Downloaded: http://repository.apache.org/snapshots/org/apache/directory/api/api-ldap-codec-parent/1.0.0-M27-SNAPSHOT/maven-metadata.xml (848 B at 5.0 KB/sec)
Downloading: http://repository.apache.org/snapshots/org/apache/directory/api/api-ldap-extras-codec/1.0.0-M27-SNAPSHOT/maven-metadata.xml
Downloaded: http://repository.apache.org/snapshots/org/apache/directory/api/api-ldap-extras-codec/1.0.0-M27-SNAPSHOT/maven-metadata.xml (2 KB at 4.9 KB/sec)
Downloading: http://repository.apache.org/snapshots/org/apache/directory/api/api-ldap-extras-parent/1.0.0-M27-SNAPSHOT/maven-metadata.xml
Downloaded: http://repository.apache.org/snapshots/org/apache/directory/api/api-ldap-extras-parent/1.0.0-M27-SNAPSHOT/maven-metadata.xml (849 B at 1.5 KB/sec)
Downloading: http://repository.apache.org/snapshots/org/apache/directory/api/api-ldap-extras-codec-api/1.0.0-M27-SNAPSHOT/maven-metadata.xml
Downloaded: http://repository.apache.org/snapshots/org/apache/directory/api/api-ldap-extras-codec-api/1.0.0-M27-SNAPSHOT/maven-metadata.xml (2 KB at 4.2 KB/sec)
Downloading: http://repository.apache.org/snapshots/org/apache/directory/api/api-ldap-extras-aci/1.0.0-M27-SNAPSHOT/maven-metadata.xml
Downloaded: http://repository.apache.org/snapshots/org/apache/directory/api/api-ldap-extras-aci/1.0.0-M27-SNAPSHOT/maven-metadata.xml (2 KB at 5.5 KB/sec)
Downloading: http://repository.apache.org/snapshots/org/apache/directory/api/api-ldap-extras-util/1.0.0-M27-SNAPSHOT/maven-metadata.xml
Downloaded: http://repository.apache.org/snapshots/org/apache/directory/api/api-ldap-extras-util/1.0.0-M27-SNAPSHOT/maven-metadata.xml (2 KB at 5.9 KB/sec)
[INFO]
[INFO] --- maven-clean-plugin:2.4.1:clean (default-clean) @ apacheds-core-api ---
[INFO] Deleting <https://builds.apache.org/job/dir-apacheds-ubuntu-deploy/ws/trunk/core-api/target>
[INFO]
[INFO] --- maven-remote-resources-plugin:1.2.1:process (default) @ apacheds-core-api ---
[INFO]
[INFO] --- maven-resources-plugin:2.6:resources (default-resources) @ apacheds-core-api ---
[INFO] Using 'UTF-8' encoding to copy filtered resources.
[INFO] Copying 1 resource
[INFO] Copying 3 resources
[INFO]
[INFO] --- maven-compiler-plugin:3.1:compile (default-compile) @ apacheds-core-api ---
[INFO] Changes detected - recompiling the module!
[INFO] Compiling 130 source files to <https://builds.apache.org/job/dir-apacheds-ubuntu-deploy/ws/trunk/core-api/target/classes>
[INFO] -------------------------------------------------------------
[WARNING] COMPILATION WARNING :
[INFO] -------------------------------------------------------------
[WARNING] <https://builds.apache.org/job/dir-apacheds-ubuntu-deploy/ws/trunk/core-api/src/main/java/org/apache/directory/server/core/api/schema/registries/synchronizers/AbstractRegistrySynchronizer.java>: Some input files use unchecked or unsafe operations.
[WARNING] <https://builds.apache.org/job/dir-apacheds-ubuntu-deploy/ws/trunk/core-api/src/main/java/org/apache/directory/server/core/api/schema/registries/synchronizers/AbstractRegistrySynchronizer.java>: Recompile with -Xlint:unchecked for details.
[INFO] 2 warnings
[INFO] -------------------------------------------------------------
[INFO] -------------------------------------------------------------
[ERROR] COMPILATION ERROR :
[INFO] -------------------------------------------------------------
[ERROR] <https://builds.apache.org/job/dir-apacheds-ubuntu-deploy/ws/trunk/core-api/src/main/java/org/apache/directory/server/core/api/schema/registries/synchronizers/SchemaSynchronizer.java>:[45,51] package org.apache.directory.api.ldap.schema.loader does not exist
[ERROR] <https://builds.apache.org/job/dir-apacheds-ubuntu-deploy/ws/trunk/core-api/src/main/java/org/apache/directory/server/core/api/schema/registries/synchronizers/SchemaSynchronizer.java>:[68,19] cannot find symbol
symbol: class SchemaEntityFactory
location: class org.apache.directory.server.core.api.schema.registries.synchronizers.SchemaSynchronizer
[ERROR] <https://builds.apache.org/job/dir-apacheds-ubuntu-deploy/ws/trunk/core-api/src/main/java/org/apache/directory/server/core/api/schema/registries/synchronizers/AbstractRegistrySynchronizer.java>:[47,51] package org.apache.directory.api.ldap.schema.loader does not exist
[ERROR] <https://builds.apache.org/job/dir-apacheds-ubuntu-deploy/ws/trunk/core-api/src/main/java/org/apache/directory/server/core/api/schema/registries/synchronizers/AbstractRegistrySynchronizer.java>:[71,21] cannot find symbol
symbol: class SchemaEntityFactory
location: class org.apache.directory.server.core.api.schema.registries.synchronizers.AbstractRegistrySynchronizer
[ERROR] <https://builds.apache.org/job/dir-apacheds-ubuntu-deploy/ws/trunk/core-api/src/main/java/org/apache/directory/server/core/api/schema/registries/synchronizers/SchemaSynchronizer.java>:[99,23] cannot find symbol
symbol: class SchemaEntityFactory
location: class org.apache.directory.server.core.api.schema.registries.synchronizers.SchemaSynchronizer
[ERROR] <https://builds.apache.org/job/dir-apacheds-ubuntu-deploy/ws/trunk/core-api/src/main/java/org/apache/directory/server/core/api/schema/registries/synchronizers/AbstractRegistrySynchronizer.java>:[100,23] cannot find symbol
symbol: class SchemaEntityFactory
location: class org.apache.directory.server.core.api.schema.registries.synchronizers.AbstractRegistrySynchronizer
[INFO] 6 errors
[INFO] -------------------------------------------------------------
[JENKINS] Archiving disabled
[INFO] ------------------------------------------------------------------------
[INFO] Reactor Summary:
[INFO]
[INFO] ApacheDS .......................................... SUCCESS [6.619s]
[INFO] ApacheDS I18n ..................................... SUCCESS [8.187s]
[INFO] ApacheDS Core Constants ........................... SUCCESS [5.098s]
[INFO] ApacheDS Core API ................................. FAILURE [10.557s]
[INFO] ApacheDS Core Shared .............................. SKIPPED
[INFO] ApacheDS Interceptors ............................. SKIPPED
[INFO] ApacheDS AdministrativePoint Interceptor .......... SKIPPED
[INFO] ApacheDS Authentication Interceptor ............... SKIPPED
[INFO] ApacheDS Interceptor to increment numeric attributes SKIPPED
[INFO] ApacheDS Authorization Interceptor ................ SKIPPED
[INFO] ApacheDS ChangeLog Interceptor .................... SKIPPED
[INFO] ApacheDS Collective Attribute Interceptor ......... SKIPPED
[INFO] ApacheDS Event Interceptor ........................ SKIPPED
[INFO] ApacheDS Exception Interceptor .................... SKIPPED
[INFO] ApacheDS Journal Interceptor ...................... SKIPPED
[INFO] ApacheDS Normalization Interceptor ................ SKIPPED
[INFO] ApacheDS Operational Attribute Interceptor ........ SKIPPED
[INFO] ApacheDS Referral Interceptor ..................... SKIPPED
[INFO] ApacheDS Schema Interceptor ....................... SKIPPED
[INFO] ApacheDS Subtree Interceptor ...................... SKIPPED
[INFO] ApacheDS Triggers Interceptor ..................... SKIPPED
[INFO] ApacheDS Core ..................................... SKIPPED
[INFO] ApacheDS Core AVL ................................. SKIPPED
[INFO] ApacheDS Generalized (X) DBM Partition ............ SKIPPED
[INFO] ApacheDS LDIF Partition ........................... SKIPPED
[INFO] ApacheDS JDBM Partition ........................... SKIPPED
[INFO] ApacheDS Mavibot Partition ........................ SKIPPED
[INFO] ApacheDS Core Annotations ......................... SKIPPED
[INFO] ApacheDS Core JNDI ................................ SKIPPED
[INFO] ApacheDS Protocol Kerberos Codec .................. SKIPPED
[INFO] ApacheDS Interceptors for Kerberos ................ SKIPPED
[INFO] ApacheDS Protocol Dhcp ............................ SKIPPED
[INFO] ApacheDS Protocol Shared .......................... SKIPPED
[INFO] ApacheDS Protocol Dns ............................. SKIPPED
[INFO] ApacheDS Protocol Kerberos ........................ SKIPPED
[INFO] ApacheDS Protocol Ldap ............................ SKIPPED
[INFO] ApacheDS Protocol Ntp ............................. SKIPPED
[INFO] Apacheds Server Annotations ....................... SKIPPED
[INFO] ApacheDS Server Config ............................ SKIPPED
[INFO] ApacheDS Server JNDI .............................. SKIPPED
[INFO] ApacheDS Test Framework ........................... SKIPPED
[INFO] ApacheDS All ...................................... SKIPPED
[INFO] ApacheDS Logger Interceptor ....................... SKIPPED
[INFO] ApacheDS Password Hashing Interceptor ............. SKIPPED
[INFO] ApacheDS Core Integration ......................... SKIPPED
[INFO] ApacheDS Protocol Kerberos Test ................... SKIPPED
[INFO] ApacheDS Server Integration ....................... SKIPPED
[INFO] ApacheDS DirectoryService-WebApp bridge ........... SKIPPED
[INFO] ApacheDS Jetty HTTP Server Integration ............ SKIPPED
[INFO] ApacheDS Service Builder .......................... SKIPPED
[INFO] Apache Directory LDAP Client API test ............. SKIPPED
[INFO] kerberos-client ................................... SKIPPED
[INFO] ApacheDS Service .................................. SKIPPED
[INFO] ApacheDS Wrapper .................................. SKIPPED
[INFO] ApacheDS Installers Maven Plugin .................. SKIPPED
[INFO] ApacheDS Installers ............................... SKIPPED
[INFO] ------------------------------------------------------------------------
[INFO] BUILD FAILURE
[INFO] ------------------------------------------------------------------------
[INFO] Total time: 36.112s
[INFO] Finished at: Fri Dec 19 04:02:30 UTC 2014
[INFO] Final Memory: 43M/240M
[INFO] ------------------------------------------------------------------------
[JENKINS] Archiving disabled
[JENKINS] Archiving disabled
[JENKINS] Archiving disabled
[JENKINS] Archiving disabled
[JENKINS] Archiving disabled
[JENKINS] Archiving disabled
[JENKINS] Archiving disabled
[JENKINS] Archiving disabled
[JENKINS] Archiving disabled
[JENKINS] Archiving disabled
[JENKINS] Archiving disabled
[JENKINS] Archiving disabled
[JENKINS] Archiving disabled
[JENKINS] Archiving disabled
[JENKINS] Archiving disabled
[JENKINS] Archiving disabled
[JENKINS] Archiving disabled
[JENKINS] Archiving disabled
[JENKINS] Archiving disabled
[JENKINS] Archiving disabled
[JENKINS] Archiving disabled
[JENKINS] Archiving disabled
[JENKINS] Archiving disabled
[JENKINS] Archiving disabled
[JENKINS] Archiving disabled
[JENKINS] Archiving disabled
[JENKINS] Archiving disabled
[JENKINS] Archiving disabled
[JENKINS] Archiving disabled
[JENKINS] Archiving disabled
[JENKINS] Archiving disabled
[JENKINS] Archiving disabled
[JENKINS] Archiving disabled
[JENKINS] Archiving disabled
[JENKINS] Archiving disabled
[JENKINS] Archiving disabled
[JENKINS] Archiving disabled
[JENKINS] Archiving disabled
[JENKINS] Archiving disabled
[JENKINS] Archiving disabled
[JENKINS] Archiving disabled
[JENKINS] Archiving disabled
[JENKINS] Archiving disabled
[JENKINS] Archiving disabled
[JENKINS] Archiving disabled
[JENKINS] Archiving disabled
[JENKINS] Archiving disabled
[JENKINS] Archiving disabled
[JENKINS] Archiving disabled
[JENKINS] Archiving disabled
[JENKINS] Archiving disabled
[JENKINS] Archiving disabled
[JENKINS] Archiving disabled
[JENKINS] Archiving disabled
[JENKINS] Archiving disabled
[JENKINS] Archiving disabled
Waiting for Jenkins to finish collecting data[ERROR] Failed to execute goal org.apache.maven.plugins:maven-compiler-plugin:3.1:compile (default-compile) on project apacheds-core-api: Compilation failure: Compilation failure:
[ERROR] <https://builds.apache.org/job/dir-apacheds-ubuntu-deploy/ws/trunk/core-api/src/main/java/org/apache/directory/server/core/api/schema/registries/synchronizers/SchemaSynchronizer.java>:[45,51] package org.apache.directory.api.ldap.schema.loader does not exist
[ERROR] <https://builds.apache.org/job/dir-apacheds-ubuntu-deploy/ws/trunk/core-api/src/main/java/org/apache/directory/server/core/api/schema/registries/synchronizers/SchemaSynchronizer.java>:[68,19] cannot find symbol
[ERROR] symbol: class SchemaEntityFactory
[ERROR] location: class org.apache.directory.server.core.api.schema.registries.synchronizers.SchemaSynchronizer
[ERROR] <https://builds.apache.org/job/dir-apacheds-ubuntu-deploy/ws/trunk/core-api/src/main/java/org/apache/directory/server/core/api/schema/registries/synchronizers/AbstractRegistrySynchronizer.java>:[47,51] package org.apache.directory.api.ldap.schema.loader does not exist
[ERROR] <https://builds.apache.org/job/dir-apacheds-ubuntu-deploy/ws/trunk/core-api/src/main/java/org/apache/directory/server/core/api/schema/registries/synchronizers/AbstractRegistrySynchronizer.java>:[71,21] cannot find symbol
[ERROR] symbol: class SchemaEntityFactory
[ERROR] location: class org.apache.directory.server.core.api.schema.registries.synchronizers.AbstractRegistrySynchronizer
[ERROR] <https://builds.apache.org/job/dir-apacheds-ubuntu-deploy/ws/trunk/core-api/src/main/java/org/apache/directory/server/core/api/schema/registries/synchronizers/SchemaSynchronizer.java>:[99,23] cannot find symbol
[ERROR] symbol: class SchemaEntityFactory
[ERROR] location: class org.apache.directory.server.core.api.schema.registries.synchronizers.SchemaSynchronizer
[ERROR] <https://builds.apache.org/job/dir-apacheds-ubuntu-deploy/ws/trunk/core-api/src/main/java/org/apache/directory/server/core/api/schema/registries/synchronizers/AbstractRegistrySynchronizer.java>:[100,23] cannot find symbol
[ERROR] symbol: class SchemaEntityFactory
[ERROR] location: class org.apache.directory.server.core.api.schema.registries.synchronizers.AbstractRegistrySynchronizer
[ERROR] -> [Help 1]
[ERROR]
[ERROR] To see the full stack trace of the errors, re-run Maven with the -e switch.
[ERROR] Re-run Maven using the -X switch to enable full debug logging.
[ERROR]
[ERROR] For more information about the errors and possible solutions, please read the following articles:
[ERROR] [Help 1] http://cwiki.apache.org/confluence/display/MAVEN/MojoFailureException
[ERROR]
[ERROR] After correcting the problems, you can resume the build with the command
[ERROR] mvn <goals> -rf :apacheds-core-api
channel stopped
Jenkins build is back to normal : dir-apacheds-ubuntu-deploy #1546
Posted by Apache Jenkins Server <je...@builds.apache.org>.
See <https://builds.apache.org/job/dir-apacheds-ubuntu-deploy/1546/>