You are viewing a plain text version of this content. The canonical link for it is here.
Posted to yarn-dev@hadoop.apache.org by Apache Jenkins Server <je...@builds.apache.org> on 2014/01/07 23:49:55 UTC
Failed: YARN-1461 PreCommit Build #2815
Jira: https://issues.apache.org/jira/browse/YARN-1461
Build: https://builds.apache.org/job/PreCommit-YARN-Build/2815/
###################################################################################
########################## LAST 60 LINES OF THE CONSOLE ###########################
[...truncated 3479 lines...]
NOP
{color:red}-1 overall{color}. Here are the results of testing the latest attachment
http://issues.apache.org/jira/secure/attachment/12621867/yarn-1461-8.patch
against trunk revision .
{color:green}+1 @author{color}. The patch does not contain any @author tags.
{color:green}+1 tests included{color}. The patch appears to include 7 new or modified test files.
{color:green}+1 javac{color}. The applied patch does not increase the total number of javac compiler warnings.
{color:green}+1 javadoc{color}. The javadoc tool did not generate any warning messages.
{color:green}+1 eclipse:eclipse{color}. The patch built with eclipse:eclipse.
{color:green}+1 findbugs{color}. The patch does not introduce any new Findbugs (version 1.3.9) warnings.
{color:green}+1 release audit{color}. The applied patch does not increase the total number of release audit warnings.
{color:red}-1 core tests{color}. The patch failed these unit tests in hadoop-yarn-project/hadoop-yarn/hadoop-yarn-api hadoop-yarn-project/hadoop-yarn/hadoop-yarn-client hadoop-yarn-project/hadoop-yarn/hadoop-yarn-common hadoop-yarn-project/hadoop-yarn/hadoop-yarn-server/hadoop-yarn-server-common hadoop-yarn-project/hadoop-yarn/hadoop-yarn-server/hadoop-yarn-server-resourcemanager:
org.apache.hadoop.yarn.server.resourcemanager.TestApplicationACLs
{color:green}+1 contrib tests{color}. The patch passed contrib unit tests.
Test results: https://builds.apache.org/job/PreCommit-YARN-Build/2815//testReport/
Console output: https://builds.apache.org/job/PreCommit-YARN-Build/2815//console
This message is automatically generated.
======================================================================
======================================================================
Adding comment to Jira.
======================================================================
======================================================================
Comment added.
d6b2f3ec4d83aab6965eb7fa8c3a66e6529b4bc1 logged out
======================================================================
======================================================================
Finished build.
======================================================================
======================================================================
Build step 'Execute shell' marked build as failure
Archiving artifacts
[description-setter] Could not determine description.
Recording test results
Email was triggered for: Failure
Sending email for trigger: Failure
###################################################################################
############################## FAILED TESTS (if any) ##############################
1 tests failed.
REGRESSION: org.apache.hadoop.yarn.server.resourcemanager.TestApplicationACLs.testApplicationACLs
Error Message:
App view by super-user should list the apps!! expected:<2> but was:<0>
Stack Trace:
junit.framework.AssertionFailedError: App view by super-user should list the apps!! expected:<2> but was:<0>
at junit.framework.Assert.fail(Assert.java:50)
at junit.framework.Assert.failNotEquals(Assert.java:287)
at junit.framework.Assert.assertEquals(Assert.java:67)
at junit.framework.Assert.assertEquals(Assert.java:199)
at org.apache.hadoop.yarn.server.resourcemanager.TestApplicationACLs.verifySuperUserAccess(TestApplicationACLs.java:276)
at org.apache.hadoop.yarn.server.resourcemanager.TestApplicationACLs.testApplicationACLs(TestApplicationACLs.java:173)
Success: YARN-1166 PreCommit Build #2820
Posted by Apache Jenkins Server <je...@builds.apache.org>.
Jira: https://issues.apache.org/jira/browse/YARN-1166
Build: https://builds.apache.org/job/PreCommit-YARN-Build/2820/
###################################################################################
########################## LAST 60 LINES OF THE CONSOLE ###########################
[...truncated 3006 lines...]
/bin/kill -9 18828
kill: No such process
NOP
{color:green}+1 overall{color}. Here are the results of testing the latest attachment
http://issues.apache.org/jira/secure/attachment/12621931/YARN-1166.7.patch
against trunk revision .
{color:green}+1 @author{color}. The patch does not contain any @author tags.
{color:green}+1 tests included{color}. The patch appears to include 3 new or modified test files.
{color:green}+1 javac{color}. The applied patch does not increase the total number of javac compiler warnings.
{color:green}+1 javadoc{color}. The javadoc tool did not generate any warning messages.
{color:green}+1 eclipse:eclipse{color}. The patch built with eclipse:eclipse.
{color:green}+1 findbugs{color}. The patch does not introduce any new Findbugs (version 1.3.9) warnings.
{color:green}+1 release audit{color}. The applied patch does not increase the total number of release audit warnings.
{color:green}+1 core tests{color}. The patch passed unit tests in hadoop-yarn-project/hadoop-yarn/hadoop-yarn-server/hadoop-yarn-server-resourcemanager.
{color:green}+1 contrib tests{color}. The patch passed contrib unit tests.
Test results: https://builds.apache.org/job/PreCommit-YARN-Build/2820//testReport/
Console output: https://builds.apache.org/job/PreCommit-YARN-Build/2820//console
This message is automatically generated.
======================================================================
======================================================================
Adding comment to Jira.
======================================================================
======================================================================
Comment added.
1154545331b32c05ea25a4a00c05a840f517ae15 logged out
======================================================================
======================================================================
Finished build.
======================================================================
======================================================================
Archiving artifacts
Description set: YARN-1166
Recording test results
Email was triggered for: Success
Sending email for trigger: Success
###################################################################################
############################## FAILED TESTS (if any) ##############################
All tests passed
Failed: YARN-1531 PreCommit Build #2819
Posted by Apache Jenkins Server <je...@builds.apache.org>.
Jira: https://issues.apache.org/jira/browse/YARN-1531
Build: https://builds.apache.org/job/PreCommit-YARN-Build/2819/
###################################################################################
########################## LAST 60 LINES OF THE CONSOLE ###########################
[...truncated 2858 lines...]
kill: No such process
NOP
{color:green}+1 overall{color}. Here are the results of testing the latest attachment
http://issues.apache.org/jira/secure/attachment/12621919/YARN-1531.2.patch
against trunk revision .
{color:green}+1 @author{color}. The patch does not contain any @author tags.
{color:green}+0 tests included{color}. The patch appears to be a documentation patch that doesn't require tests.
{color:green}+1 javac{color}. The applied patch does not increase the total number of javac compiler warnings.
{color:green}+1 javadoc{color}. The javadoc tool did not generate any warning messages.
{color:green}+1 eclipse:eclipse{color}. The patch built with eclipse:eclipse.
{color:green}+1 findbugs{color}. The patch does not introduce any new Findbugs (version 1.3.9) warnings.
{color:green}+1 release audit{color}. The applied patch does not increase the total number of release audit warnings.
{color:green}+1 core tests{color}. The patch passed unit tests in hadoop-yarn-project/hadoop-yarn/hadoop-yarn-site.
{color:green}+1 contrib tests{color}. The patch passed contrib unit tests.
Test results: https://builds.apache.org/job/PreCommit-YARN-Build/2819//testReport/
Console output: https://builds.apache.org/job/PreCommit-YARN-Build/2819//console
This message is automatically generated.
======================================================================
======================================================================
Adding comment to Jira.
======================================================================
======================================================================
Comment added.
e8b077dfea9c28eef9892588980d293efabe6eb3 logged out
======================================================================
======================================================================
Finished build.
======================================================================
======================================================================
Archiving artifacts
Description set: YARN-1531
Recording test results
No test report files were found. Configuration error?
Build step 'Publish JUnit test result report' changed build result to FAILURE
Email was triggered for: Failure
Sending email for trigger: Failure
###################################################################################
############################## FAILED TESTS (if any) ##############################
No tests ran.
Failed: YARN-1568 PreCommit Build #2818
Posted by Apache Jenkins Server <je...@builds.apache.org>.
Jira: https://issues.apache.org/jira/browse/YARN-1568
Build: https://builds.apache.org/job/PreCommit-YARN-Build/2818/
###################################################################################
########################## LAST 60 LINES OF THE CONSOLE ###########################
[...truncated 3245 lines...]
NOP
{color:red}-1 overall{color}. Here are the results of testing the latest attachment
http://issues.apache.org/jira/secure/attachment/12621887/yarn-1568-1.patch
against trunk revision .
{color:green}+1 @author{color}. The patch does not contain any @author tags.
{color:red}-1 tests included{color}. The patch doesn't appear to include any new or modified tests.
Please justify why no new tests are needed for this patch.
Also please list what manual steps were performed to verify this patch.
{color:green}+1 javac{color}. The applied patch does not increase the total number of javac compiler warnings.
{color:green}+1 javadoc{color}. The javadoc tool did not generate any warning messages.
{color:green}+1 eclipse:eclipse{color}. The patch built with eclipse:eclipse.
{color:green}+1 findbugs{color}. The patch does not introduce any new Findbugs (version 1.3.9) warnings.
{color:green}+1 release audit{color}. The applied patch does not increase the total number of release audit warnings.
{color:green}+1 core tests{color}. The patch passed unit tests in hadoop-yarn-project/hadoop-yarn/hadoop-yarn-api hadoop-yarn-project/hadoop-yarn/hadoop-yarn-server/hadoop-yarn-server-resourcemanager.
{color:green}+1 contrib tests{color}. The patch passed contrib unit tests.
Test results: https://builds.apache.org/job/PreCommit-YARN-Build/2818//testReport/
Console output: https://builds.apache.org/job/PreCommit-YARN-Build/2818//console
This message is automatically generated.
======================================================================
======================================================================
Adding comment to Jira.
======================================================================
======================================================================
Comment added.
5f8f7d1155fc59542086c635043965ca9a584401 logged out
======================================================================
======================================================================
Finished build.
======================================================================
======================================================================
Build step 'Execute shell' marked build as failure
Archiving artifacts
[description-setter] Could not determine description.
Recording test results
Email was triggered for: Failure
Sending email for trigger: Failure
###################################################################################
############################## FAILED TESTS (if any) ##############################
All tests passed
Failed: YARN-1568 PreCommit Build #2817
Posted by Apache Jenkins Server <je...@builds.apache.org>.
Jira: https://issues.apache.org/jira/browse/YARN-1568
Build: https://builds.apache.org/job/PreCommit-YARN-Build/2817/
###################################################################################
########################## LAST 60 LINES OF THE CONSOLE ###########################
[...truncated 73 lines...]
rm: cannot remove `hadoop-yarn-project/hadoop-yarn/hadoop-yarn-common/target/TestFSDownload/public-cache': Permission denied
At revision 1556412.
YARN-1568 patch is being downloaded at Wed Jan 8 00:10:55 UTC 2014 from
http://issues.apache.org/jira/secure/attachment/12621871/yarn-1568-1.patch
cp: cannot stat `/home/jenkins/buildSupport/lib/*': No such file or directory
======================================================================
======================================================================
Pre-build trunk to verify trunk stability and javac warnings
======================================================================
======================================================================
Compiling /home/jenkins/jenkins-slave/workspace/PreCommit-YARN-Build/trunk
/home/jenkins/tools/maven/latest/bin/mvn clean test -DskipTests -DHadoopPatchProcess -Ptest-patch > /home/jenkins/jenkins-slave/workspace/PreCommit-YARN-Build/patchprocess/trunkJavacWarnings.txt 2>&1
Trunk compilation is broken?
{color:red}-1 overall{color}. Here are the results of testing the latest attachment
http://issues.apache.org/jira/secure/attachment/12621871/yarn-1568-1.patch
against trunk revision .
{color:red}-1 patch{color}. Trunk compilation may be broken.
Console output: https://builds.apache.org/job/PreCommit-YARN-Build/2817//console
This message is automatically generated.
======================================================================
======================================================================
Adding comment to Jira.
======================================================================
======================================================================
Comment added.
eb9e2940c62b2006e29870382af90ae34ec619ea logged out
======================================================================
======================================================================
Finished build.
======================================================================
======================================================================
Build step 'Execute shell' marked build as failure
Archiving artifacts
[description-setter] Could not determine description.
Recording test results
Editable Email Notification is waiting for a checkpoint on PreCommit-YARN-Build #2816
Email was triggered for: Failure
Sending email for trigger: Failure
###################################################################################
############################## FAILED TESTS (if any) ##############################
No tests ran.
Failed: YARN-888 PreCommit Build #2816
Posted by Apache Jenkins Server <je...@builds.apache.org>.
Jira: https://issues.apache.org/jira/browse/YARN-888
Build: https://builds.apache.org/job/PreCommit-YARN-Build/2816/
###################################################################################
########################## LAST 60 LINES OF THE CONSOLE ###########################
[...truncated 9480 lines...]
http://issues.apache.org/jira/secure/attachment/12621881/YARN-888.patch
against trunk revision .
{color:green}+1 @author{color}. The patch does not contain any @author tags.
{color:red}-1 tests included{color}. The patch doesn't appear to include any new or modified tests.
Please justify why no new tests are needed for this patch.
Also please list what manual steps were performed to verify this patch.
{color:green}+1 javac{color}. The applied patch does not increase the total number of javac compiler warnings.
{color:green}+1 javadoc{color}. The javadoc tool did not generate any warning messages.
{color:green}+1 eclipse:eclipse{color}. The patch built with eclipse:eclipse.
{color:green}+1 findbugs{color}. The patch does not introduce any new Findbugs (version 1.3.9) warnings.
{color:green}+1 release audit{color}. The applied patch does not increase the total number of release audit warnings.
{color:red}-1 core tests{color}. The patch failed these unit tests in hadoop-yarn-project/hadoop-yarn/hadoop-yarn-api hadoop-yarn-project/hadoop-yarn/hadoop-yarn-applications/hadoop-yarn-applications-distributedshell hadoop-yarn-project/hadoop-yarn/hadoop-yarn-applications/hadoop-yarn-applications-unmanaged-am-launcher hadoop-yarn-project/hadoop-yarn/hadoop-yarn-client hadoop-yarn-project/hadoop-yarn/hadoop-yarn-common hadoop-yarn-project/hadoop-yarn/hadoop-yarn-server/hadoop-yarn-server-common hadoop-yarn-project/hadoop-yarn/hadoop-yarn-server/hadoop-yarn-server-nodemanager hadoop-yarn-project/hadoop-yarn/hadoop-yarn-server/hadoop-yarn-server-resourcemanager hadoop-yarn-project/hadoop-yarn/hadoop-yarn-server/hadoop-yarn-server-tests hadoop-yarn-project/hadoop-yarn/hadoop-yarn-server/hadoop-yarn-server-web-proxy:
org.apache.hadoop.yarn.server.nodemanager.webapp.TestNMWebServicesApps
org.apache.hadoop.yarn.server.nodemanager.webapp.TestNMWebServicesContainers
org.apache.hadoop.yarn.server.nodemanager.webapp.TestNMWebServices
The test build failed in hadoop-yarn-project/hadoop-yarn/hadoop-yarn-server/hadoop-yarn-server-web-proxy hadoop-yarn-project/hadoop-yarn/hadoop-yarn-server/hadoop-yarn-server-tests hadoop-yarn-project/hadoop-yarn/hadoop-yarn-server/hadoop-yarn-server-resourcemanager hadoop-yarn-project/hadoop-yarn/hadoop-yarn-server/hadoop-yarn-server-common hadoop-yarn-project/hadoop-yarn/hadoop-yarn-common hadoop-yarn-project/hadoop-yarn/hadoop-yarn-client hadoop-yarn-project/hadoop-yarn/hadoop-yarn-applications/hadoop-yarn-applications-unmanaged-am-launcher hadoop-yarn-project/hadoop-yarn/hadoop-yarn-applications/hadoop-yarn-applications-distributedshell hadoop-yarn-project/hadoop-yarn/hadoop-yarn-api
{color:green}+1 contrib tests{color}. The patch passed contrib unit tests.
Test results: https://builds.apache.org/job/PreCommit-YARN-Build/2816//testReport/
Console output: https://builds.apache.org/job/PreCommit-YARN-Build/2816//console
This message is automatically generated.
======================================================================
======================================================================
Adding comment to Jira.
======================================================================
======================================================================
Comment added.
96e34f2f1d4032a6b150efe098d0fd1a38cd4e45 logged out
======================================================================
======================================================================
Finished build.
======================================================================
======================================================================
Build step 'Execute shell' marked build as failure
Archiving artifacts
[description-setter] Could not determine description.
Recording test results
Email was triggered for: Failure
Sending email for trigger: Failure
###################################################################################
############################## FAILED TESTS (if any) ##############################
42 tests failed.
FAILED: org.apache.hadoop.yarn.server.nodemanager.webapp.TestNMWebServices.testInvalidUri
Error Message:
The default test container factory, null, could not be instantiated
Stack Trace:
com.sun.jersey.test.framework.spi.container.TestContainerException: The default test container factory, null, could not be instantiated
at com.sun.jersey.test.framework.JerseyTest.getDefaultTestContainerFactory(JerseyTest.java:406)
at com.sun.jersey.test.framework.JerseyTest.getTestContainerFactory(JerseyTest.java:273)
at com.sun.jersey.test.framework.JerseyTest.<init>(JerseyTest.java:217)
at org.apache.hadoop.yarn.server.nodemanager.webapp.TestNMWebServices.<init>(TestNMWebServices.java:171)
FAILED: org.apache.hadoop.yarn.server.nodemanager.webapp.TestNMWebServices.testInvalidAccept
Error Message:
The default test container factory, null, could not be instantiated
Stack Trace:
com.sun.jersey.test.framework.spi.container.TestContainerException: The default test container factory, null, could not be instantiated
at com.sun.jersey.test.framework.JerseyTest.getDefaultTestContainerFactory(JerseyTest.java:406)
at com.sun.jersey.test.framework.JerseyTest.getTestContainerFactory(JerseyTest.java:273)
at com.sun.jersey.test.framework.JerseyTest.<init>(JerseyTest.java:217)
at org.apache.hadoop.yarn.server.nodemanager.webapp.TestNMWebServices.<init>(TestNMWebServices.java:171)
FAILED: org.apache.hadoop.yarn.server.nodemanager.webapp.TestNMWebServices.testInvalidUri2
Error Message:
The default test container factory, null, could not be instantiated
Stack Trace:
com.sun.jersey.test.framework.spi.container.TestContainerException: The default test container factory, null, could not be instantiated
at com.sun.jersey.test.framework.JerseyTest.getDefaultTestContainerFactory(JerseyTest.java:406)
at com.sun.jersey.test.framework.JerseyTest.getTestContainerFactory(JerseyTest.java:273)
at com.sun.jersey.test.framework.JerseyTest.<init>(JerseyTest.java:217)
at org.apache.hadoop.yarn.server.nodemanager.webapp.TestNMWebServices.<init>(TestNMWebServices.java:171)
FAILED: org.apache.hadoop.yarn.server.nodemanager.webapp.TestNMWebServices.testNode
Error Message:
The default test container factory, null, could not be instantiated
Stack Trace:
com.sun.jersey.test.framework.spi.container.TestContainerException: The default test container factory, null, could not be instantiated
at com.sun.jersey.test.framework.JerseyTest.getDefaultTestContainerFactory(JerseyTest.java:406)
at com.sun.jersey.test.framework.JerseyTest.getTestContainerFactory(JerseyTest.java:273)
at com.sun.jersey.test.framework.JerseyTest.<init>(JerseyTest.java:217)
at org.apache.hadoop.yarn.server.nodemanager.webapp.TestNMWebServices.<init>(TestNMWebServices.java:171)
FAILED: org.apache.hadoop.yarn.server.nodemanager.webapp.TestNMWebServices.testNodeSlash
Error Message:
The default test container factory, null, could not be instantiated
Stack Trace:
com.sun.jersey.test.framework.spi.container.TestContainerException: The default test container factory, null, could not be instantiated
at com.sun.jersey.test.framework.JerseyTest.getDefaultTestContainerFactory(JerseyTest.java:406)
at com.sun.jersey.test.framework.JerseyTest.getTestContainerFactory(JerseyTest.java:273)
at com.sun.jersey.test.framework.JerseyTest.<init>(JerseyTest.java:217)
at org.apache.hadoop.yarn.server.nodemanager.webapp.TestNMWebServices.<init>(TestNMWebServices.java:171)
FAILED: org.apache.hadoop.yarn.server.nodemanager.webapp.TestNMWebServices.testNodeDefault
Error Message:
The default test container factory, null, could not be instantiated
Stack Trace:
com.sun.jersey.test.framework.spi.container.TestContainerException: The default test container factory, null, could not be instantiated
at com.sun.jersey.test.framework.JerseyTest.getDefaultTestContainerFactory(JerseyTest.java:406)
at com.sun.jersey.test.framework.JerseyTest.getTestContainerFactory(JerseyTest.java:273)
at com.sun.jersey.test.framework.JerseyTest.<init>(JerseyTest.java:217)
at org.apache.hadoop.yarn.server.nodemanager.webapp.TestNMWebServices.<init>(TestNMWebServices.java:171)
FAILED: org.apache.hadoop.yarn.server.nodemanager.webapp.TestNMWebServices.testNodeInfo
Error Message:
The default test container factory, null, could not be instantiated
Stack Trace:
com.sun.jersey.test.framework.spi.container.TestContainerException: The default test container factory, null, could not be instantiated
at com.sun.jersey.test.framework.JerseyTest.getDefaultTestContainerFactory(JerseyTest.java:406)
at com.sun.jersey.test.framework.JerseyTest.getTestContainerFactory(JerseyTest.java:273)
at com.sun.jersey.test.framework.JerseyTest.<init>(JerseyTest.java:217)
at org.apache.hadoop.yarn.server.nodemanager.webapp.TestNMWebServices.<init>(TestNMWebServices.java:171)
FAILED: org.apache.hadoop.yarn.server.nodemanager.webapp.TestNMWebServices.testNodeInfoSlash
Error Message:
The default test container factory, null, could not be instantiated
Stack Trace:
com.sun.jersey.test.framework.spi.container.TestContainerException: The default test container factory, null, could not be instantiated
at com.sun.jersey.test.framework.JerseyTest.getDefaultTestContainerFactory(JerseyTest.java:406)
at com.sun.jersey.test.framework.JerseyTest.getTestContainerFactory(JerseyTest.java:273)
at com.sun.jersey.test.framework.JerseyTest.<init>(JerseyTest.java:217)
at org.apache.hadoop.yarn.server.nodemanager.webapp.TestNMWebServices.<init>(TestNMWebServices.java:171)
FAILED: org.apache.hadoop.yarn.server.nodemanager.webapp.TestNMWebServices.testNodeInfoDefault
Error Message:
The default test container factory, null, could not be instantiated
Stack Trace:
com.sun.jersey.test.framework.spi.container.TestContainerException: The default test container factory, null, could not be instantiated
at com.sun.jersey.test.framework.JerseyTest.getDefaultTestContainerFactory(JerseyTest.java:406)
at com.sun.jersey.test.framework.JerseyTest.getTestContainerFactory(JerseyTest.java:273)
at com.sun.jersey.test.framework.JerseyTest.<init>(JerseyTest.java:217)
at org.apache.hadoop.yarn.server.nodemanager.webapp.TestNMWebServices.<init>(TestNMWebServices.java:171)
FAILED: org.apache.hadoop.yarn.server.nodemanager.webapp.TestNMWebServices.testSingleNodesXML
Error Message:
The default test container factory, null, could not be instantiated
Stack Trace:
com.sun.jersey.test.framework.spi.container.TestContainerException: The default test container factory, null, could not be instantiated
at com.sun.jersey.test.framework.JerseyTest.getDefaultTestContainerFactory(JerseyTest.java:406)
at com.sun.jersey.test.framework.JerseyTest.getTestContainerFactory(JerseyTest.java:273)
at com.sun.jersey.test.framework.JerseyTest.<init>(JerseyTest.java:217)
at org.apache.hadoop.yarn.server.nodemanager.webapp.TestNMWebServices.<init>(TestNMWebServices.java:171)
FAILED: org.apache.hadoop.yarn.server.nodemanager.webapp.TestNMWebServices.testContainerLogs
Error Message:
The default test container factory, null, could not be instantiated
Stack Trace:
com.sun.jersey.test.framework.spi.container.TestContainerException: The default test container factory, null, could not be instantiated
at com.sun.jersey.test.framework.JerseyTest.getDefaultTestContainerFactory(JerseyTest.java:406)
at com.sun.jersey.test.framework.JerseyTest.getTestContainerFactory(JerseyTest.java:273)
at com.sun.jersey.test.framework.JerseyTest.<init>(JerseyTest.java:217)
at org.apache.hadoop.yarn.server.nodemanager.webapp.TestNMWebServices.<init>(TestNMWebServices.java:171)
FAILED: org.apache.hadoop.yarn.server.nodemanager.webapp.TestNMWebServicesApps.testNodeAppsNone
Error Message:
The default test container factory, null, could not be instantiated
Stack Trace:
com.sun.jersey.test.framework.spi.container.TestContainerException: The default test container factory, null, could not be instantiated
at com.sun.jersey.test.framework.JerseyTest.getDefaultTestContainerFactory(JerseyTest.java:406)
at com.sun.jersey.test.framework.JerseyTest.getTestContainerFactory(JerseyTest.java:273)
at com.sun.jersey.test.framework.JerseyTest.<init>(JerseyTest.java:217)
at org.apache.hadoop.yarn.server.nodemanager.webapp.TestNMWebServicesApps.<init>(TestNMWebServicesApps.java:165)
FAILED: org.apache.hadoop.yarn.server.nodemanager.webapp.TestNMWebServicesApps.testNodeApps
Error Message:
The default test container factory, null, could not be instantiated
Stack Trace:
com.sun.jersey.test.framework.spi.container.TestContainerException: The default test container factory, null, could not be instantiated
at com.sun.jersey.test.framework.JerseyTest.getDefaultTestContainerFactory(JerseyTest.java:406)
at com.sun.jersey.test.framework.JerseyTest.getTestContainerFactory(JerseyTest.java:273)
at com.sun.jersey.test.framework.JerseyTest.<init>(JerseyTest.java:217)
at org.apache.hadoop.yarn.server.nodemanager.webapp.TestNMWebServicesApps.<init>(TestNMWebServicesApps.java:165)
FAILED: org.apache.hadoop.yarn.server.nodemanager.webapp.TestNMWebServicesApps.testNodeAppsSlash
Error Message:
The default test container factory, null, could not be instantiated
Stack Trace:
com.sun.jersey.test.framework.spi.container.TestContainerException: The default test container factory, null, could not be instantiated
at com.sun.jersey.test.framework.JerseyTest.getDefaultTestContainerFactory(JerseyTest.java:406)
at com.sun.jersey.test.framework.JerseyTest.getTestContainerFactory(JerseyTest.java:273)
at com.sun.jersey.test.framework.JerseyTest.<init>(JerseyTest.java:217)
at org.apache.hadoop.yarn.server.nodemanager.webapp.TestNMWebServicesApps.<init>(TestNMWebServicesApps.java:165)
FAILED: org.apache.hadoop.yarn.server.nodemanager.webapp.TestNMWebServicesApps.testNodeAppsDefault
Error Message:
The default test container factory, null, could not be instantiated
Stack Trace:
com.sun.jersey.test.framework.spi.container.TestContainerException: The default test container factory, null, could not be instantiated
at com.sun.jersey.test.framework.JerseyTest.getDefaultTestContainerFactory(JerseyTest.java:406)
at com.sun.jersey.test.framework.JerseyTest.getTestContainerFactory(JerseyTest.java:273)
at com.sun.jersey.test.framework.JerseyTest.<init>(JerseyTest.java:217)
at org.apache.hadoop.yarn.server.nodemanager.webapp.TestNMWebServicesApps.<init>(TestNMWebServicesApps.java:165)
FAILED: org.apache.hadoop.yarn.server.nodemanager.webapp.TestNMWebServicesApps.testNodeAppsUser
Error Message:
The default test container factory, null, could not be instantiated
Stack Trace:
com.sun.jersey.test.framework.spi.container.TestContainerException: The default test container factory, null, could not be instantiated
at com.sun.jersey.test.framework.JerseyTest.getDefaultTestContainerFactory(JerseyTest.java:406)
at com.sun.jersey.test.framework.JerseyTest.getTestContainerFactory(JerseyTest.java:273)
at com.sun.jersey.test.framework.JerseyTest.<init>(JerseyTest.java:217)
at org.apache.hadoop.yarn.server.nodemanager.webapp.TestNMWebServicesApps.<init>(TestNMWebServicesApps.java:165)
FAILED: org.apache.hadoop.yarn.server.nodemanager.webapp.TestNMWebServicesApps.testNodeAppsUserNone
Error Message:
The default test container factory, null, could not be instantiated
Stack Trace:
com.sun.jersey.test.framework.spi.container.TestContainerException: The default test container factory, null, could not be instantiated
at com.sun.jersey.test.framework.JerseyTest.getDefaultTestContainerFactory(JerseyTest.java:406)
at com.sun.jersey.test.framework.JerseyTest.getTestContainerFactory(JerseyTest.java:273)
at com.sun.jersey.test.framework.JerseyTest.<init>(JerseyTest.java:217)
at org.apache.hadoop.yarn.server.nodemanager.webapp.TestNMWebServicesApps.<init>(TestNMWebServicesApps.java:165)
FAILED: org.apache.hadoop.yarn.server.nodemanager.webapp.TestNMWebServicesApps.testNodeAppsUserEmpty
Error Message:
The default test container factory, null, could not be instantiated
Stack Trace:
com.sun.jersey.test.framework.spi.container.TestContainerException: The default test container factory, null, could not be instantiated
at com.sun.jersey.test.framework.JerseyTest.getDefaultTestContainerFactory(JerseyTest.java:406)
at com.sun.jersey.test.framework.JerseyTest.getTestContainerFactory(JerseyTest.java:273)
at com.sun.jersey.test.framework.JerseyTest.<init>(JerseyTest.java:217)
at org.apache.hadoop.yarn.server.nodemanager.webapp.TestNMWebServicesApps.<init>(TestNMWebServicesApps.java:165)
FAILED: org.apache.hadoop.yarn.server.nodemanager.webapp.TestNMWebServicesApps.testNodeAppsState
Error Message:
The default test container factory, null, could not be instantiated
Stack Trace:
com.sun.jersey.test.framework.spi.container.TestContainerException: The default test container factory, null, could not be instantiated
at com.sun.jersey.test.framework.JerseyTest.getDefaultTestContainerFactory(JerseyTest.java:406)
at com.sun.jersey.test.framework.JerseyTest.getTestContainerFactory(JerseyTest.java:273)
at com.sun.jersey.test.framework.JerseyTest.<init>(JerseyTest.java:217)
at org.apache.hadoop.yarn.server.nodemanager.webapp.TestNMWebServicesApps.<init>(TestNMWebServicesApps.java:165)
FAILED: org.apache.hadoop.yarn.server.nodemanager.webapp.TestNMWebServicesApps.testNodeAppsStateNone
Error Message:
The default test container factory, null, could not be instantiated
Stack Trace:
com.sun.jersey.test.framework.spi.container.TestContainerException: The default test container factory, null, could not be instantiated
at com.sun.jersey.test.framework.JerseyTest.getDefaultTestContainerFactory(JerseyTest.java:406)
at com.sun.jersey.test.framework.JerseyTest.getTestContainerFactory(JerseyTest.java:273)
at com.sun.jersey.test.framework.JerseyTest.<init>(JerseyTest.java:217)
at org.apache.hadoop.yarn.server.nodemanager.webapp.TestNMWebServicesApps.<init>(TestNMWebServicesApps.java:165)
FAILED: org.apache.hadoop.yarn.server.nodemanager.webapp.TestNMWebServicesApps.testNodeAppsStateInvalid
Error Message:
The default test container factory, null, could not be instantiated
Stack Trace:
com.sun.jersey.test.framework.spi.container.TestContainerException: The default test container factory, null, could not be instantiated
at com.sun.jersey.test.framework.JerseyTest.getDefaultTestContainerFactory(JerseyTest.java:406)
at com.sun.jersey.test.framework.JerseyTest.getTestContainerFactory(JerseyTest.java:273)
at com.sun.jersey.test.framework.JerseyTest.<init>(JerseyTest.java:217)
at org.apache.hadoop.yarn.server.nodemanager.webapp.TestNMWebServicesApps.<init>(TestNMWebServicesApps.java:165)
FAILED: org.apache.hadoop.yarn.server.nodemanager.webapp.TestNMWebServicesApps.testNodeAppsStateInvalidDefault
Error Message:
The default test container factory, null, could not be instantiated
Stack Trace:
com.sun.jersey.test.framework.spi.container.TestContainerException: The default test container factory, null, could not be instantiated
at com.sun.jersey.test.framework.JerseyTest.getDefaultTestContainerFactory(JerseyTest.java:406)
at com.sun.jersey.test.framework.JerseyTest.getTestContainerFactory(JerseyTest.java:273)
at com.sun.jersey.test.framework.JerseyTest.<init>(JerseyTest.java:217)
at org.apache.hadoop.yarn.server.nodemanager.webapp.TestNMWebServicesApps.<init>(TestNMWebServicesApps.java:165)
FAILED: org.apache.hadoop.yarn.server.nodemanager.webapp.TestNMWebServicesApps.testNodeAppsStateInvalidXML
Error Message:
The default test container factory, null, could not be instantiated
Stack Trace:
com.sun.jersey.test.framework.spi.container.TestContainerException: The default test container factory, null, could not be instantiated
at com.sun.jersey.test.framework.JerseyTest.getDefaultTestContainerFactory(JerseyTest.java:406)
at com.sun.jersey.test.framework.JerseyTest.getTestContainerFactory(JerseyTest.java:273)
at com.sun.jersey.test.framework.JerseyTest.<init>(JerseyTest.java:217)
at org.apache.hadoop.yarn.server.nodemanager.webapp.TestNMWebServicesApps.<init>(TestNMWebServicesApps.java:165)
FAILED: org.apache.hadoop.yarn.server.nodemanager.webapp.TestNMWebServicesApps.testNodeSingleApps
Error Message:
The default test container factory, null, could not be instantiated
Stack Trace:
com.sun.jersey.test.framework.spi.container.TestContainerException: The default test container factory, null, could not be instantiated
at com.sun.jersey.test.framework.JerseyTest.getDefaultTestContainerFactory(JerseyTest.java:406)
at com.sun.jersey.test.framework.JerseyTest.getTestContainerFactory(JerseyTest.java:273)
at com.sun.jersey.test.framework.JerseyTest.<init>(JerseyTest.java:217)
at org.apache.hadoop.yarn.server.nodemanager.webapp.TestNMWebServicesApps.<init>(TestNMWebServicesApps.java:165)
FAILED: org.apache.hadoop.yarn.server.nodemanager.webapp.TestNMWebServicesApps.testNodeSingleAppsDefault
Error Message:
The default test container factory, null, could not be instantiated
Stack Trace:
com.sun.jersey.test.framework.spi.container.TestContainerException: The default test container factory, null, could not be instantiated
at com.sun.jersey.test.framework.JerseyTest.getDefaultTestContainerFactory(JerseyTest.java:406)
at com.sun.jersey.test.framework.JerseyTest.getTestContainerFactory(JerseyTest.java:273)
at com.sun.jersey.test.framework.JerseyTest.<init>(JerseyTest.java:217)
at org.apache.hadoop.yarn.server.nodemanager.webapp.TestNMWebServicesApps.<init>(TestNMWebServicesApps.java:165)
FAILED: org.apache.hadoop.yarn.server.nodemanager.webapp.TestNMWebServicesApps.testNodeSingleAppsSlash
Error Message:
The default test container factory, null, could not be instantiated
Stack Trace:
com.sun.jersey.test.framework.spi.container.TestContainerException: The default test container factory, null, could not be instantiated
at com.sun.jersey.test.framework.JerseyTest.getDefaultTestContainerFactory(JerseyTest.java:406)
at com.sun.jersey.test.framework.JerseyTest.getTestContainerFactory(JerseyTest.java:273)
at com.sun.jersey.test.framework.JerseyTest.<init>(JerseyTest.java:217)
at org.apache.hadoop.yarn.server.nodemanager.webapp.TestNMWebServicesApps.<init>(TestNMWebServicesApps.java:165)
FAILED: org.apache.hadoop.yarn.server.nodemanager.webapp.TestNMWebServicesApps.testNodeSingleAppsInvalid
Error Message:
The default test container factory, null, could not be instantiated
Stack Trace:
com.sun.jersey.test.framework.spi.container.TestContainerException: The default test container factory, null, could not be instantiated
at com.sun.jersey.test.framework.JerseyTest.getDefaultTestContainerFactory(JerseyTest.java:406)
at com.sun.jersey.test.framework.JerseyTest.getTestContainerFactory(JerseyTest.java:273)
at com.sun.jersey.test.framework.JerseyTest.<init>(JerseyTest.java:217)
at org.apache.hadoop.yarn.server.nodemanager.webapp.TestNMWebServicesApps.<init>(TestNMWebServicesApps.java:165)
FAILED: org.apache.hadoop.yarn.server.nodemanager.webapp.TestNMWebServicesApps.testNodeSingleAppsMissing
Error Message:
The default test container factory, null, could not be instantiated
Stack Trace:
com.sun.jersey.test.framework.spi.container.TestContainerException: The default test container factory, null, could not be instantiated
at com.sun.jersey.test.framework.JerseyTest.getDefaultTestContainerFactory(JerseyTest.java:406)
at com.sun.jersey.test.framework.JerseyTest.getTestContainerFactory(JerseyTest.java:273)
at com.sun.jersey.test.framework.JerseyTest.<init>(JerseyTest.java:217)
at org.apache.hadoop.yarn.server.nodemanager.webapp.TestNMWebServicesApps.<init>(TestNMWebServicesApps.java:165)
FAILED: org.apache.hadoop.yarn.server.nodemanager.webapp.TestNMWebServicesApps.testNodeAppsXML
Error Message:
The default test container factory, null, could not be instantiated
Stack Trace:
com.sun.jersey.test.framework.spi.container.TestContainerException: The default test container factory, null, could not be instantiated
at com.sun.jersey.test.framework.JerseyTest.getDefaultTestContainerFactory(JerseyTest.java:406)
at com.sun.jersey.test.framework.JerseyTest.getTestContainerFactory(JerseyTest.java:273)
at com.sun.jersey.test.framework.JerseyTest.<init>(JerseyTest.java:217)
at org.apache.hadoop.yarn.server.nodemanager.webapp.TestNMWebServicesApps.<init>(TestNMWebServicesApps.java:165)
FAILED: org.apache.hadoop.yarn.server.nodemanager.webapp.TestNMWebServicesApps.testNodeSingleAppsXML
Error Message:
The default test container factory, null, could not be instantiated
Stack Trace:
com.sun.jersey.test.framework.spi.container.TestContainerException: The default test container factory, null, could not be instantiated
at com.sun.jersey.test.framework.JerseyTest.getDefaultTestContainerFactory(JerseyTest.java:406)
at com.sun.jersey.test.framework.JerseyTest.getTestContainerFactory(JerseyTest.java:273)
at com.sun.jersey.test.framework.JerseyTest.<init>(JerseyTest.java:217)
at org.apache.hadoop.yarn.server.nodemanager.webapp.TestNMWebServicesApps.<init>(TestNMWebServicesApps.java:165)
FAILED: org.apache.hadoop.yarn.server.nodemanager.webapp.TestNMWebServicesContainers.testNodeContainersNone
Error Message:
The default test container factory, null, could not be instantiated
Stack Trace:
com.sun.jersey.test.framework.spi.container.TestContainerException: The default test container factory, null, could not be instantiated
at com.sun.jersey.test.framework.JerseyTest.getDefaultTestContainerFactory(JerseyTest.java:406)
at com.sun.jersey.test.framework.JerseyTest.getTestContainerFactory(JerseyTest.java:273)
at com.sun.jersey.test.framework.JerseyTest.<init>(JerseyTest.java:217)
at org.apache.hadoop.yarn.server.nodemanager.webapp.TestNMWebServicesContainers.<init>(TestNMWebServicesContainers.java:171)
FAILED: org.apache.hadoop.yarn.server.nodemanager.webapp.TestNMWebServicesContainers.testNodeContainers
Error Message:
The default test container factory, null, could not be instantiated
Stack Trace:
com.sun.jersey.test.framework.spi.container.TestContainerException: The default test container factory, null, could not be instantiated
at com.sun.jersey.test.framework.JerseyTest.getDefaultTestContainerFactory(JerseyTest.java:406)
at com.sun.jersey.test.framework.JerseyTest.getTestContainerFactory(JerseyTest.java:273)
at com.sun.jersey.test.framework.JerseyTest.<init>(JerseyTest.java:217)
at org.apache.hadoop.yarn.server.nodemanager.webapp.TestNMWebServicesContainers.<init>(TestNMWebServicesContainers.java:171)
FAILED: org.apache.hadoop.yarn.server.nodemanager.webapp.TestNMWebServicesContainers.testNodeContainersSlash
Error Message:
The default test container factory, null, could not be instantiated
Stack Trace:
com.sun.jersey.test.framework.spi.container.TestContainerException: The default test container factory, null, could not be instantiated
at com.sun.jersey.test.framework.JerseyTest.getDefaultTestContainerFactory(JerseyTest.java:406)
at com.sun.jersey.test.framework.JerseyTest.getTestContainerFactory(JerseyTest.java:273)
at com.sun.jersey.test.framework.JerseyTest.<init>(JerseyTest.java:217)
at org.apache.hadoop.yarn.server.nodemanager.webapp.TestNMWebServicesContainers.<init>(TestNMWebServicesContainers.java:171)
FAILED: org.apache.hadoop.yarn.server.nodemanager.webapp.TestNMWebServicesContainers.testNodeContainersDefault
Error Message:
The default test container factory, null, could not be instantiated
Stack Trace:
com.sun.jersey.test.framework.spi.container.TestContainerException: The default test container factory, null, could not be instantiated
at com.sun.jersey.test.framework.JerseyTest.getDefaultTestContainerFactory(JerseyTest.java:406)
at com.sun.jersey.test.framework.JerseyTest.getTestContainerFactory(JerseyTest.java:273)
at com.sun.jersey.test.framework.JerseyTest.<init>(JerseyTest.java:217)
at org.apache.hadoop.yarn.server.nodemanager.webapp.TestNMWebServicesContainers.<init>(TestNMWebServicesContainers.java:171)
FAILED: org.apache.hadoop.yarn.server.nodemanager.webapp.TestNMWebServicesContainers.testNodeSingleContainers
Error Message:
The default test container factory, null, could not be instantiated
Stack Trace:
com.sun.jersey.test.framework.spi.container.TestContainerException: The default test container factory, null, could not be instantiated
at com.sun.jersey.test.framework.JerseyTest.getDefaultTestContainerFactory(JerseyTest.java:406)
at com.sun.jersey.test.framework.JerseyTest.getTestContainerFactory(JerseyTest.java:273)
at com.sun.jersey.test.framework.JerseyTest.<init>(JerseyTest.java:217)
at org.apache.hadoop.yarn.server.nodemanager.webapp.TestNMWebServicesContainers.<init>(TestNMWebServicesContainers.java:171)
FAILED: org.apache.hadoop.yarn.server.nodemanager.webapp.TestNMWebServicesContainers.testNodeSingleContainersSlash
Error Message:
The default test container factory, null, could not be instantiated
Stack Trace:
com.sun.jersey.test.framework.spi.container.TestContainerException: The default test container factory, null, could not be instantiated
at com.sun.jersey.test.framework.JerseyTest.getDefaultTestContainerFactory(JerseyTest.java:406)
at com.sun.jersey.test.framework.JerseyTest.getTestContainerFactory(JerseyTest.java:273)
at com.sun.jersey.test.framework.JerseyTest.<init>(JerseyTest.java:217)
at org.apache.hadoop.yarn.server.nodemanager.webapp.TestNMWebServicesContainers.<init>(TestNMWebServicesContainers.java:171)
FAILED: org.apache.hadoop.yarn.server.nodemanager.webapp.TestNMWebServicesContainers.testNodeSingleContainersDefault
Error Message:
The default test container factory, null, could not be instantiated
Stack Trace:
com.sun.jersey.test.framework.spi.container.TestContainerException: The default test container factory, null, could not be instantiated
at com.sun.jersey.test.framework.JerseyTest.getDefaultTestContainerFactory(JerseyTest.java:406)
at com.sun.jersey.test.framework.JerseyTest.getTestContainerFactory(JerseyTest.java:273)
at com.sun.jersey.test.framework.JerseyTest.<init>(JerseyTest.java:217)
at org.apache.hadoop.yarn.server.nodemanager.webapp.TestNMWebServicesContainers.<init>(TestNMWebServicesContainers.java:171)
FAILED: org.apache.hadoop.yarn.server.nodemanager.webapp.TestNMWebServicesContainers.testSingleContainerInvalid
Error Message:
The default test container factory, null, could not be instantiated
Stack Trace:
com.sun.jersey.test.framework.spi.container.TestContainerException: The default test container factory, null, could not be instantiated
at com.sun.jersey.test.framework.JerseyTest.getDefaultTestContainerFactory(JerseyTest.java:406)
at com.sun.jersey.test.framework.JerseyTest.getTestContainerFactory(JerseyTest.java:273)
at com.sun.jersey.test.framework.JerseyTest.<init>(JerseyTest.java:217)
at org.apache.hadoop.yarn.server.nodemanager.webapp.TestNMWebServicesContainers.<init>(TestNMWebServicesContainers.java:171)
FAILED: org.apache.hadoop.yarn.server.nodemanager.webapp.TestNMWebServicesContainers.testSingleContainerInvalid2
Error Message:
The default test container factory, null, could not be instantiated
Stack Trace:
com.sun.jersey.test.framework.spi.container.TestContainerException: The default test container factory, null, could not be instantiated
at com.sun.jersey.test.framework.JerseyTest.getDefaultTestContainerFactory(JerseyTest.java:406)
at com.sun.jersey.test.framework.JerseyTest.getTestContainerFactory(JerseyTest.java:273)
at com.sun.jersey.test.framework.JerseyTest.<init>(JerseyTest.java:217)
at org.apache.hadoop.yarn.server.nodemanager.webapp.TestNMWebServicesContainers.<init>(TestNMWebServicesContainers.java:171)
FAILED: org.apache.hadoop.yarn.server.nodemanager.webapp.TestNMWebServicesContainers.testSingleContainerWrong
Error Message:
The default test container factory, null, could not be instantiated
Stack Trace:
com.sun.jersey.test.framework.spi.container.TestContainerException: The default test container factory, null, could not be instantiated
at com.sun.jersey.test.framework.JerseyTest.getDefaultTestContainerFactory(JerseyTest.java:406)
at com.sun.jersey.test.framework.JerseyTest.getTestContainerFactory(JerseyTest.java:273)
at com.sun.jersey.test.framework.JerseyTest.<init>(JerseyTest.java:217)
at org.apache.hadoop.yarn.server.nodemanager.webapp.TestNMWebServicesContainers.<init>(TestNMWebServicesContainers.java:171)
FAILED: org.apache.hadoop.yarn.server.nodemanager.webapp.TestNMWebServicesContainers.testNodeSingleContainerXML
Error Message:
The default test container factory, null, could not be instantiated
Stack Trace:
com.sun.jersey.test.framework.spi.container.TestContainerException: The default test container factory, null, could not be instantiated
at com.sun.jersey.test.framework.JerseyTest.getDefaultTestContainerFactory(JerseyTest.java:406)
at com.sun.jersey.test.framework.JerseyTest.getTestContainerFactory(JerseyTest.java:273)
at com.sun.jersey.test.framework.JerseyTest.<init>(JerseyTest.java:217)
at org.apache.hadoop.yarn.server.nodemanager.webapp.TestNMWebServicesContainers.<init>(TestNMWebServicesContainers.java:171)
FAILED: org.apache.hadoop.yarn.server.nodemanager.webapp.TestNMWebServicesContainers.testNodeContainerXML
Error Message:
The default test container factory, null, could not be instantiated
Stack Trace:
com.sun.jersey.test.framework.spi.container.TestContainerException: The default test container factory, null, could not be instantiated
at com.sun.jersey.test.framework.JerseyTest.getDefaultTestContainerFactory(JerseyTest.java:406)
at com.sun.jersey.test.framework.JerseyTest.getTestContainerFactory(JerseyTest.java:273)
at com.sun.jersey.test.framework.JerseyTest.<init>(JerseyTest.java:217)
at org.apache.hadoop.yarn.server.nodemanager.webapp.TestNMWebServicesContainers.<init>(TestNMWebServicesContainers.java:171)