You are viewing a plain text version of this content. The canonical link for it is here.
Posted to builds@beam.apache.org by Apache Jenkins Server <je...@builds.apache.org> on 2023/04/26 17:07:10 UTC
Build failed in Jenkins: beam_PostCommit_Java_VR_Dataflow_V2 #3646
See <https://ci-beam.apache.org/job/beam_PostCommit_Java_VR_Dataflow_V2/3646/display/redirect>
Changes:
------------------------------------------
[...truncated 57.58 KB...]
> Task :release:go-licenses:java:dockerRun
go: downloading google.golang.org/grpc v1.52.3
go: downloading github.com/golang/protobuf v1.5.2
go: downloading golang.org/x/sys v0.5.0
go: downloading google.golang.org/protobuf v1.28.1
go: downloading google.golang.org/genproto v0.0.0-20230110181048-76db0878b65f
> Task :runners:google-cloud-dataflow-java:compileTestJava FROM-CACHE
> Task :runners:google-cloud-dataflow-java:testClasses UP-TO-DATE
> Task :runners:google-cloud-dataflow-java:testJar
> Task :sdks:java:container:pullLicenses
INFO:root:Pulling license for 124 dependencies using 16 threads.
INFO:root:Replaced local file URL with file://<https://ci-beam.apache.org/job/beam_PostCommit_Java_VR_Dataflow_V2/ws/src/sdks/java/container/license_scripts/manual_licenses/xz/COPYING> for xz-1.5
> Task :release:go-licenses:java:dockerRun
go: downloading golang.org/x/text v0.7.0
go: added github.com/apache/beam/sdks/v2 v2.46.0
go: added github.com/golang/protobuf v1.5.2
go: added golang.org/x/net v0.5.0
go: added golang.org/x/sys v0.5.0
go: added golang.org/x/text v0.7.0
go: added google.golang.org/genproto v0.0.0-20230110181048-76db0878b65f
go: added google.golang.org/grpc v1.52.3
go: added google.golang.org/protobuf v1.28.1
+ go-licenses save github.com/apache/beam/sdks/v2/java/container --save_path=/output/licenses
W0426 12:51:10.048617 38 library.go:101] "golang.org/x/sys/unix" contains non-Go code that can't be inspected for further dependencies:
/go/pkg/mod/golang.org/x/sys@v0.5.0/unix/asm_linux_amd64.s
+ go-licenses csv github.com/apache/beam/sdks/v2/java/container
+ tee /output/licenses/list.csv
W0426 12:51:14.439057 83 library.go:101] "golang.org/x/sys/unix" contains non-Go code that can't be inspected for further dependencies:
/go/pkg/mod/golang.org/x/sys@v0.5.0/unix/asm_linux_amd64.s
+ chmod -R a+w /output/licenses
> Task :release:go-licenses:java:createLicenses
> Task :sdks:java:container:java8:copyGolangLicenses
> Task :sdks:java:container:pullLicenses
INFO:root:pull_licenses_java.py succeed. It took 23.271216 seconds with 16 threads.
Copying licenses from <https://ci-beam.apache.org/job/beam_PostCommit_Java_VR_Dataflow_V2/ws/src/sdks/java/container/build/target/java_third_party_licenses> to <https://ci-beam.apache.org/job/beam_PostCommit_Java_VR_Dataflow_V2/ws/src/sdks/java/container/build/target/third_party_licenses.>
Finished license_scripts.sh
> Task :sdks:java:container:goPrepare UP-TO-DATE
> Task :sdks:java:container:java8:copyJavaThirdPartyLicenses
> Task :sdks:java:container:goBuild
/home/jenkins/go/bin/go1.20.2 build -o ./build/target/linux_amd64/boot boot.go boot_test.go pathingjar.go pathingjar_test.go
> Task :sdks:java:container:java8:copySdkHarnessLauncher
Execution optimizations have been disabled for task ':sdks:java:container:java8:copySdkHarnessLauncher' to ensure correctness due to the following reasons:
- Gradle detected a problem with the following location: '<https://ci-beam.apache.org/job/beam_PostCommit_Java_VR_Dataflow_V2/ws/src/sdks/java/container/build/target'.> Reason: Task ':sdks:java:container:java8:copySdkHarnessLauncher' uses this output of task ':sdks:java:container:downloadCloudProfilerAgent' without declaring an explicit or implicit dependency. This can lead to incorrect results being produced, depending on what order the tasks are executed. Please refer to https://docs.gradle.org/7.5.1/userguide/validation_problems.html#implicit_dependency for more details about this problem.
- Gradle detected a problem with the following location: '<https://ci-beam.apache.org/job/beam_PostCommit_Java_VR_Dataflow_V2/ws/src/sdks/java/container/build/target'.> Reason: Task ':sdks:java:container:java8:copySdkHarnessLauncher' uses this output of task ':sdks:java:container:pullLicenses' without declaring an explicit or implicit dependency. This can lead to incorrect results being produced, depending on what order the tasks are executed. Please refer to https://docs.gradle.org/7.5.1/userguide/validation_problems.html#implicit_dependency for more details about this problem.
> Task :sdks:java:container:java8:dockerPrepare
> Task :sdks:java:container:java8:docker
#1 [internal] load build definition from Dockerfile
#1 transferring dockerfile: 2.58kB done
#1 DONE 0.0s
#2 [internal] load .dockerignore
#2 transferring context: 2B done
#2 DONE 0.0s
#3 [internal] load metadata for docker.io/library/eclipse-temurin:8
#3 DONE 0.4s
#4 [ 1/16] FROM docker.io/library/eclipse-temurin:8@sha256:1f41c45c94ce6b02640030362ebd29eaec22ccc65c3e42f3c28f5edd5ca2aab8
#4 resolve docker.io/library/eclipse-temurin:8@sha256:1f41c45c94ce6b02640030362ebd29eaec22ccc65c3e42f3c28f5edd5ca2aab8 0.0s done
#4 CACHED
#5 [internal] load build context
#5 transferring context: 46.96MB 0.5s done
#5 DONE 0.5s
#6 [ 2/16] ADD target/slf4j-api.jar /opt/apache/beam/jars/
#6 DONE 2.0s
#7 [ 3/16] ADD target/slf4j-jdk14.jar /opt/apache/beam/jars/
#7 DONE 0.2s
#8 [ 4/16] ADD target/jcl-over-slf4j.jar /opt/apache/beam/jars/
#8 DONE 0.1s
#9 [ 5/16] ADD target/log4j-over-slf4j.jar /opt/apache/beam/jars/
#9 DONE 0.1s
#10 [ 6/16] ADD target/log4j-to-slf4j.jar /opt/apache/beam/jars/
#10 DONE 0.0s
#11 [ 7/16] ADD target/beam-sdks-java-harness.jar /opt/apache/beam/jars/
#11 DONE 0.1s
#12 [ 8/16] COPY target/jamm.jar target/open-module-agent*.jar /opt/apache/beam/jars/
#12 DONE 0.1s
#13 [ 9/16] COPY target/linux_amd64/boot /opt/apache/beam/
#13 DONE 0.2s
#14 [10/16] COPY target/LICENSE /opt/apache/beam/
#14 DONE 0.1s
#15 [11/16] COPY target/NOTICE /opt/apache/beam/
#15 DONE 0.1s
#16 [12/16] ADD target/third_party_licenses /opt/apache/beam/third_party_licenses/
#16 DONE 0.2s
#17 [13/16] COPY target/LICENSE target/options/* /opt/apache/beam/options/
#17 DONE 0.1s
#18 [14/16] COPY target/go-licenses/* /opt/apache/beam/third_party_licenses/golang/
#18 DONE 0.1s
#19 [15/16] RUN if [ "true" = "false" ] ; then rm -rf /opt/apache/beam/third_party_licenses ; fi
#19 DONE 0.3s
#20 [16/16] COPY target/profiler/* /opt/google_cloud_profiler/
#20 DONE 0.1s
#21 exporting to image
#21 exporting layers
#21 exporting layers 0.3s done
#21 writing image sha256:1105b864d1fab08be9d0291860176fa34e45660665d15557ba010543199cdcc4 done
#21 naming to docker.io/apache/beam_java8_sdk:2.48.0.dev done
#21 DONE 0.3s
> Task :runners:google-cloud-dataflow-java:buildAndPushDockerJavaContainer
WARNING: `gcloud docker` will not be supported for Docker client versions above 18.03.
As an alternative, use `gcloud auth configure-docker` to configure `docker` to
use `gcloud` as a credential helper, then use `docker` as you would for non-GCR
registries, e.g. `docker pull gcr.io/project-id/my-image`. Add
`--verbosity=error` to silence this warning: `gcloud docker
--verbosity=error -- pull gcr.io/project-id/my-image`.
See: https://cloud.google.com/container-registry/docs/support/deprecation-notices#gcloud-docker
The push refers to repository [us.gcr.io/apache-beam-testing/java-postcommit-it/java]
ae1a75e1ace2: Preparing
5f70bf18a086: Preparing
9a442d31644f: Preparing
349de1740e60: Preparing
8b9c78b87464: Preparing
b2b49bc31c49: Preparing
384c2d3b2316: Preparing
eef1a967f8f9: Preparing
ba52ebb375a9: Preparing
c3451aaf8bdd: Preparing
614605b4d35c: Preparing
d5c9faef815f: Preparing
21c091ddeb3f: Preparing
c900184487f6: Preparing
fe2b9ceec310: Preparing
533af4d05d89: Preparing
d09fdd9ad3ef: Preparing
04d1dcab20cb: Preparing
b93c1bd012ab: Preparing
eef1a967f8f9: Waiting
d5c9faef815f: Waiting
ba52ebb375a9: Waiting
21c091ddeb3f: Waiting
c3451aaf8bdd: Waiting
c900184487f6: Waiting
614605b4d35c: Waiting
fe2b9ceec310: Waiting
533af4d05d89: Waiting
b2b49bc31c49: Waiting
384c2d3b2316: Waiting
b93c1bd012ab: Waiting
04d1dcab20cb: Waiting
5f70bf18a086: Layer already exists
349de1740e60: Pushed
b2b49bc31c49: Pushed
9a442d31644f: Pushed
8b9c78b87464: Pushed
ae1a75e1ace2: Pushed
384c2d3b2316: Pushed
ba52ebb375a9: Pushed
614605b4d35c: Pushed
c3451aaf8bdd: Pushed
d5c9faef815f: Pushed
eef1a967f8f9: Pushed
533af4d05d89: Layer already exists
d09fdd9ad3ef: Layer already exists
04d1dcab20cb: Layer already exists
21c091ddeb3f: Pushed
b93c1bd012ab: Layer already exists
c900184487f6: Pushed
fe2b9ceec310: Pushed
20230426125046: digest: sha256:f0e7a52b1de132e2c2067da61f9eda7a7dceb05fef9c70115f339a71262d1d2a size: 4296
> Task :runners:google-cloud-dataflow-java:validatesRunnerV2Test
org.apache.beam.sdk.transforms.ViewTest > testWindowedIterableSideInput FAILED
java.lang.RuntimeException at ViewTest.java:488
org.apache.beam.sdk.transforms.ViewTest > testWindowedMultimapAsEntrySetSideInput FAILED
java.lang.RuntimeException at ViewTest.java:793
220 tests completed, 2 failed, 1 skipped
> Task :runners:google-cloud-dataflow-java:validatesRunnerV2Test FAILED
FAILURE: Build failed with an exception.
* What went wrong:
Execution failed for task ':runners:google-cloud-dataflow-java:validatesRunnerV2Test'.
> There were failing tests. See the report at: file://<https://ci-beam.apache.org/job/beam_PostCommit_Java_VR_Dataflow_V2/ws/src/runners/google-cloud-dataflow-java/build/reports/tests/validatesRunnerV2Test/index.html>
* Try:
> Run with --stacktrace option to get the stack trace.
> Run with --info or --debug option to get more log output.
* Get more help at https://help.gradle.org
Deprecated Gradle features were used in this build, making it incompatible with Gradle 8.0.
You can use '--warning-mode all' to show the individual deprecation warnings and determine if they come from your own scripts or plugins.
See https://docs.gradle.org/7.5.1/userguide/command_line_interface.html#sec:command_line_warnings
Execution optimizations have been disabled for 1 invalid unit(s) of work during this build to ensure correctness.
Please consult deprecation warnings for more details.
BUILD FAILED in 4h 16m 35s
148 actionable tasks: 94 executed, 50 from cache, 4 up-to-date
Build scan background action failed.
java.lang.IllegalArgumentException: com.gradle.enterprise.gradleplugin.internal.extension.a is not an interface
at java.lang.reflect.Proxy$ProxyClassFactory.apply(Proxy.java:590)
at java.lang.reflect.Proxy$ProxyClassFactory.apply(Proxy.java:557)
at java.lang.reflect.WeakCache$Factory.get(WeakCache.java:230)
at java.lang.reflect.WeakCache.get(WeakCache.java:127)
at java.lang.reflect.Proxy.getProxyClass0(Proxy.java:419)
at java.lang.reflect.Proxy.newProxyInstance(Proxy.java:719)
at com.gradle.ProxyFactory$ProxyingInvocationHandler.createLocalProxy(ProxyFactory.java:64)
at com.gradle.ProxyFactory$ProxyingInvocationHandler.lambda$adaptActionArg$1(ProxyFactory.java:59)
at com.gradle.enterprise.gradleplugin.internal.extension.b$3.run(SourceFile:100)
at java.util.concurrent.Executors$RunnableAdapter.call(Executors.java:511)
at java.util.concurrent.FutureTask.run(FutureTask.java:266)
at java.util.concurrent.ThreadPoolExecutor.runWorker(ThreadPoolExecutor.java:1149)
at java.util.concurrent.ThreadPoolExecutor$Worker.run(ThreadPoolExecutor.java:624)
at java.lang.Thread.run(Thread.java:750)
Publishing build scan...
https://gradle.com/s/edbyfuxarxbii
Build step 'Invoke Gradle script' changed build result to FAILURE
Build step 'Invoke Gradle script' marked build as failure
---------------------------------------------------------------------
To unsubscribe, e-mail: builds-unsubscribe@beam.apache.org
For additional commands, e-mail: builds-help@beam.apache.org
Jenkins build is back to normal : beam_PostCommit_Java_VR_Dataflow_V2 #3647
Posted by Apache Jenkins Server <je...@builds.apache.org>.
See <https://ci-beam.apache.org/job/beam_PostCommit_Java_VR_Dataflow_V2/3647/display/redirect?page=changes>
---------------------------------------------------------------------
To unsubscribe, e-mail: builds-unsubscribe@beam.apache.org
For additional commands, e-mail: builds-help@beam.apache.org