You are viewing a plain text version of this content. The canonical link for it is here.
Posted to notification@tuscany.apache.org by Apache Jenkins Server <je...@builds.apache.org> on 2015/08/09 21:00:19 UTC

Build failed in Jenkins: Tuscany-2x #1785

See <https://builds.apache.org/job/Tuscany-2x/1785/>

------------------------------------------
[...truncated 31649 lines...]
	at $Proxy39.echo(Unknown Source)
	at org.apache.tuscany.sca.binding.rest.RESTReferenceTestCase.testInvokeReference(RESTReferenceTestCase.java:61)
	at sun.reflect.NativeMethodAccessorImpl.invoke0(Native Method)
	at sun.reflect.NativeMethodAccessorImpl.invoke(NativeMethodAccessorImpl.java:39)
	at sun.reflect.DelegatingMethodAccessorImpl.invoke(DelegatingMethodAccessorImpl.java:25)
	at java.lang.reflect.Method.invoke(Method.java:597)
	at org.junit.runners.model.FrameworkMethod$1.runReflectiveCall(FrameworkMethod.java:44)
	at org.junit.internal.runners.model.ReflectiveCallable.run(ReflectiveCallable.java:15)
	at org.junit.runners.model.FrameworkMethod.invokeExplosively(FrameworkMethod.java:41)
	at org.junit.internal.runners.statements.InvokeMethod.evaluate(InvokeMethod.java:20)
	at org.junit.internal.runners.statements.RunBefores.evaluate(RunBefores.java:28)
	at org.junit.internal.runners.statements.RunAfters.evaluate(RunAfters.java:31)
	at org.junit.runners.BlockJUnit4ClassRunner.runChild(BlockJUnit4ClassRunner.java:76)
	at org.junit.runners.BlockJUnit4ClassRunner.runChild(BlockJUnit4ClassRunner.java:50)
	at org.junit.runners.ParentRunner$3.run(ParentRunner.java:193)
	at org.junit.runners.ParentRunner$1.schedule(ParentRunner.java:52)
	at org.junit.runners.ParentRunner.runChildren(ParentRunner.java:191)
	at org.junit.runners.ParentRunner.access$000(ParentRunner.java:42)
	at org.junit.runners.ParentRunner$2.evaluate(ParentRunner.java:184)
	at org.junit.runners.ParentRunner.run(ParentRunner.java:236)
	at org.junit.runners.Suite.runChild(Suite.java:128)
	at org.junit.runners.Suite.runChild(Suite.java:24)
	at org.junit.runners.ParentRunner$3.run(ParentRunner.java:193)
	at org.junit.runners.ParentRunner$1.schedule(ParentRunner.java:52)
	at org.junit.runners.ParentRunner.runChildren(ParentRunner.java:191)
	at org.junit.runners.ParentRunner.access$000(ParentRunner.java:42)
	at org.junit.runners.ParentRunner$2.evaluate(ParentRunner.java:184)
	at org.junit.runners.ParentRunner.run(ParentRunner.java:236)
	at org.junit.runner.JUnitCore.run(JUnitCore.java:157)
	at org.junit.runner.JUnitCore.run(JUnitCore.java:136)
	at org.junit.runner.JUnitCore.run(JUnitCore.java:127)
	at org.apache.maven.surefire.junitcore.JUnitCoreTestSet.runJunitCore(JUnitCoreTestSet.java:180)
	at org.apache.maven.surefire.junitcore.JUnitCoreTestSet.execute(JUnitCoreTestSet.java:86)
	at org.apache.maven.surefire.junitcore.JUnitCoreDirectoryTestSuite.execute(JUnitCoreDirectoryTestSuite.java:58)
	at org.apache.maven.surefire.Surefire.run(Surefire.java:180)
	at sun.reflect.NativeMethodAccessorImpl.invoke0(Native Method)
	at sun.reflect.NativeMethodAccessorImpl.invoke(NativeMethodAccessorImpl.java:39)
	at sun.reflect.DelegatingMethodAccessorImpl.invoke(DelegatingMethodAccessorImpl.java:25)
	at java.lang.reflect.Method.invoke(Method.java:597)
	at org.apache.maven.surefire.booter.SurefireBooter.runSuitesInProcess(SurefireBooter.java:350)
	at org.apache.maven.surefire.booter.SurefireBooter.main(SurefireBooter.java:1021)
Caused by: org.apache.tuscany.sca.core.scope.TargetResolutionException: scope container not running, lifecycleState=0
	at org.apache.tuscany.sca.core.scope.impl.StatelessScopeContainer.getWrapper(StatelessScopeContainer.java:42)
	at org.apache.tuscany.sca.implementation.java.invocation.JavaImplementationInvoker.invoke(JavaImplementationInvoker.java:122)
	at org.apache.tuscany.sca.binding.local.LocalSCABindingInvocationInterceptor.invoke(LocalSCABindingInvocationInterceptor.java:48)
	at org.apache.tuscany.sca.core.invocation.InterceptorAsyncImpl.invoke(InterceptorAsyncImpl.java:58)
	at org.apache.tuscany.sca.core.invocation.impl.JDKInvocationHandler.invoke(JDKInvocationHandler.java:351)
	at org.apache.tuscany.sca.core.invocation.impl.JDKInvocationHandler.invoke(JDKInvocationHandler.java:294)
	at org.apache.tuscany.sca.core.invocation.impl.JDKInvocationHandler.invoke(JDKInvocationHandler.java:125)
	at org.apache.tuscany.sca.core.invocation.impl.AsyncJDKInvocationHandler.doInvokeSync(AsyncJDKInvocationHandler.java:238)
	at org.apache.tuscany.sca.core.invocation.impl.AsyncJDKInvocationHandler.invoke(AsyncJDKInvocationHandler.java:157)
	... 41 more

Running org.apache.tuscany.sca.binding.rest.wireformat.binary.BinaryServiceTestCase
Tests run: 2, Failures: 0, Errors: 0, Skipped: 0, Time elapsed: 0.003 sec
Running org.apache.tuscany.sca.binding.rest.RESTBindingTestCase
Tests run: 2, Failures: 0, Errors: 0, Skipped: 0, Time elapsed: 0.003 sec
Running org.apache.tuscany.sca.binding.rest.wireformat.xml.CustomerServiceTestCase
Tests run: 4, Failures: 0, Errors: 0, Skipped: 0, Time elapsed: 0.002 sec

Results :

Tests in error: 
  testInvokeReference(org.apache.tuscany.sca.binding.rest.RESTReferenceTestCase)

Tests run: 58, Failures: 0, Errors: 1, Skipped: 0

[ERROR] There are test failures.

Please refer to <https://builds.apache.org/job/Tuscany-2x/ws/sca-2x/modules/binding-rest-runtime/target/surefire-reports> for the individual test results.
[JENKINS] Recording test results
[INFO] [jar:jar {execution: default-jar}]
[INFO] Building jar: <https://builds.apache.org/job/Tuscany-2x/ws/sca-2x/modules/binding-rest-runtime/target/tuscany-binding-rest-runtime-2.5-SNAPSHOT.jar>
[INFO] [source:jar-no-fork {execution: attach-sources}]
[INFO] Building jar: <https://builds.apache.org/job/Tuscany-2x/ws/sca-2x/modules/binding-rest-runtime/target/tuscany-binding-rest-runtime-2.5-SNAPSHOT-sources.jar>
[INFO] [install:install {execution: default-install}]
[INFO] Installing <https://builds.apache.org/job/Tuscany-2x/ws/sca-2x/modules/binding-rest-runtime/target/tuscany-binding-rest-runtime-2.5-SNAPSHOT.jar> to <https://builds.apache.org/job/Tuscany-2x/ws/.repository/org/apache/tuscany/sca/tuscany-binding-rest-runtime/2.5-SNAPSHOT/tuscany-binding-rest-runtime-2.5-SNAPSHOT.jar>
[INFO] Installing <https://builds.apache.org/job/Tuscany-2x/ws/sca-2x/modules/binding-rest-runtime/target/tuscany-binding-rest-runtime-2.5-SNAPSHOT-sources.jar> to <https://builds.apache.org/job/Tuscany-2x/ws/.repository/org/apache/tuscany/sca/tuscany-binding-rest-runtime/2.5-SNAPSHOT/tuscany-binding-rest-runtime-2.5-SNAPSHOT-sources.jar>
[JENKINS] Archiving disabled
[INFO] ------------------------------------------------------------------------
[INFO] Building Apache Tuscany SCA RMI Host Extension Point
[INFO]    task-segment: [clean, install]
[INFO] ------------------------------------------------------------------------
[INFO] [clean:clean {execution: default-clean}]
[INFO] [enforcer:enforce {execution: enforce-plugin-versions}]
[INFO] [remote-resources:process {execution: default}]
[INFO] [resources:resources {execution: default-resources}]
[INFO] Using 'UTF-8' encoding to copy filtered resources.
[INFO] Copying 1 resource
[INFO] Copying 3 resources
[INFO] Copying 3 resources
[INFO] [compiler:compile {execution: default-compile}]
[INFO] Compiling 8 source files to <https://builds.apache.org/job/Tuscany-2x/ws/sca-2x/modules/host-rmi/target/classes>
[INFO] [resources:testResources {execution: default-testResources}]
[INFO] Using 'UTF-8' encoding to copy filtered resources.
[INFO] skip non existing resourceDirectory <https://builds.apache.org/job/Tuscany-2x/ws/sca-2x/modules/host-rmi/src/test/resources>
[INFO] Copying 3 resources
[INFO] [compiler:testCompile {execution: default-testCompile}]
[INFO] Compiling 1 source file to <https://builds.apache.org/job/Tuscany-2x/ws/sca-2x/modules/host-rmi/target/test-classes>
[INFO] [surefire:test {execution: default-test}]
[INFO] Surefire report directory: <https://builds.apache.org/job/Tuscany-2x/ws/sca-2x/modules/host-rmi/target/surefire-reports>

-------------------------------------------------------
 T E S T S
-------------------------------------------------------
Running org.apache.tuscany.sca.host.rmi.RMIHostImplTestCase
Aug 9, 2015 6:58:40 PM org.apache.tuscany.sca.host.rmi.DefaultRMIHost registerService
INFO: RMI service registered: rmi://localhost:9996/foo1
Aug 9, 2015 6:58:40 PM org.apache.tuscany.sca.host.rmi.DefaultRMIHost unregisterService
INFO: RMI service unregistered: rmi://localhost:9996/foo1
Aug 9, 2015 6:58:40 PM org.apache.tuscany.sca.host.rmi.DefaultRMIHost registerService
INFO: RMI service registered: rmi://localhost:9995/foo1
Aug 9, 2015 6:58:40 PM org.apache.tuscany.sca.host.rmi.DefaultRMIHost registerService
INFO: RMI service registered: rmi://localhost:9995/foo2
Aug 9, 2015 6:58:40 PM org.apache.tuscany.sca.host.rmi.DefaultRMIHost unregisterService
INFO: RMI service unregistered: rmi://localhost:9995/foo1
Aug 9, 2015 6:58:40 PM org.apache.tuscany.sca.host.rmi.DefaultRMIHost unregisterService
INFO: RMI service unregistered: rmi://localhost:9995/foo2
Aug 9, 2015 6:58:40 PM org.apache.tuscany.sca.host.rmi.DefaultRMIHost registerService
INFO: RMI service registered: rmi://localhost:9999/bar1
Aug 9, 2015 6:58:40 PM org.apache.tuscany.sca.host.rmi.DefaultRMIHost unregisterService
INFO: RMI service unregistered: rmi://localhost:9999/bar1
Aug 9, 2015 6:58:40 PM org.apache.tuscany.sca.host.rmi.DefaultRMIHost registerService
INFO: RMI service registered: rmi://localhost:9997/bar2
Aug 9, 2015 6:58:40 PM org.apache.tuscany.sca.host.rmi.DefaultRMIHost unregisterService
INFO: RMI service unregistered: rmi://localhost:9997/bar2
Tests run: 7, Failures: 0, Errors: 0, Skipped: 0, Time elapsed: 127.469 sec

Results :

Tests run: 7, Failures: 0, Errors: 0, Skipped: 0

[JENKINS] Recording test results
[INFO] [jar:jar {execution: default-jar}]
[INFO] Building jar: <https://builds.apache.org/job/Tuscany-2x/ws/sca-2x/modules/host-rmi/target/tuscany-host-rmi-2.5-SNAPSHOT.jar>
[INFO] [source:jar-no-fork {execution: attach-sources}]
[INFO] Building jar: <https://builds.apache.org/job/Tuscany-2x/ws/sca-2x/modules/host-rmi/target/tuscany-host-rmi-2.5-SNAPSHOT-sources.jar>
[INFO] [install:install {execution: default-install}]
[INFO] Installing <https://builds.apache.org/job/Tuscany-2x/ws/sca-2x/modules/host-rmi/target/tuscany-host-rmi-2.5-SNAPSHOT.jar> to <https://builds.apache.org/job/Tuscany-2x/ws/.repository/org/apache/tuscany/sca/tuscany-host-rmi/2.5-SNAPSHOT/tuscany-host-rmi-2.5-SNAPSHOT.jar>
[INFO] Installing <https://builds.apache.org/job/Tuscany-2x/ws/sca-2x/modules/host-rmi/target/tuscany-host-rmi-2.5-SNAPSHOT-sources.jar> to <https://builds.apache.org/job/Tuscany-2x/ws/.repository/org/apache/tuscany/sca/tuscany-host-rmi/2.5-SNAPSHOT/tuscany-host-rmi-2.5-SNAPSHOT-sources.jar>
[JENKINS] Archiving disabled
[INFO] ------------------------------------------------------------------------
[INFO] Building Apache Tuscany SCA RMI Binding Extension
[INFO]    task-segment: [clean, install]
[INFO] ------------------------------------------------------------------------
[INFO] [clean:clean {execution: default-clean}]
[INFO] [enforcer:enforce {execution: enforce-plugin-versions}]
[INFO] [remote-resources:process {execution: default}]
[INFO] [resources:resources {execution: default-resources}]
[INFO] Using 'UTF-8' encoding to copy filtered resources.
[INFO] Copying 1 resource
[INFO] Copying 3 resources
[INFO] Copying 3 resources
[INFO] [compiler:compile {execution: default-compile}]
[INFO] Compiling 5 source files to <https://builds.apache.org/job/Tuscany-2x/ws/sca-2x/modules/binding-rmi-runtime/target/classes>
[INFO] [resources:testResources {execution: default-testResources}]
[INFO] Using 'UTF-8' encoding to copy filtered resources.
[INFO] Copying 3 resources
[INFO] Copying 3 resources
[INFO] [compiler:testCompile {execution: default-testCompile}]
[INFO] Compiling 6 source files to <https://builds.apache.org/job/Tuscany-2x/ws/sca-2x/modules/binding-rmi-runtime/target/test-classes>
[INFO] [surefire:test {execution: default-test}]
[INFO] Surefire report directory: <https://builds.apache.org/job/Tuscany-2x/ws/sca-2x/modules/binding-rmi-runtime/target/surefire-reports>

-------------------------------------------------------
 T E S T S
-------------------------------------------------------
Running org.apache.tuscany.sca.binding.rmi.BindingTestCase
Aug 9, 2015 6:58:45 PM org.apache.tuscany.sca.node.impl.NodeImpl start
INFO: Starting node: http://tuscany.apache.org/sca/1.1/nodes/default0 domain: default
Aug 9, 2015 6:58:45 PM org.apache.tuscany.sca.node.impl.NodeFactoryImpl loadContributions
INFO: Loading contribution: <https://builds.apache.org/job/Tuscany-2x/ws/sca-2x/modules/binding-rmi-runtime/target/test-classes/>
Aug 9, 2015 6:58:46 PM org.apache.tuscany.sca.host.rmi.DefaultRMIHost registerService
INFO: RMI service registered: rmi://localhost:8099/HelloWorldRemoteService
Aug 9, 2015 6:58:46 PM org.apache.tuscany.sca.core.assembly.impl.DomainRegistryImpl addEndpoint
INFO: Add endpoint - binding.rmi - rmi://localhost:8099/HelloWorldRemoteService
Aug 9, 2015 6:58:46 PM org.apache.tuscany.sca.core.assembly.impl.DomainRegistryImpl addEndpoint
INFO: Add endpoint - binding.sca - HelloWorldRmiServiceComponent/HelloWorldRmiService
Hello from the RMI Service to - Tuscany World! thro the RMI Reference
Hi from Apache World in RMI Service to - Tuscany World! thro the RMI Reference
Expected exception :helloworld.HelloException
Aug 9, 2015 6:58:46 PM org.apache.tuscany.sca.node.impl.NodeImpl stop
INFO: Stopping node: http://tuscany.apache.org/sca/1.1/nodes/default0
Aug 9, 2015 6:58:46 PM org.apache.tuscany.sca.core.assembly.impl.DomainRegistryImpl removeEndpoint
INFO: Remove endpoint - binding.rmi - rmi://localhost:8099/HelloWorldRemoteService
Aug 9, 2015 6:58:46 PM org.apache.tuscany.sca.host.rmi.DefaultRMIHost unregisterService
INFO: RMI service unregistered: rmi://localhost:8099/HelloWorldRemoteService
Aug 9, 2015 6:58:46 PM org.apache.tuscany.sca.core.assembly.impl.DomainRegistryImpl removeEndpoint
INFO: Remove endpoint - binding.sca - HelloWorldRmiServiceComponent/HelloWorldRmiService
Tests run: 1, Failures: 0, Errors: 0, Skipped: 0, Time elapsed: 1.387 sec

Results :

Tests run: 1, Failures: 0, Errors: 0, Skipped: 0

[JENKINS] Recording test results
[INFO] [jar:jar {execution: default-jar}]
[INFO] Building jar: <https://builds.apache.org/job/Tuscany-2x/ws/sca-2x/modules/binding-rmi-runtime/target/tuscany-binding-rmi-runtime-2.5-SNAPSHOT.jar>
[INFO] [source:jar-no-fork {execution: attach-sources}]
[INFO] Building jar: <https://builds.apache.org/job/Tuscany-2x/ws/sca-2x/modules/binding-rmi-runtime/target/tuscany-binding-rmi-runtime-2.5-SNAPSHOT-sources.jar>
[INFO] [install:install {execution: default-install}]
[INFO] Installing <https://builds.apache.org/job/Tuscany-2x/ws/sca-2x/modules/binding-rmi-runtime/target/tuscany-binding-rmi-runtime-2.5-SNAPSHOT.jar> to <https://builds.apache.org/job/Tuscany-2x/ws/.repository/org/apache/tuscany/sca/tuscany-binding-rmi-runtime/2.5-SNAPSHOT/tuscany-binding-rmi-runtime-2.5-SNAPSHOT.jar>
[INFO] Installing <https://builds.apache.org/job/Tuscany-2x/ws/sca-2x/modules/binding-rmi-runtime/target/tuscany-binding-rmi-runtime-2.5-SNAPSHOT-sources.jar> to <https://builds.apache.org/job/Tuscany-2x/ws/.repository/org/apache/tuscany/sca/tuscany-binding-rmi-runtime/2.5-SNAPSHOT/tuscany-binding-rmi-runtime-2.5-SNAPSHOT-sources.jar>
[JENKINS] Archiving disabled
[INFO] ------------------------------------------------------------------------
[INFO] Building Apache Tuscany SCA Websocket Binding Extension
[INFO]    task-segment: [clean, install]
[INFO] ------------------------------------------------------------------------
[INFO] [clean:clean {execution: default-clean}]
Downloading: http://svn.apache.org/repos/asf/tuscany/maven/org/eclipse/jetty/jetty-websocket/8.0.1.v20110908/jetty-websocket-8.0.1.v20110908.pom
[INFO] Unable to find resource 'org.eclipse.jetty:jetty-websocket:pom:8.0.1.v20110908' in repository tuscany.repo (http://svn.apache.org/repos/asf/tuscany/maven)
Downloading: https://repository.apache.org/content/groups/public//org/eclipse/jetty/jetty-websocket/8.0.1.v20110908/jetty-websocket-8.0.1.v20110908.pom
[WARNING] Unable to get resource 'org.eclipse.jetty:jetty-websocket:pom:8.0.1.v20110908' from repository apache.nexus (https://repository.apache.org/content/groups/public/): Error transferring file: java.lang.RuntimeException: Could not generate DH keypair
Downloading: http://repo1.maven.org/maven2/org/eclipse/jetty/jetty-websocket/8.0.1.v20110908/jetty-websocket-8.0.1.v20110908.pom
3K downloaded  (jetty-websocket-8.0.1.v20110908.pom)
Downloading: http://svn.apache.org/repos/asf/tuscany/maven/org/eclipse/jetty/jetty-project/8.0.1.v20110908/jetty-project-8.0.1.v20110908.pom
[INFO] Unable to find resource 'org.eclipse.jetty:jetty-project:pom:8.0.1.v20110908' in repository tuscany.repo (http://svn.apache.org/repos/asf/tuscany/maven)
Downloading: https://repository.apache.org/content/groups/public//org/eclipse/jetty/jetty-project/8.0.1.v20110908/jetty-project-8.0.1.v20110908.pom
[WARNING] Unable to get resource 'org.eclipse.jetty:jetty-project:pom:8.0.1.v20110908' from repository apache.nexus (https://repository.apache.org/content/groups/public/): Error transferring file: java.lang.RuntimeException: Could not generate DH keypair
Downloading: http://repo1.maven.org/maven2/org/eclipse/jetty/jetty-project/8.0.1.v20110908/jetty-project-8.0.1.v20110908.pom
21K downloaded  (jetty-project-8.0.1.v20110908.pom)
Downloading: http://oss.sonatype.org/content/groups/jetty/org/eclipse/jetty/jetty-parent/18/jetty-parent-18.pom
178b downloaded  (jetty-parent-18.pom)
[WARNING] *** CHECKSUM FAILED - Checksum failed on download: local = '81ffbd1712afe8cdf138b570c0fc9934742c33c1'; remote = '<html>
<head><title>301' - RETRYING
Downloading: http://oss.sonatype.org/content/groups/jetty/org/eclipse/jetty/jetty-parent/18/jetty-parent-18.pom
178b downloaded  (jetty-parent-18.pom)
[WARNING] *** CHECKSUM FAILED - Checksum failed on download: local = '81ffbd1712afe8cdf138b570c0fc9934742c33c1'; remote = '<html>
<head><title>301' - IGNORING
[JENKINS] Archiving disabled
[INFO] ------------------------------------------------------------------------
[ERROR] BUILD ERROR
[INFO] ------------------------------------------------------------------------
[INFO] Error building POM (may not be this project's POM).


Project ID: org.eclipse.jetty:jetty-project:pom:8.0.1.v20110908

Reason: Cannot find parent: org.eclipse.jetty:jetty-parent for project: org.eclipse.jetty:jetty-project:pom:8.0.1.v20110908 for project org.eclipse.jetty:jetty-project:pom:8.0.1.v20110908


[INFO] ------------------------------------------------------------------------
[INFO] For more information, run Maven with the -e switch
[INFO] ------------------------------------------------------------------------
[INFO] Total time: 11 minutes 25 seconds
[INFO] Finished at: Sun Aug 09 18:58:49 UTC 2015
[INFO] Final Memory: 287M/977M
[INFO] ------------------------------------------------------------------------
channel stopped

Build failed in Jenkins: Tuscany-2x #1795

Posted by Apache Jenkins Server <je...@builds.apache.org>.
See <https://builds.apache.org/job/Tuscany-2x/1795/>

------------------------------------------
[...truncated 31715 lines...]
	at org.apache.tuscany.sca.binding.rest.RESTReferenceTestCase.testInvokeReference(RESTReferenceTestCase.java:61)
	at sun.reflect.NativeMethodAccessorImpl.invoke0(Native Method)
	at sun.reflect.NativeMethodAccessorImpl.invoke(NativeMethodAccessorImpl.java:39)
	at sun.reflect.DelegatingMethodAccessorImpl.invoke(DelegatingMethodAccessorImpl.java:25)
	at java.lang.reflect.Method.invoke(Method.java:597)
	at org.junit.runners.model.FrameworkMethod$1.runReflectiveCall(FrameworkMethod.java:44)
	at org.junit.internal.runners.model.ReflectiveCallable.run(ReflectiveCallable.java:15)
	at org.junit.runners.model.FrameworkMethod.invokeExplosively(FrameworkMethod.java:41)
	at org.junit.internal.runners.statements.InvokeMethod.evaluate(InvokeMethod.java:20)
	at org.junit.internal.runners.statements.RunBefores.evaluate(RunBefores.java:28)
	at org.junit.internal.runners.statements.RunAfters.evaluate(RunAfters.java:31)
	at org.junit.runners.BlockJUnit4ClassRunner.runChild(BlockJUnit4ClassRunner.java:76)
	at org.junit.runners.BlockJUnit4ClassRunner.runChild(BlockJUnit4ClassRunner.java:50)
	at org.junit.runners.ParentRunner$3.run(ParentRunner.java:193)
	at org.junit.runners.ParentRunner$1.schedule(ParentRunner.java:52)
	at org.junit.runners.ParentRunner.runChildren(ParentRunner.java:191)
	at org.junit.runners.ParentRunner.access$000(ParentRunner.java:42)
	at org.junit.runners.ParentRunner$2.evaluate(ParentRunner.java:184)
	at org.junit.runners.ParentRunner.run(ParentRunner.java:236)
	at org.junit.runners.Suite.runChild(Suite.java:128)
	at org.junit.runners.Suite.runChild(Suite.java:24)
	at org.junit.runners.ParentRunner$3.run(ParentRunner.java:193)
	at org.junit.runners.ParentRunner$1.schedule(ParentRunner.java:52)
	at org.junit.runners.ParentRunner.runChildren(ParentRunner.java:191)
	at org.junit.runners.ParentRunner.access$000(ParentRunner.java:42)
	at org.junit.runners.ParentRunner$2.evaluate(ParentRunner.java:184)
	at org.junit.runners.ParentRunner.run(ParentRunner.java:236)
	at org.junit.runner.JUnitCore.run(JUnitCore.java:157)
	at org.junit.runner.JUnitCore.run(JUnitCore.java:136)
	at org.junit.runner.JUnitCore.run(JUnitCore.java:127)
	at org.apache.maven.surefire.junitcore.JUnitCoreTestSet.runJunitCore(JUnitCoreTestSet.java:180)
	at org.apache.maven.surefire.junitcore.JUnitCoreTestSet.execute(JUnitCoreTestSet.java:86)
	at org.apache.maven.surefire.junitcore.JUnitCoreDirectoryTestSuite.execute(JUnitCoreDirectoryTestSuite.java:58)
	at org.apache.maven.surefire.Surefire.run(Surefire.java:180)
	at sun.reflect.NativeMethodAccessorImpl.invoke0(Native Method)
	at sun.reflect.NativeMethodAccessorImpl.invoke(NativeMethodAccessorImpl.java:39)
	at sun.reflect.DelegatingMethodAccessorImpl.invoke(DelegatingMethodAccessorImpl.java:25)
	at java.lang.reflect.Method.invoke(Method.java:597)
	at org.apache.maven.surefire.booter.SurefireBooter.runSuitesInProcess(SurefireBooter.java:350)
	at org.apache.maven.surefire.booter.SurefireBooter.main(SurefireBooter.java:1021)
Caused by: org.apache.tuscany.sca.core.scope.TargetResolutionException: scope container not running, lifecycleState=0
	at org.apache.tuscany.sca.core.scope.impl.StatelessScopeContainer.getWrapper(StatelessScopeContainer.java:42)
	at org.apache.tuscany.sca.implementation.java.invocation.JavaImplementationInvoker.invoke(JavaImplementationInvoker.java:122)
	at org.apache.tuscany.sca.binding.local.LocalSCABindingInvocationInterceptor.invoke(LocalSCABindingInvocationInterceptor.java:48)
	at org.apache.tuscany.sca.core.invocation.InterceptorAsyncImpl.invoke(InterceptorAsyncImpl.java:58)
	at org.apache.tuscany.sca.core.invocation.impl.JDKInvocationHandler.invoke(JDKInvocationHandler.java:351)
	at org.apache.tuscany.sca.core.invocation.impl.JDKInvocationHandler.invoke(JDKInvocationHandler.java:294)
	at org.apache.tuscany.sca.core.invocation.impl.JDKInvocationHandler.invoke(JDKInvocationHandler.java:125)
	at org.apache.tuscany.sca.core.invocation.impl.AsyncJDKInvocationHandler.doInvokeSync(AsyncJDKInvocationHandler.java:238)
	at org.apache.tuscany.sca.core.invocation.impl.AsyncJDKInvocationHandler.invoke(AsyncJDKInvocationHandler.java:157)
	... 41 more

Running org.apache.tuscany.sca.binding.rest.wireformat.binary.BinaryServiceTestCase
Tests run: 2, Failures: 0, Errors: 0, Skipped: 0, Time elapsed: 0.003 sec
Running org.apache.tuscany.sca.binding.rest.RESTBindingTestCase
Tests run: 2, Failures: 0, Errors: 0, Skipped: 0, Time elapsed: 0.003 sec
Running org.apache.tuscany.sca.binding.rest.wireformat.xml.CustomerServiceTestCase
Tests run: 4, Failures: 0, Errors: 0, Skipped: 0, Time elapsed: 0.002 sec

Results :

Tests in error: 
  testInvokeReference(org.apache.tuscany.sca.binding.rest.RESTReferenceTestCase)

Tests run: 58, Failures: 0, Errors: 1, Skipped: 0

[ERROR] There are test failures.

Please refer to <https://builds.apache.org/job/Tuscany-2x/ws/sca-2x/modules/binding-rest-runtime/target/surefire-reports> for the individual test results.
[JENKINS] Recording test results
[INFO] [jar:jar {execution: default-jar}]
[INFO] Building jar: <https://builds.apache.org/job/Tuscany-2x/ws/sca-2x/modules/binding-rest-runtime/target/tuscany-binding-rest-runtime-2.5-SNAPSHOT.jar>
[INFO] [source:jar-no-fork {execution: attach-sources}]
[INFO] Building jar: <https://builds.apache.org/job/Tuscany-2x/ws/sca-2x/modules/binding-rest-runtime/target/tuscany-binding-rest-runtime-2.5-SNAPSHOT-sources.jar>
[INFO] [install:install {execution: default-install}]
[INFO] Installing <https://builds.apache.org/job/Tuscany-2x/ws/sca-2x/modules/binding-rest-runtime/target/tuscany-binding-rest-runtime-2.5-SNAPSHOT.jar> to <https://builds.apache.org/job/Tuscany-2x/ws/.repository/org/apache/tuscany/sca/tuscany-binding-rest-runtime/2.5-SNAPSHOT/tuscany-binding-rest-runtime-2.5-SNAPSHOT.jar>
[INFO] Installing <https://builds.apache.org/job/Tuscany-2x/ws/sca-2x/modules/binding-rest-runtime/target/tuscany-binding-rest-runtime-2.5-SNAPSHOT-sources.jar> to <https://builds.apache.org/job/Tuscany-2x/ws/.repository/org/apache/tuscany/sca/tuscany-binding-rest-runtime/2.5-SNAPSHOT/tuscany-binding-rest-runtime-2.5-SNAPSHOT-sources.jar>
[JENKINS] Archiving disabled
[INFO] ------------------------------------------------------------------------
[INFO] Building Apache Tuscany SCA RMI Host Extension Point
[INFO]    task-segment: [clean, install]
[INFO] ------------------------------------------------------------------------
[INFO] [clean:clean {execution: default-clean}]
[INFO] [enforcer:enforce {execution: enforce-plugin-versions}]
[INFO] [remote-resources:process {execution: default}]
[INFO] [resources:resources {execution: default-resources}]
[INFO] Using 'UTF-8' encoding to copy filtered resources.
[INFO] Copying 1 resource
[INFO] Copying 3 resources
[INFO] Copying 3 resources
[INFO] [compiler:compile {execution: default-compile}]
[INFO] Compiling 8 source files to <https://builds.apache.org/job/Tuscany-2x/ws/sca-2x/modules/host-rmi/target/classes>
[INFO] [resources:testResources {execution: default-testResources}]
[INFO] Using 'UTF-8' encoding to copy filtered resources.
[INFO] skip non existing resourceDirectory <https://builds.apache.org/job/Tuscany-2x/ws/sca-2x/modules/host-rmi/src/test/resources>
[INFO] Copying 3 resources
[INFO] [compiler:testCompile {execution: default-testCompile}]
[INFO] Compiling 1 source file to <https://builds.apache.org/job/Tuscany-2x/ws/sca-2x/modules/host-rmi/target/test-classes>
[INFO] [surefire:test {execution: default-test}]
[INFO] Surefire report directory: <https://builds.apache.org/job/Tuscany-2x/ws/sca-2x/modules/host-rmi/target/surefire-reports>

-------------------------------------------------------
 T E S T S
-------------------------------------------------------
Running org.apache.tuscany.sca.host.rmi.RMIHostImplTestCase
Aug 19, 2015 8:53:18 PM org.apache.tuscany.sca.host.rmi.DefaultRMIHost registerService
INFO: RMI service registered: rmi://localhost:9996/foo1
Aug 19, 2015 8:53:18 PM org.apache.tuscany.sca.host.rmi.DefaultRMIHost unregisterService
INFO: RMI service unregistered: rmi://localhost:9996/foo1
Aug 19, 2015 8:53:18 PM org.apache.tuscany.sca.host.rmi.DefaultRMIHost registerService
INFO: RMI service registered: rmi://localhost:9995/foo1
Aug 19, 2015 8:53:18 PM org.apache.tuscany.sca.host.rmi.DefaultRMIHost registerService
INFO: RMI service registered: rmi://localhost:9995/foo2
Aug 19, 2015 8:53:18 PM org.apache.tuscany.sca.host.rmi.DefaultRMIHost unregisterService
INFO: RMI service unregistered: rmi://localhost:9995/foo1
Aug 19, 2015 8:53:18 PM org.apache.tuscany.sca.host.rmi.DefaultRMIHost unregisterService
INFO: RMI service unregistered: rmi://localhost:9995/foo2
Aug 19, 2015 8:53:19 PM org.apache.tuscany.sca.host.rmi.DefaultRMIHost registerService
INFO: RMI service registered: rmi://localhost:9999/bar1
Aug 19, 2015 8:53:19 PM org.apache.tuscany.sca.host.rmi.DefaultRMIHost unregisterService
INFO: RMI service unregistered: rmi://localhost:9999/bar1
Aug 19, 2015 8:53:19 PM org.apache.tuscany.sca.host.rmi.DefaultRMIHost registerService
INFO: RMI service registered: rmi://localhost:9997/bar2
Aug 19, 2015 8:53:19 PM org.apache.tuscany.sca.host.rmi.DefaultRMIHost unregisterService
INFO: RMI service unregistered: rmi://localhost:9997/bar2
Tests run: 7, Failures: 0, Errors: 0, Skipped: 0, Time elapsed: 127.673 sec

Results :

Tests run: 7, Failures: 0, Errors: 0, Skipped: 0

[JENKINS] Recording test results
[INFO] [jar:jar {execution: default-jar}]
[INFO] Building jar: <https://builds.apache.org/job/Tuscany-2x/ws/sca-2x/modules/host-rmi/target/tuscany-host-rmi-2.5-SNAPSHOT.jar>
[INFO] [source:jar-no-fork {execution: attach-sources}]
[INFO] Building jar: <https://builds.apache.org/job/Tuscany-2x/ws/sca-2x/modules/host-rmi/target/tuscany-host-rmi-2.5-SNAPSHOT-sources.jar>
[INFO] [install:install {execution: default-install}]
[INFO] Installing <https://builds.apache.org/job/Tuscany-2x/ws/sca-2x/modules/host-rmi/target/tuscany-host-rmi-2.5-SNAPSHOT.jar> to <https://builds.apache.org/job/Tuscany-2x/ws/.repository/org/apache/tuscany/sca/tuscany-host-rmi/2.5-SNAPSHOT/tuscany-host-rmi-2.5-SNAPSHOT.jar>
[INFO] Installing <https://builds.apache.org/job/Tuscany-2x/ws/sca-2x/modules/host-rmi/target/tuscany-host-rmi-2.5-SNAPSHOT-sources.jar> to <https://builds.apache.org/job/Tuscany-2x/ws/.repository/org/apache/tuscany/sca/tuscany-host-rmi/2.5-SNAPSHOT/tuscany-host-rmi-2.5-SNAPSHOT-sources.jar>
[JENKINS] Archiving disabled
[INFO] ------------------------------------------------------------------------
[INFO] Building Apache Tuscany SCA RMI Binding Extension
[INFO]    task-segment: [clean, install]
[INFO] ------------------------------------------------------------------------
[INFO] [clean:clean {execution: default-clean}]
[INFO] [enforcer:enforce {execution: enforce-plugin-versions}]
[INFO] [remote-resources:process {execution: default}]
[INFO] [resources:resources {execution: default-resources}]
[INFO] Using 'UTF-8' encoding to copy filtered resources.
[INFO] Copying 1 resource
[INFO] Copying 3 resources
[INFO] Copying 3 resources
[INFO] [compiler:compile {execution: default-compile}]
[INFO] Compiling 5 source files to <https://builds.apache.org/job/Tuscany-2x/ws/sca-2x/modules/binding-rmi-runtime/target/classes>
[INFO] [resources:testResources {execution: default-testResources}]
[INFO] Using 'UTF-8' encoding to copy filtered resources.
[INFO] Copying 3 resources
[INFO] Copying 3 resources
[INFO] [compiler:testCompile {execution: default-testCompile}]
[INFO] Compiling 6 source files to <https://builds.apache.org/job/Tuscany-2x/ws/sca-2x/modules/binding-rmi-runtime/target/test-classes>
[INFO] [surefire:test {execution: default-test}]
[INFO] Surefire report directory: <https://builds.apache.org/job/Tuscany-2x/ws/sca-2x/modules/binding-rmi-runtime/target/surefire-reports>

-------------------------------------------------------
 T E S T S
-------------------------------------------------------
Running org.apache.tuscany.sca.binding.rmi.BindingTestCase
Aug 19, 2015 8:53:23 PM org.apache.tuscany.sca.node.impl.NodeImpl start
INFO: Starting node: http://tuscany.apache.org/sca/1.1/nodes/default0 domain: default
Aug 19, 2015 8:53:23 PM org.apache.tuscany.sca.node.impl.NodeFactoryImpl loadContributions
INFO: Loading contribution: <https://builds.apache.org/job/Tuscany-2x/ws/sca-2x/modules/binding-rmi-runtime/target/test-classes/>
Aug 19, 2015 8:53:24 PM org.apache.tuscany.sca.host.rmi.DefaultRMIHost registerService
INFO: RMI service registered: rmi://localhost:8099/HelloWorldRemoteService
Aug 19, 2015 8:53:24 PM org.apache.tuscany.sca.core.assembly.impl.DomainRegistryImpl addEndpoint
INFO: Add endpoint - binding.rmi - rmi://localhost:8099/HelloWorldRemoteService
Aug 19, 2015 8:53:24 PM org.apache.tuscany.sca.core.assembly.impl.DomainRegistryImpl addEndpoint
INFO: Add endpoint - binding.sca - HelloWorldRmiServiceComponent/HelloWorldRmiService
Hello from the RMI Service to - Tuscany World! thro the RMI Reference
Hi from Apache World in RMI Service to - Tuscany World! thro the RMI Reference
Expected exception :helloworld.HelloException
Aug 19, 2015 8:53:24 PM org.apache.tuscany.sca.node.impl.NodeImpl stop
INFO: Stopping node: http://tuscany.apache.org/sca/1.1/nodes/default0
Aug 19, 2015 8:53:24 PM org.apache.tuscany.sca.core.assembly.impl.DomainRegistryImpl removeEndpoint
INFO: Remove endpoint - binding.rmi - rmi://localhost:8099/HelloWorldRemoteService
Aug 19, 2015 8:53:24 PM org.apache.tuscany.sca.host.rmi.DefaultRMIHost unregisterService
INFO: RMI service unregistered: rmi://localhost:8099/HelloWorldRemoteService
Aug 19, 2015 8:53:24 PM org.apache.tuscany.sca.core.assembly.impl.DomainRegistryImpl removeEndpoint
INFO: Remove endpoint - binding.sca - HelloWorldRmiServiceComponent/HelloWorldRmiService
Tests run: 1, Failures: 0, Errors: 0, Skipped: 0, Time elapsed: 1.43 sec

Results :

Tests run: 1, Failures: 0, Errors: 0, Skipped: 0

[JENKINS] Recording test results
[INFO] [jar:jar {execution: default-jar}]
[INFO] Building jar: <https://builds.apache.org/job/Tuscany-2x/ws/sca-2x/modules/binding-rmi-runtime/target/tuscany-binding-rmi-runtime-2.5-SNAPSHOT.jar>
[INFO] [source:jar-no-fork {execution: attach-sources}]
[INFO] Building jar: <https://builds.apache.org/job/Tuscany-2x/ws/sca-2x/modules/binding-rmi-runtime/target/tuscany-binding-rmi-runtime-2.5-SNAPSHOT-sources.jar>
[INFO] [install:install {execution: default-install}]
[INFO] Installing <https://builds.apache.org/job/Tuscany-2x/ws/sca-2x/modules/binding-rmi-runtime/target/tuscany-binding-rmi-runtime-2.5-SNAPSHOT.jar> to <https://builds.apache.org/job/Tuscany-2x/ws/.repository/org/apache/tuscany/sca/tuscany-binding-rmi-runtime/2.5-SNAPSHOT/tuscany-binding-rmi-runtime-2.5-SNAPSHOT.jar>
[INFO] Installing <https://builds.apache.org/job/Tuscany-2x/ws/sca-2x/modules/binding-rmi-runtime/target/tuscany-binding-rmi-runtime-2.5-SNAPSHOT-sources.jar> to <https://builds.apache.org/job/Tuscany-2x/ws/.repository/org/apache/tuscany/sca/tuscany-binding-rmi-runtime/2.5-SNAPSHOT/tuscany-binding-rmi-runtime-2.5-SNAPSHOT-sources.jar>
[JENKINS] Archiving disabled
[INFO] ------------------------------------------------------------------------
[INFO] Building Apache Tuscany SCA Websocket Binding Extension
[INFO]    task-segment: [clean, install]
[INFO] ------------------------------------------------------------------------
[INFO] [clean:clean {execution: default-clean}]
Downloading: http://svn.apache.org/repos/asf/tuscany/maven/org/eclipse/jetty/jetty-websocket/8.0.1.v20110908/jetty-websocket-8.0.1.v20110908.pom
[INFO] Unable to find resource 'org.eclipse.jetty:jetty-websocket:pom:8.0.1.v20110908' in repository tuscany.repo (http://svn.apache.org/repos/asf/tuscany/maven)
Downloading: https://repository.apache.org/content/groups/public//org/eclipse/jetty/jetty-websocket/8.0.1.v20110908/jetty-websocket-8.0.1.v20110908.pom
[WARNING] Unable to get resource 'org.eclipse.jetty:jetty-websocket:pom:8.0.1.v20110908' from repository apache.nexus (https://repository.apache.org/content/groups/public/): Error transferring file: java.lang.RuntimeException: Could not generate DH keypair
Downloading: http://repo1.maven.org/maven2/org/eclipse/jetty/jetty-websocket/8.0.1.v20110908/jetty-websocket-8.0.1.v20110908.pom
3K downloaded  (jetty-websocket-8.0.1.v20110908.pom)
Downloading: http://svn.apache.org/repos/asf/tuscany/maven/org/eclipse/jetty/jetty-project/8.0.1.v20110908/jetty-project-8.0.1.v20110908.pom
[INFO] Unable to find resource 'org.eclipse.jetty:jetty-project:pom:8.0.1.v20110908' in repository tuscany.repo (http://svn.apache.org/repos/asf/tuscany/maven)
Downloading: https://repository.apache.org/content/groups/public//org/eclipse/jetty/jetty-project/8.0.1.v20110908/jetty-project-8.0.1.v20110908.pom
[WARNING] Unable to get resource 'org.eclipse.jetty:jetty-project:pom:8.0.1.v20110908' from repository apache.nexus (https://repository.apache.org/content/groups/public/): Error transferring file: java.lang.RuntimeException: Could not generate DH keypair
Downloading: http://repo1.maven.org/maven2/org/eclipse/jetty/jetty-project/8.0.1.v20110908/jetty-project-8.0.1.v20110908.pom
21K downloaded  (jetty-project-8.0.1.v20110908.pom)
Downloading: http://oss.sonatype.org/content/groups/jetty/org/eclipse/jetty/jetty-parent/18/jetty-parent-18.pom
178b downloaded  (jetty-parent-18.pom)
[WARNING] *** CHECKSUM FAILED - Checksum failed on download: local = '81ffbd1712afe8cdf138b570c0fc9934742c33c1'; remote = '<html>
<head><title>301' - RETRYING
Downloading: http://oss.sonatype.org/content/groups/jetty/org/eclipse/jetty/jetty-parent/18/jetty-parent-18.pom
178b downloaded  (jetty-parent-18.pom)
[WARNING] *** CHECKSUM FAILED - Checksum failed on download: local = '81ffbd1712afe8cdf138b570c0fc9934742c33c1'; remote = '<html>
<head><title>301' - IGNORING
[JENKINS] Archiving disabled
[INFO] ------------------------------------------------------------------------
[ERROR] BUILD ERROR
[INFO] ------------------------------------------------------------------------
[INFO] Error building POM (may not be this project's POM).


Project ID: org.eclipse.jetty:jetty-project:pom:8.0.1.v20110908

Reason: Cannot find parent: org.eclipse.jetty:jetty-parent for project: org.eclipse.jetty:jetty-project:pom:8.0.1.v20110908 for project org.eclipse.jetty:jetty-project:pom:8.0.1.v20110908


[INFO] ------------------------------------------------------------------------
[INFO] For more information, run Maven with the -e switch
[INFO] ------------------------------------------------------------------------
[INFO] Total time: 15 minutes 38 seconds
[INFO] Finished at: Wed Aug 19 20:53:29 UTC 2015
[INFO] Final Memory: 286M/977M
[INFO] ------------------------------------------------------------------------
Waiting for Jenkins to finish collecting data
channel stopped

Build failed in Jenkins: Tuscany-2x #1794

Posted by Apache Jenkins Server <je...@builds.apache.org>.
See <https://builds.apache.org/job/Tuscany-2x/1794/>

------------------------------------------
Started by timer
Building remotely on jenkins-ubuntu-1404-4gb-b02 (jenkins-cloud-4GB cloud-slave Ubuntu ubuntu) in workspace <https://builds.apache.org/job/Tuscany-2x/ws/>
Cleaning local Directory sca-2x
Checking out https://svn.apache.org/repos/asf/tuscany/sca-java-2.x/trunk at revision '2015-08-19T02:07:56.434 +0000'
ERROR: Failed to check out https://svn.apache.org/repos/asf/tuscany/sca-java-2.x/trunk
org.tmatesoft.svn.core.SVNCancelException: svn: E200015: OPTIONS /repos/asf/tuscany/sca-java-2.x/trunk failed
	at org.tmatesoft.svn.core.internal.io.dav.http.HTTPConnection.request(HTTPConnection.java:384)
	at org.tmatesoft.svn.core.internal.io.dav.http.HTTPConnection.request(HTTPConnection.java:373)
	at org.tmatesoft.svn.core.internal.io.dav.http.HTTPConnection.request(HTTPConnection.java:361)
	at org.tmatesoft.svn.core.internal.io.dav.DAVConnection.performHttpRequest(DAVConnection.java:707)
	at org.tmatesoft.svn.core.internal.io.dav.DAVConnection.exchangeCapabilities(DAVConnection.java:627)
	at org.tmatesoft.svn.core.internal.io.dav.DAVConnection.open(DAVConnection.java:102)
	at org.tmatesoft.svn.core.internal.io.dav.DAVRepository.openConnection(DAVRepository.java:1020)
	at org.tmatesoft.svn.core.internal.io.dav.DAVRepository.getLatestRevision(DAVRepository.java:180)
	at org.tmatesoft.svn.core.internal.wc16.SVNBasicDelegate.getRevisionNumber(SVNBasicDelegate.java:480)
	at org.tmatesoft.svn.core.internal.wc16.SVNBasicDelegate.getLocations(SVNBasicDelegate.java:833)
	at org.tmatesoft.svn.core.internal.wc16.SVNBasicDelegate.createRepository(SVNBasicDelegate.java:527)
	at org.tmatesoft.svn.core.internal.wc16.SVNUpdateClient16.doCheckout(SVNUpdateClient16.java:875)
	at org.tmatesoft.svn.core.internal.wc2.old.SvnOldCheckout.run(SvnOldCheckout.java:19)
	at org.tmatesoft.svn.core.internal.wc2.old.SvnOldCheckout.run(SvnOldCheckout.java:8)
	at org.tmatesoft.svn.core.internal.wc2.SvnOperationRunner.run(SvnOperationRunner.java:20)
	at org.tmatesoft.svn.core.wc2.SvnOperationFactory.run(SvnOperationFactory.java:1238)
	at org.tmatesoft.svn.core.wc2.SvnOperation.run(SvnOperation.java:294)
	at org.tmatesoft.svn.core.wc.SVNUpdateClient.doCheckout(SVNUpdateClient.java:777)
	at hudson.scm.subversion.CheckoutUpdater$1.perform(CheckoutUpdater.java:99)
	at hudson.scm.subversion.WorkspaceUpdater$UpdateTask.delegateTo(WorkspaceUpdater.java:161)
	at hudson.scm.SubversionSCM$CheckOutTask.perform(SubversionSCM.java:1030)
	at hudson.scm.SubversionSCM$CheckOutTask.invoke(SubversionSCM.java:1011)
	at hudson.scm.SubversionSCM$CheckOutTask.invoke(SubversionSCM.java:987)
	at hudson.FilePath$FileCallableWrapper.call(FilePath.java:2474)
	at hudson.remoting.UserRequest.perform(UserRequest.java:118)
	at hudson.remoting.UserRequest.perform(UserRequest.java:48)
	at hudson.remoting.Request$2.run(Request.java:328)
	at hudson.remoting.InterceptingExecutorService$1.call(InterceptingExecutorService.java:72)
	at java.util.concurrent.FutureTask.run(FutureTask.java:262)
	at java.util.concurrent.ThreadPoolExecutor.runWorker(ThreadPoolExecutor.java:1145)
	at java.util.concurrent.ThreadPoolExecutor$Worker.run(ThreadPoolExecutor.java:615)
	at java.lang.Thread.run(Thread.java:745)
Caused by: org.tmatesoft.svn.core.SVNCancelException: svn: E200015: No credential to try. Authentication failed
	at org.tmatesoft.svn.core.internal.wc.SVNErrorManager.cancel(SVNErrorManager.java:37)
	at org.tmatesoft.svn.core.internal.wc.SVNErrorManager.cancel(SVNErrorManager.java:32)
	at org.tmatesoft.svn.core.internal.wc.DefaultSVNAuthenticationManager.getFirstAuthentication(DefaultSVNAuthenticationManager.java:185)
	at org.tmatesoft.svn.core.internal.io.dav.http.HTTPConnection._request(HTTPConnection.java:694)
	at org.tmatesoft.svn.core.internal.io.dav.http.HTTPConnection.request(HTTPConnection.java:382)
	... 31 more
FATAL: null
java.lang.NullPointerException
	at java.util.ArrayList.addAll(ArrayList.java:559)
	at hudson.scm.SubversionSCM.checkout(SubversionSCM.java:936)
	at hudson.scm.SubversionSCM.checkout(SubversionSCM.java:871)
	at hudson.model.AbstractProject.checkout(AbstractProject.java:1252)
	at hudson.model.AbstractBuild$AbstractBuildExecution.defaultCheckout(AbstractBuild.java:615)
	at jenkins.scm.SCMCheckoutStrategy.checkout(SCMCheckoutStrategy.java:86)
	at hudson.model.AbstractBuild$AbstractBuildExecution.run(AbstractBuild.java:524)
	at hudson.model.Run.execute(Run.java:1706)
	at hudson.maven.MavenModuleSetBuild.run(MavenModuleSetBuild.java:529)
	at hudson.model.ResourceController.execute(ResourceController.java:88)
	at hudson.model.Executor.run(Executor.java:232)

Build failed in Jenkins: Tuscany-2x #1793

Posted by Apache Jenkins Server <je...@builds.apache.org>.
See <https://builds.apache.org/job/Tuscany-2x/1793/>

------------------------------------------
[...truncated 16542 lines...]
Aug 17, 2015 10:53:24 PM org.apache.tuscany.sca.contribution.namespace.impl.NamespaceImportProcessor [] (AttributeNameSpaceMissing)
SEVERE: Attribute ''namespace'' is missing
Tests run: 2, Failures: 0, Errors: 0, Skipped: 0, Time elapsed: 0.022 sec

Results :

Tests run: 26, Failures: 0, Errors: 0, Skipped: 0

[JENKINS] Recording test results
[INFO] [jar:jar {execution: default-jar}]
[INFO] Building jar: <https://builds.apache.org/job/Tuscany-2x/ws/sca-2x/modules/contribution/target/tuscany-contribution-2.5-SNAPSHOT.jar>
[INFO] [source:jar-no-fork {execution: attach-sources}]
[INFO] Building jar: <https://builds.apache.org/job/Tuscany-2x/ws/sca-2x/modules/contribution/target/tuscany-contribution-2.5-SNAPSHOT-sources.jar>
[INFO] [install:install {execution: default-install}]
[INFO] Installing <https://builds.apache.org/job/Tuscany-2x/ws/sca-2x/modules/contribution/target/tuscany-contribution-2.5-SNAPSHOT.jar> to <https://builds.apache.org/job/Tuscany-2x/ws/.repository/org/apache/tuscany/sca/tuscany-contribution/2.5-SNAPSHOT/tuscany-contribution-2.5-SNAPSHOT.jar>
[INFO] Installing <https://builds.apache.org/job/Tuscany-2x/ws/sca-2x/modules/contribution/target/tuscany-contribution-2.5-SNAPSHOT-sources.jar> to <https://builds.apache.org/job/Tuscany-2x/ws/.repository/org/apache/tuscany/sca/tuscany-contribution/2.5-SNAPSHOT/tuscany-contribution-2.5-SNAPSHOT-sources.jar>
[JENKINS] Archiving disabled
[INFO] ------------------------------------------------------------------------
[INFO] Building Apache Tuscany SCA Node API
[INFO]    task-segment: [clean, install]
[INFO] ------------------------------------------------------------------------
[INFO] [clean:clean {execution: default-clean}]
[INFO] [enforcer:enforce {execution: enforce-plugin-versions}]
[INFO] [remote-resources:process {execution: default}]
[INFO] [resources:resources {execution: default-resources}]
[INFO] Using 'UTF-8' encoding to copy filtered resources.
[INFO] skip non existing resourceDirectory <https://builds.apache.org/job/Tuscany-2x/ws/sca-2x/modules/node-api/src/main/resources>
[INFO] Copying 3 resources
[INFO] Copying 3 resources
[INFO] [compiler:compile {execution: default-compile}]
[INFO] Compiling 19 source files to <https://builds.apache.org/job/Tuscany-2x/ws/sca-2x/modules/node-api/target/classes>
[INFO] [resources:testResources {execution: default-testResources}]
[INFO] Using 'UTF-8' encoding to copy filtered resources.
[INFO] skip non existing resourceDirectory <https://builds.apache.org/job/Tuscany-2x/ws/sca-2x/modules/node-api/src/test/resources>
[INFO] Copying 3 resources
[INFO] [compiler:testCompile {execution: default-testCompile}]
[INFO] No sources to compile
[INFO] [surefire:test {execution: default-test}]
[INFO] Surefire report directory: <https://builds.apache.org/job/Tuscany-2x/ws/sca-2x/modules/node-api/target/surefire-reports>

-------------------------------------------------------
 T E S T S
-------------------------------------------------------
There are no tests to run.

Results :

Tests run: 0, Failures: 0, Errors: 0, Skipped: 0

[JENKINS] Recording test results
[INFO] [jar:jar {execution: default-jar}]
[INFO] Building jar: <https://builds.apache.org/job/Tuscany-2x/ws/sca-2x/modules/node-api/target/tuscany-node-api-2.5-SNAPSHOT.jar>
[INFO] [source:jar-no-fork {execution: attach-sources}]
[INFO] Building jar: <https://builds.apache.org/job/Tuscany-2x/ws/sca-2x/modules/node-api/target/tuscany-node-api-2.5-SNAPSHOT-sources.jar>
[INFO] [install:install {execution: default-install}]
[INFO] Installing <https://builds.apache.org/job/Tuscany-2x/ws/sca-2x/modules/node-api/target/tuscany-node-api-2.5-SNAPSHOT.jar> to <https://builds.apache.org/job/Tuscany-2x/ws/.repository/org/apache/tuscany/sca/tuscany-node-api/2.5-SNAPSHOT/tuscany-node-api-2.5-SNAPSHOT.jar>
[INFO] Installing <https://builds.apache.org/job/Tuscany-2x/ws/sca-2x/modules/node-api/target/tuscany-node-api-2.5-SNAPSHOT-sources.jar> to <https://builds.apache.org/job/Tuscany-2x/ws/.repository/org/apache/tuscany/sca/tuscany-node-api/2.5-SNAPSHOT/tuscany-node-api-2.5-SNAPSHOT-sources.jar>
[JENKINS] Archiving disabled
[INFO] ------------------------------------------------------------------------
[INFO] Building Apache Tuscany SCA Core SPI
[INFO]    task-segment: [clean, install]
[INFO] ------------------------------------------------------------------------
Downloading: http://repo1.maven.org/maven2/org/codehaus/mojo/buildnumber-maven-plugin/1.0-beta-4/buildnumber-maven-plugin-1.0-beta-4.pom
9K downloaded  (buildnumber-maven-plugin-1.0-beta-4.pom)
Downloading: http://repo1.maven.org/maven2/org/codehaus/mojo/mojo-parent/22/mojo-parent-22.pom
18K downloaded  (mojo-parent-22.pom)
Downloading: http://repo1.maven.org/maven2/org/codehaus/mojo/buildnumber-maven-plugin/1.0-beta-4/buildnumber-maven-plugin-1.0-beta-4.jar
21K downloaded  (buildnumber-maven-plugin-1.0-beta-4.jar)
Downloading: http://repo1.maven.org/maven2/org/apache/maven/plugins/maven-antrun-plugin/1.7/maven-antrun-plugin-1.7.pom
4K downloaded  (maven-antrun-plugin-1.7.pom)
Downloading: http://repo1.maven.org/maven2/org/apache/maven/plugins/maven-plugins/22/maven-plugins-22.pom
12K downloaded  (maven-plugins-22.pom)
Downloading: http://repo1.maven.org/maven2/org/apache/maven/plugins/maven-antrun-plugin/1.7/maven-antrun-plugin-1.7.jar
30K downloaded  (maven-antrun-plugin-1.7.jar)
[INFO] [clean:clean {execution: default-clean}]
[INFO] [enforcer:enforce {execution: enforce-plugin-versions}]
Downloading: http://repo1.maven.org/maven2/org/apache/maven/scm/maven-scm-api/1.2/maven-scm-api-1.2.pom
1K downloaded  (maven-scm-api-1.2.pom)
Downloading: http://repo1.maven.org/maven2/org/apache/maven/scm/maven-scm/1.2/maven-scm-1.2.pom
11K downloaded  (maven-scm-1.2.pom)
Downloading: http://repo1.maven.org/maven2/org/apache/maven/scm/maven-scm-manager-plexus/1.2/maven-scm-manager-plexus-1.2.pom
2K downloaded  (maven-scm-manager-plexus-1.2.pom)
Downloading: http://repo1.maven.org/maven2/org/apache/maven/scm/maven-scm-managers/1.2/maven-scm-managers-1.2.pom
1K downloaded  (maven-scm-managers-1.2.pom)
Downloading: http://repo1.maven.org/maven2/org/apache/maven/scm/maven-scm-provider-svnexe/1.2/maven-scm-provider-svnexe-1.2.pom
2K downloaded  (maven-scm-provider-svnexe-1.2.pom)
Downloading: http://repo1.maven.org/maven2/org/apache/maven/scm/maven-scm-providers-svn/1.2/maven-scm-providers-svn-1.2.pom
1K downloaded  (maven-scm-providers-svn-1.2.pom)
Downloading: http://repo1.maven.org/maven2/org/apache/maven/scm/maven-scm-providers/1.2/maven-scm-providers-1.2.pom
3K downloaded  (maven-scm-providers-1.2.pom)
Downloading: http://svn.apache.org/repos/asf/tuscany/maven/org/apache/maven/scm/maven-scm-provider-svn-commons/1.2/maven-scm-provider-svn-commons-1.2.pom
[INFO] Unable to find resource 'org.apache.maven.scm:maven-scm-provider-svn-commons:pom:1.2' in repository tuscany.repo (http://svn.apache.org/repos/asf/tuscany/maven)
Downloading: https://repository.apache.org/content/groups/public//org/apache/maven/scm/maven-scm-provider-svn-commons/1.2/maven-scm-provider-svn-commons-1.2.pom
[WARNING] Unable to get resource 'org.apache.maven.scm:maven-scm-provider-svn-commons:pom:1.2' from repository apache.nexus (https://repository.apache.org/content/groups/public/): Error transferring file: java.lang.RuntimeException: Could not generate DH keypair
Downloading: http://repo1.maven.org/maven2/org/apache/maven/scm/maven-scm-provider-svn-commons/1.2/maven-scm-provider-svn-commons-1.2.pom
1K downloaded  (maven-scm-provider-svn-commons-1.2.pom)
Downloading: http://svn.apache.org/repos/asf/tuscany/maven/regexp/regexp/1.3/regexp-1.3.pom
[INFO] Unable to find resource 'regexp:regexp:pom:1.3' in repository tuscany.repo (http://svn.apache.org/repos/asf/tuscany/maven)
Downloading: https://repository.apache.org/content/groups/public//regexp/regexp/1.3/regexp-1.3.pom
[WARNING] Unable to get resource 'regexp:regexp:pom:1.3' from repository apache.nexus (https://repository.apache.org/content/groups/public/): Error transferring file: java.lang.RuntimeException: Could not generate DH keypair
Downloading: http://repo1.maven.org/maven2/regexp/regexp/1.3/regexp-1.3.pom
145b downloaded  (regexp-1.3.pom)
Downloading: http://repo1.maven.org/maven2/org/apache/maven/scm/maven-scm-provider-cvsexe/1.2/maven-scm-provider-cvsexe-1.2.pom
2K downloaded  (maven-scm-provider-cvsexe-1.2.pom)
Downloading: http://repo1.maven.org/maven2/org/apache/maven/scm/maven-scm-providers-cvs/1.2/maven-scm-providers-cvs-1.2.pom
1K downloaded  (maven-scm-providers-cvs-1.2.pom)
Downloading: http://svn.apache.org/repos/asf/tuscany/maven/org/apache/maven/scm/maven-scm-provider-cvs-commons/1.2/maven-scm-provider-cvs-commons-1.2.pom
[INFO] Unable to find resource 'org.apache.maven.scm:maven-scm-provider-cvs-commons:pom:1.2' in repository tuscany.repo (http://svn.apache.org/repos/asf/tuscany/maven)
Downloading: https://repository.apache.org/content/groups/public//org/apache/maven/scm/maven-scm-provider-cvs-commons/1.2/maven-scm-provider-cvs-commons-1.2.pom
[WARNING] Unable to get resource 'org.apache.maven.scm:maven-scm-provider-cvs-commons:pom:1.2' from repository apache.nexus (https://repository.apache.org/content/groups/public/): Error transferring file: java.lang.RuntimeException: Could not generate DH keypair
Downloading: http://repo1.maven.org/maven2/org/apache/maven/scm/maven-scm-provider-cvs-commons/1.2/maven-scm-provider-cvs-commons-1.2.pom
2K downloaded  (maven-scm-provider-cvs-commons-1.2.pom)
Downloading: http://repo1.maven.org/maven2/org/apache/maven/scm/maven-scm-provider-starteam/1.2/maven-scm-provider-starteam-1.2.pom
2K downloaded  (maven-scm-provider-starteam-1.2.pom)
Downloading: http://repo1.maven.org/maven2/org/apache/maven/scm/maven-scm-provider-clearcase/1.2/maven-scm-provider-clearcase-1.2.pom
2K downloaded  (maven-scm-provider-clearcase-1.2.pom)
Downloading: http://repo1.maven.org/maven2/org/apache/maven/scm/maven-scm-provider-perforce/1.2/maven-scm-provider-perforce-1.2.pom
2K downloaded  (maven-scm-provider-perforce-1.2.pom)
Downloading: http://repo1.maven.org/maven2/org/apache/maven/scm/maven-scm-provider-hg/1.2/maven-scm-provider-hg-1.2.pom
2K downloaded  (maven-scm-provider-hg-1.2.pom)
Downloading: http://repo1.maven.org/maven2/com/google/code/maven-scm-provider-svnjava/maven-scm-provider-svnjava/1.8/maven-scm-provider-svnjava-1.8.pom
7K downloaded  (maven-scm-provider-svnjava-1.8.pom)
Downloading: http://svn.apache.org/repos/asf/tuscany/maven/net/java/dev/jna/jna/3.2.2/jna-3.2.2.pom
[INFO] Unable to find resource 'net.java.dev.jna:jna:pom:3.2.2' in repository tuscany.repo (http://svn.apache.org/repos/asf/tuscany/maven)
Downloading: https://repository.apache.org/content/groups/public//net/java/dev/jna/jna/3.2.2/jna-3.2.2.pom
[WARNING] Unable to get resource 'net.java.dev.jna:jna:pom:3.2.2' from repository apache.nexus (https://repository.apache.org/content/groups/public/): Error transferring file: java.lang.RuntimeException: Could not generate DH keypair
Downloading: http://repo1.maven.org/maven2/net/java/dev/jna/jna/3.2.2/jna-3.2.2.pom
1K downloaded  (jna-3.2.2.pom)
Downloading: http://repo1.maven.org/maven2/org/tmatesoft/svnkit/svnkit/1.3.1-1/svnkit-1.3.1-1.pom
1K downloaded  (svnkit-1.3.1-1.pom)
Downloading: http://svn.apache.org/repos/asf/tuscany/maven/com/trilead/trilead-ssh2/build213-svnkit-1.3-patch/trilead-ssh2-build213-svnkit-1.3-patch.pom
[INFO] Unable to find resource 'com.trilead:trilead-ssh2:pom:build213-svnkit-1.3-patch' in repository tuscany.repo (http://svn.apache.org/repos/asf/tuscany/maven)
Downloading: https://repository.apache.org/content/groups/public//com/trilead/trilead-ssh2/build213-svnkit-1.3-patch/trilead-ssh2-build213-svnkit-1.3-patch.pom
[WARNING] Unable to get resource 'com.trilead:trilead-ssh2:pom:build213-svnkit-1.3-patch' from repository apache.nexus (https://repository.apache.org/content/groups/public/): Error transferring file: java.lang.RuntimeException: Could not generate DH keypair
Downloading: http://repo1.maven.org/maven2/com/trilead/trilead-ssh2/build213-svnkit-1.3-patch/trilead-ssh2-build213-svnkit-1.3-patch.pom
716b downloaded  (trilead-ssh2-build213-svnkit-1.3-patch.pom)
Downloading: http://svn.apache.org/repos/asf/tuscany/maven/org/tmatesoft/sqljet/sqljet/1.0.0-1/sqljet-1.0.0-1.pom
[INFO] Unable to find resource 'org.tmatesoft.sqljet:sqljet:pom:1.0.0-1' in repository tuscany.repo (http://svn.apache.org/repos/asf/tuscany/maven)
Downloading: https://repository.apache.org/content/groups/public//org/tmatesoft/sqljet/sqljet/1.0.0-1/sqljet-1.0.0-1.pom
[WARNING] Unable to get resource 'org.tmatesoft.sqljet:sqljet:pom:1.0.0-1' from repository apache.nexus (https://repository.apache.org/content/groups/public/): Error transferring file: java.lang.RuntimeException: Could not generate DH keypair
Downloading: http://repo1.maven.org/maven2/org/tmatesoft/sqljet/sqljet/1.0.0-1/sqljet-1.0.0-1.pom
774b downloaded  (sqljet-1.0.0-1.pom)
Downloading: http://svn.apache.org/repos/asf/tuscany/maven/org/antlr/antlr-runtime/3.1.3/antlr-runtime-3.1.3.pom
[INFO] Unable to find resource 'org.antlr:antlr-runtime:pom:3.1.3' in repository tuscany.repo (http://svn.apache.org/repos/asf/tuscany/maven)
Downloading: https://repository.apache.org/content/groups/public//org/antlr/antlr-runtime/3.1.3/antlr-runtime-3.1.3.pom
[WARNING] Unable to get resource 'org.antlr:antlr-runtime:pom:3.1.3' from repository apache.nexus (https://repository.apache.org/content/groups/public/): Error transferring file: java.lang.RuntimeException: Could not generate DH keypair
Downloading: http://repo1.maven.org/maven2/org/antlr/antlr-runtime/3.1.3/antlr-runtime-3.1.3.pom
3K downloaded  (antlr-runtime-3.1.3.pom)
Downloading: http://svn.apache.org/repos/asf/tuscany/maven/org/antlr/antlr-master/3.1.3/antlr-master-3.1.3.pom
[INFO] Unable to find resource 'org.antlr:antlr-master:pom:3.1.3' in repository tuscany.repo (http://svn.apache.org/repos/asf/tuscany/maven)
Downloading: https://repository.apache.org/content/groups/public//org/antlr/antlr-master/3.1.3/antlr-master-3.1.3.pom
[WARNING] Unable to get resource 'org.antlr:antlr-master:pom:3.1.3' from repository apache.nexus (https://repository.apache.org/content/groups/public/): Error transferring file: java.lang.RuntimeException: Could not generate DH keypair
Downloading: http://repo1.maven.org/maven2/org/antlr/antlr-master/3.1.3/antlr-master-3.1.3.pom
8K downloaded  (antlr-master-3.1.3.pom)
Downloading: http://svn.apache.org/repos/asf/tuscany/maven/org/antlr/stringtemplate/3.2/stringtemplate-3.2.pom
[INFO] Unable to find resource 'org.antlr:stringtemplate:pom:3.2' in repository tuscany.repo (http://svn.apache.org/repos/asf/tuscany/maven)
Downloading: https://repository.apache.org/content/groups/public//org/antlr/stringtemplate/3.2/stringtemplate-3.2.pom
[WARNING] Unable to get resource 'org.antlr:stringtemplate:pom:3.2' from repository apache.nexus (https://repository.apache.org/content/groups/public/): Error transferring file: java.lang.RuntimeException: Could not generate DH keypair
Downloading: http://antlr.org/antlr-snapshot/org/antlr/stringtemplate/3.2/stringtemplate-3.2.pom
[INFO] Unable to find resource 'org.antlr:stringtemplate:pom:3.2' in repository antlr-snapshot (http://antlr.org/antlr-snapshot)
Downloading: http://repo1.maven.org/maven2/org/antlr/stringtemplate/3.2/stringtemplate-3.2.pom
1K downloaded  (stringtemplate-3.2.pom)
Downloading: http://repo1.maven.org/maven2/org/tmatesoft/svnkit/svnkit/1.3.1-1/svnkit-1.3.1-1.jar
Downloading: http://repo1.maven.org/maven2/net/java/dev/jna/jna/3.2.2/jna-3.2.2.jar
Downloading: http://repo1.maven.org/maven2/org/apache/maven/scm/maven-scm-api/1.2/maven-scm-api-1.2.jar
Downloading: http://svn.apache.org/repos/asf/tuscany/maven/org/tmatesoft/sqljet/sqljet/1.0.0-1/sqljet-1.0.0-1.jar
Downloading: http://svn.apache.org/repos/asf/tuscany/maven/org/antlr/antlr-runtime/3.1.3/antlr-runtime-3.1.3.jar
82K downloaded  (maven-scm-api-1.2.jar)
Downloading: http://svn.apache.org/repos/asf/tuscany/maven/com/trilead/trilead-ssh2/build213-svnkit-1.3-patch/trilead-ssh2-build213-svnkit-1.3-patch.jar
838K downloaded  (jna-3.2.2.jar)
[INFO] Unable to find resource 'org.antlr:antlr-runtime:jar:3.1.3' in repository tuscany.repo (http://svn.apache.org/repos/asf/tuscany/maven)
Downloading: https://repository.apache.org/content/groups/public//org/antlr/antlr-runtime/3.1.3/antlr-runtime-3.1.3.jar
[INFO] Unable to find resource 'org.tmatesoft.sqljet:sqljet:jar:1.0.0-1' in repository tuscany.repo (http://svn.apache.org/repos/asf/tuscany/maven)
Downloading: https://repository.apache.org/content/groups/public//org/tmatesoft/sqljet/sqljet/1.0.0-1/sqljet-1.0.0-1.jar
Downloading: http://repo1.maven.org/maven2/com/google/code/maven-scm-provider-svnjava/maven-scm-provider-svnjava/1.8/maven-scm-provider-svnjava-1.8.jar
43K downloaded  (maven-scm-provider-svnjava-1.8.jar)
Downloading: http://svn.apache.org/repos/asf/tuscany/maven/regexp/regexp/1.3/regexp-1.3.jar
1882K downloaded  (svnkit-1.3.1-1.jar)
[INFO] Unable to find resource 'com.trilead:trilead-ssh2:jar:build213-svnkit-1.3-patch' in repository tuscany.repo (http://svn.apache.org/repos/asf/tuscany/maven)
Downloading: https://repository.apache.org/content/groups/public//com/trilead/trilead-ssh2/build213-svnkit-1.3-patch/trilead-ssh2-build213-svnkit-1.3-patch.jar
Downloading: http://repo1.maven.org/maven2/org/apache/maven/scm/maven-scm-manager-plexus/1.2/maven-scm-manager-plexus-1.2.jar
10K downloaded  (maven-scm-manager-plexus-1.2.jar)
Downloading: http://repo1.maven.org/maven2/org/apache/maven/scm/maven-scm-provider-svnexe/1.2/maven-scm-provider-svnexe-1.2.jar
58K downloaded  (maven-scm-provider-svnexe-1.2.jar)
[INFO] Unable to find resource 'regexp:regexp:jar:1.3' in repository tuscany.repo (http://svn.apache.org/repos/asf/tuscany/maven)
Downloading: https://repository.apache.org/content/groups/public//regexp/regexp/1.3/regexp-1.3.jar
[WARNING] Unable to get resource 'org.tmatesoft.sqljet:sqljet:jar:1.0.0-1' from repository apache.nexus (https://repository.apache.org/content/groups/public/): Error transferring file: java.lang.RuntimeException: Could not generate DH keypair
[WARNING] Unable to get resource 'org.antlr:antlr-runtime:jar:3.1.3' from repository apache.nexus (https://repository.apache.org/content/groups/public/): Error transferring file: java.lang.RuntimeException: Could not generate DH keypair
Downloading: http://repo1.maven.org/maven2/org/tmatesoft/sqljet/sqljet/1.0.0-1/sqljet-1.0.0-1.jar
Downloading: http://repo1.maven.org/maven2/org/antlr/antlr-runtime/3.1.3/antlr-runtime-3.1.3.jar
Downloading: http://repo1.maven.org/maven2/org/apache/maven/scm/maven-scm-provider-svn-commons/1.2/maven-scm-provider-svn-commons-1.2.jar
36K downloaded  (maven-scm-provider-svn-commons-1.2.jar)
147K downloaded  (antlr-runtime-3.1.3.jar)
Downloading: http://repo1.maven.org/maven2/org/apache/maven/scm/maven-scm-provider-cvsexe/1.2/maven-scm-provider-cvsexe-1.2.jar
Downloading: http://svn.apache.org/repos/asf/tuscany/maven/org/antlr/stringtemplate/3.2/stringtemplate-3.2.jar
[WARNING] Unable to get resource 'com.trilead:trilead-ssh2:jar:build213-svnkit-1.3-patch' from repository apache.nexus (https://repository.apache.org/content/groups/public/): Error transferring file: java.lang.RuntimeException: Could not generate DH keypair
Downloading: http://repo1.maven.org/maven2/com/trilead/trilead-ssh2/build213-svnkit-1.3-patch/trilead-ssh2-build213-svnkit-1.3-patch.jar
245K downloaded  (trilead-ssh2-build213-svnkit-1.3-patch.jar)
656K downloaded  (sqljet-1.0.0-1.jar)
26K downloaded  (maven-scm-provider-cvsexe-1.2.jar)
[INFO] Unable to find resource 'org.antlr:stringtemplate:jar:3.2' in repository tuscany.repo (http://svn.apache.org/repos/asf/tuscany/maven)
Downloading: https://repository.apache.org/content/groups/public//org/antlr/stringtemplate/3.2/stringtemplate-3.2.jar
Downloading: http://svn.apache.org/repos/asf/tuscany/maven/org/apache/maven/scm/maven-scm-provider-cvs-commons/1.2/maven-scm-provider-cvs-commons-1.2.jar
[INFO] Unable to find resource 'org.apache.maven.scm:maven-scm-provider-cvs-commons:jar:1.2' in repository tuscany.repo (http://svn.apache.org/repos/asf/tuscany/maven)
Downloading: https://repository.apache.org/content/groups/public//org/apache/maven/scm/maven-scm-provider-cvs-commons/1.2/maven-scm-provider-cvs-commons-1.2.jar
[WARNING] Unable to get resource 'org.antlr:stringtemplate:jar:3.2' from repository apache.nexus (https://repository.apache.org/content/groups/public/): Error transferring file: java.lang.RuntimeException: Could not generate DH keypair
Downloading: http://antlr.org/antlr-snapshot/org/antlr/stringtemplate/3.2/stringtemplate-3.2.jar
[WARNING] Unable to get resource 'org.apache.maven.scm:maven-scm-provider-cvs-commons:jar:1.2' from repository apache.nexus (https://repository.apache.org/content/groups/public/): Error transferring file: java.lang.RuntimeException: Could not generate DH keypair
Downloading: http://repo1.maven.org/maven2/org/apache/maven/scm/maven-scm-provider-cvs-commons/1.2/maven-scm-provider-cvs-commons-1.2.jar
69K downloaded  (maven-scm-provider-cvs-commons-1.2.jar)
Downloading: http://repo1.maven.org/maven2/org/apache/maven/scm/maven-scm-provider-starteam/1.2/maven-scm-provider-starteam-1.2.jar
[INFO] Unable to find resource 'org.antlr:stringtemplate:jar:3.2' in repository antlr-snapshot (http://antlr.org/antlr-snapshot)
Downloading: http://repo1.maven.org/maven2/org/antlr/stringtemplate/3.2/stringtemplate-3.2.jar
167K downloaded  (stringtemplate-3.2.jar)
69K downloaded  (maven-scm-provider-starteam-1.2.jar)
Downloading: http://repo1.maven.org/maven2/org/apache/maven/scm/maven-scm-provider-clearcase/1.2/maven-scm-provider-clearcase-1.2.jar
62K downloaded  (maven-scm-provider-clearcase-1.2.jar)
Downloading: http://repo1.maven.org/maven2/org/apache/maven/scm/maven-scm-provider-perforce/1.2/maven-scm-provider-perforce-1.2.jar
66K downloaded  (maven-scm-provider-perforce-1.2.jar)
Downloading: http://repo1.maven.org/maven2/org/apache/maven/scm/maven-scm-provider-hg/1.2/maven-scm-provider-hg-1.2.jar
51K downloaded  (maven-scm-provider-hg-1.2.jar)
[WARNING] Unable to get resource 'regexp:regexp:jar:1.3' from repository apache.nexus (https://repository.apache.org/content/groups/public/): Error transferring file: java.lang.RuntimeException: Could not generate DH keypair
Downloading: http://repo1.maven.org/maven2/regexp/regexp/1.3/regexp-1.3.jar
24K downloaded  (regexp-1.3.jar)
[INFO] [buildnumber:create {execution: default}]
[INFO] Checking for local modifications: skipped.
[INFO] Executing: /bin/sh -c cd <https://builds.apache.org/job/Tuscany-2x/ws/sca-2x/modules/core-spi> && svn --non-interactive update <https://builds.apache.org/job/Tuscany-2x/ws/sca-2x/modules/core-spi>
[INFO] Working directory: <https://builds.apache.org/job/Tuscany-2x/ws/sca-2x/modules/core-spi>
Provider message:
The svn command failed.
Command output:
svn: SSL is not supported

[JENKINS] Archiving disabled
[INFO] ------------------------------------------------------------------------
[ERROR] BUILD ERROR
[INFO] ------------------------------------------------------------------------
[INFO] Couldn't update project.

Embedded error: Error!
[INFO] ------------------------------------------------------------------------
[INFO] For more information, run Maven with the -e switch
[INFO] ------------------------------------------------------------------------
[INFO] Total time: 3 minutes 15 seconds
[INFO] Finished at: Mon Aug 17 22:53:43 UTC 2015
[INFO] Final Memory: 99M/902M
[INFO] ------------------------------------------------------------------------
Waiting for Jenkins to finish collecting data
channel stopped

Build failed in Jenkins: Tuscany-2x #1792

Posted by Apache Jenkins Server <je...@builds.apache.org>.
See <https://builds.apache.org/job/Tuscany-2x/1792/>

------------------------------------------
[...truncated 31715 lines...]
	at org.apache.tuscany.sca.binding.rest.RESTReferenceTestCase.testInvokeReference(RESTReferenceTestCase.java:61)
	at sun.reflect.NativeMethodAccessorImpl.invoke0(Native Method)
	at sun.reflect.NativeMethodAccessorImpl.invoke(NativeMethodAccessorImpl.java:39)
	at sun.reflect.DelegatingMethodAccessorImpl.invoke(DelegatingMethodAccessorImpl.java:25)
	at java.lang.reflect.Method.invoke(Method.java:597)
	at org.junit.runners.model.FrameworkMethod$1.runReflectiveCall(FrameworkMethod.java:44)
	at org.junit.internal.runners.model.ReflectiveCallable.run(ReflectiveCallable.java:15)
	at org.junit.runners.model.FrameworkMethod.invokeExplosively(FrameworkMethod.java:41)
	at org.junit.internal.runners.statements.InvokeMethod.evaluate(InvokeMethod.java:20)
	at org.junit.internal.runners.statements.RunBefores.evaluate(RunBefores.java:28)
	at org.junit.internal.runners.statements.RunAfters.evaluate(RunAfters.java:31)
	at org.junit.runners.BlockJUnit4ClassRunner.runChild(BlockJUnit4ClassRunner.java:76)
	at org.junit.runners.BlockJUnit4ClassRunner.runChild(BlockJUnit4ClassRunner.java:50)
	at org.junit.runners.ParentRunner$3.run(ParentRunner.java:193)
	at org.junit.runners.ParentRunner$1.schedule(ParentRunner.java:52)
	at org.junit.runners.ParentRunner.runChildren(ParentRunner.java:191)
	at org.junit.runners.ParentRunner.access$000(ParentRunner.java:42)
	at org.junit.runners.ParentRunner$2.evaluate(ParentRunner.java:184)
	at org.junit.runners.ParentRunner.run(ParentRunner.java:236)
	at org.junit.runners.Suite.runChild(Suite.java:128)
	at org.junit.runners.Suite.runChild(Suite.java:24)
	at org.junit.runners.ParentRunner$3.run(ParentRunner.java:193)
	at org.junit.runners.ParentRunner$1.schedule(ParentRunner.java:52)
	at org.junit.runners.ParentRunner.runChildren(ParentRunner.java:191)
	at org.junit.runners.ParentRunner.access$000(ParentRunner.java:42)
	at org.junit.runners.ParentRunner$2.evaluate(ParentRunner.java:184)
	at org.junit.runners.ParentRunner.run(ParentRunner.java:236)
	at org.junit.runner.JUnitCore.run(JUnitCore.java:157)
	at org.junit.runner.JUnitCore.run(JUnitCore.java:136)
	at org.junit.runner.JUnitCore.run(JUnitCore.java:127)
	at org.apache.maven.surefire.junitcore.JUnitCoreTestSet.runJunitCore(JUnitCoreTestSet.java:180)
	at org.apache.maven.surefire.junitcore.JUnitCoreTestSet.execute(JUnitCoreTestSet.java:86)
	at org.apache.maven.surefire.junitcore.JUnitCoreDirectoryTestSuite.execute(JUnitCoreDirectoryTestSuite.java:58)
	at org.apache.maven.surefire.Surefire.run(Surefire.java:180)
	at sun.reflect.NativeMethodAccessorImpl.invoke0(Native Method)
	at sun.reflect.NativeMethodAccessorImpl.invoke(NativeMethodAccessorImpl.java:39)
	at sun.reflect.DelegatingMethodAccessorImpl.invoke(DelegatingMethodAccessorImpl.java:25)
	at java.lang.reflect.Method.invoke(Method.java:597)
	at org.apache.maven.surefire.booter.SurefireBooter.runSuitesInProcess(SurefireBooter.java:350)
	at org.apache.maven.surefire.booter.SurefireBooter.main(SurefireBooter.java:1021)
Caused by: org.apache.tuscany.sca.core.scope.TargetResolutionException: scope container not running, lifecycleState=0
	at org.apache.tuscany.sca.core.scope.impl.StatelessScopeContainer.getWrapper(StatelessScopeContainer.java:42)
	at org.apache.tuscany.sca.implementation.java.invocation.JavaImplementationInvoker.invoke(JavaImplementationInvoker.java:122)
	at org.apache.tuscany.sca.binding.local.LocalSCABindingInvocationInterceptor.invoke(LocalSCABindingInvocationInterceptor.java:48)
	at org.apache.tuscany.sca.core.invocation.InterceptorAsyncImpl.invoke(InterceptorAsyncImpl.java:58)
	at org.apache.tuscany.sca.core.invocation.impl.JDKInvocationHandler.invoke(JDKInvocationHandler.java:351)
	at org.apache.tuscany.sca.core.invocation.impl.JDKInvocationHandler.invoke(JDKInvocationHandler.java:294)
	at org.apache.tuscany.sca.core.invocation.impl.JDKInvocationHandler.invoke(JDKInvocationHandler.java:125)
	at org.apache.tuscany.sca.core.invocation.impl.AsyncJDKInvocationHandler.doInvokeSync(AsyncJDKInvocationHandler.java:238)
	at org.apache.tuscany.sca.core.invocation.impl.AsyncJDKInvocationHandler.invoke(AsyncJDKInvocationHandler.java:157)
	... 41 more

Running org.apache.tuscany.sca.binding.rest.wireformat.binary.BinaryServiceTestCase
Tests run: 2, Failures: 0, Errors: 0, Skipped: 0, Time elapsed: 0.003 sec
Running org.apache.tuscany.sca.binding.rest.RESTBindingTestCase
Tests run: 2, Failures: 0, Errors: 0, Skipped: 0, Time elapsed: 0.003 sec
Running org.apache.tuscany.sca.binding.rest.wireformat.xml.CustomerServiceTestCase
Tests run: 4, Failures: 0, Errors: 0, Skipped: 0, Time elapsed: 0.002 sec

Results :

Tests in error: 
  testInvokeReference(org.apache.tuscany.sca.binding.rest.RESTReferenceTestCase)

Tests run: 58, Failures: 0, Errors: 1, Skipped: 0

[ERROR] There are test failures.

Please refer to <https://builds.apache.org/job/Tuscany-2x/ws/sca-2x/modules/binding-rest-runtime/target/surefire-reports> for the individual test results.
[JENKINS] Recording test results
[INFO] [jar:jar {execution: default-jar}]
[INFO] Building jar: <https://builds.apache.org/job/Tuscany-2x/ws/sca-2x/modules/binding-rest-runtime/target/tuscany-binding-rest-runtime-2.5-SNAPSHOT.jar>
[INFO] [source:jar-no-fork {execution: attach-sources}]
[INFO] Building jar: <https://builds.apache.org/job/Tuscany-2x/ws/sca-2x/modules/binding-rest-runtime/target/tuscany-binding-rest-runtime-2.5-SNAPSHOT-sources.jar>
[INFO] [install:install {execution: default-install}]
[INFO] Installing <https://builds.apache.org/job/Tuscany-2x/ws/sca-2x/modules/binding-rest-runtime/target/tuscany-binding-rest-runtime-2.5-SNAPSHOT.jar> to <https://builds.apache.org/job/Tuscany-2x/ws/.repository/org/apache/tuscany/sca/tuscany-binding-rest-runtime/2.5-SNAPSHOT/tuscany-binding-rest-runtime-2.5-SNAPSHOT.jar>
[INFO] Installing <https://builds.apache.org/job/Tuscany-2x/ws/sca-2x/modules/binding-rest-runtime/target/tuscany-binding-rest-runtime-2.5-SNAPSHOT-sources.jar> to <https://builds.apache.org/job/Tuscany-2x/ws/.repository/org/apache/tuscany/sca/tuscany-binding-rest-runtime/2.5-SNAPSHOT/tuscany-binding-rest-runtime-2.5-SNAPSHOT-sources.jar>
[JENKINS] Archiving disabled
[INFO] ------------------------------------------------------------------------
[INFO] Building Apache Tuscany SCA RMI Host Extension Point
[INFO]    task-segment: [clean, install]
[INFO] ------------------------------------------------------------------------
[INFO] [clean:clean {execution: default-clean}]
[INFO] [enforcer:enforce {execution: enforce-plugin-versions}]
[INFO] [remote-resources:process {execution: default}]
[INFO] [resources:resources {execution: default-resources}]
[INFO] Using 'UTF-8' encoding to copy filtered resources.
[INFO] Copying 1 resource
[INFO] Copying 3 resources
[INFO] Copying 3 resources
[INFO] [compiler:compile {execution: default-compile}]
[INFO] Compiling 8 source files to <https://builds.apache.org/job/Tuscany-2x/ws/sca-2x/modules/host-rmi/target/classes>
[INFO] [resources:testResources {execution: default-testResources}]
[INFO] Using 'UTF-8' encoding to copy filtered resources.
[INFO] skip non existing resourceDirectory <https://builds.apache.org/job/Tuscany-2x/ws/sca-2x/modules/host-rmi/src/test/resources>
[INFO] Copying 3 resources
[INFO] [compiler:testCompile {execution: default-testCompile}]
[INFO] Compiling 1 source file to <https://builds.apache.org/job/Tuscany-2x/ws/sca-2x/modules/host-rmi/target/test-classes>
[INFO] [surefire:test {execution: default-test}]
[INFO] Surefire report directory: <https://builds.apache.org/job/Tuscany-2x/ws/sca-2x/modules/host-rmi/target/surefire-reports>

-------------------------------------------------------
 T E S T S
-------------------------------------------------------
Running org.apache.tuscany.sca.host.rmi.RMIHostImplTestCase
Aug 16, 2015 9:58:58 PM org.apache.tuscany.sca.host.rmi.DefaultRMIHost registerService
INFO: RMI service registered: rmi://localhost:9996/foo1
Aug 16, 2015 9:58:58 PM org.apache.tuscany.sca.host.rmi.DefaultRMIHost unregisterService
INFO: RMI service unregistered: rmi://localhost:9996/foo1
Aug 16, 2015 9:58:58 PM org.apache.tuscany.sca.host.rmi.DefaultRMIHost registerService
INFO: RMI service registered: rmi://localhost:9995/foo1
Aug 16, 2015 9:58:58 PM org.apache.tuscany.sca.host.rmi.DefaultRMIHost registerService
INFO: RMI service registered: rmi://localhost:9995/foo2
Aug 16, 2015 9:58:58 PM org.apache.tuscany.sca.host.rmi.DefaultRMIHost unregisterService
INFO: RMI service unregistered: rmi://localhost:9995/foo1
Aug 16, 2015 9:58:58 PM org.apache.tuscany.sca.host.rmi.DefaultRMIHost unregisterService
INFO: RMI service unregistered: rmi://localhost:9995/foo2
Aug 16, 2015 9:58:58 PM org.apache.tuscany.sca.host.rmi.DefaultRMIHost registerService
INFO: RMI service registered: rmi://localhost:9999/bar1
Aug 16, 2015 9:58:58 PM org.apache.tuscany.sca.host.rmi.DefaultRMIHost unregisterService
INFO: RMI service unregistered: rmi://localhost:9999/bar1
Aug 16, 2015 9:58:58 PM org.apache.tuscany.sca.host.rmi.DefaultRMIHost registerService
INFO: RMI service registered: rmi://localhost:9997/bar2
Aug 16, 2015 9:58:58 PM org.apache.tuscany.sca.host.rmi.DefaultRMIHost unregisterService
INFO: RMI service unregistered: rmi://localhost:9997/bar2
Tests run: 7, Failures: 0, Errors: 0, Skipped: 0, Time elapsed: 127.686 sec

Results :

Tests run: 7, Failures: 0, Errors: 0, Skipped: 0

[JENKINS] Recording test results
[INFO] [jar:jar {execution: default-jar}]
[INFO] Building jar: <https://builds.apache.org/job/Tuscany-2x/ws/sca-2x/modules/host-rmi/target/tuscany-host-rmi-2.5-SNAPSHOT.jar>
[INFO] [source:jar-no-fork {execution: attach-sources}]
[INFO] Building jar: <https://builds.apache.org/job/Tuscany-2x/ws/sca-2x/modules/host-rmi/target/tuscany-host-rmi-2.5-SNAPSHOT-sources.jar>
[INFO] [install:install {execution: default-install}]
[INFO] Installing <https://builds.apache.org/job/Tuscany-2x/ws/sca-2x/modules/host-rmi/target/tuscany-host-rmi-2.5-SNAPSHOT.jar> to <https://builds.apache.org/job/Tuscany-2x/ws/.repository/org/apache/tuscany/sca/tuscany-host-rmi/2.5-SNAPSHOT/tuscany-host-rmi-2.5-SNAPSHOT.jar>
[INFO] Installing <https://builds.apache.org/job/Tuscany-2x/ws/sca-2x/modules/host-rmi/target/tuscany-host-rmi-2.5-SNAPSHOT-sources.jar> to <https://builds.apache.org/job/Tuscany-2x/ws/.repository/org/apache/tuscany/sca/tuscany-host-rmi/2.5-SNAPSHOT/tuscany-host-rmi-2.5-SNAPSHOT-sources.jar>
[JENKINS] Archiving disabled
[INFO] ------------------------------------------------------------------------
[INFO] Building Apache Tuscany SCA RMI Binding Extension
[INFO]    task-segment: [clean, install]
[INFO] ------------------------------------------------------------------------
[INFO] [clean:clean {execution: default-clean}]
[INFO] [enforcer:enforce {execution: enforce-plugin-versions}]
[INFO] [remote-resources:process {execution: default}]
[INFO] [resources:resources {execution: default-resources}]
[INFO] Using 'UTF-8' encoding to copy filtered resources.
[INFO] Copying 1 resource
[INFO] Copying 3 resources
[INFO] Copying 3 resources
[INFO] [compiler:compile {execution: default-compile}]
[INFO] Compiling 5 source files to <https://builds.apache.org/job/Tuscany-2x/ws/sca-2x/modules/binding-rmi-runtime/target/classes>
[INFO] [resources:testResources {execution: default-testResources}]
[INFO] Using 'UTF-8' encoding to copy filtered resources.
[INFO] Copying 3 resources
[INFO] Copying 3 resources
[INFO] [compiler:testCompile {execution: default-testCompile}]
[INFO] Compiling 6 source files to <https://builds.apache.org/job/Tuscany-2x/ws/sca-2x/modules/binding-rmi-runtime/target/test-classes>
[INFO] [surefire:test {execution: default-test}]
[INFO] Surefire report directory: <https://builds.apache.org/job/Tuscany-2x/ws/sca-2x/modules/binding-rmi-runtime/target/surefire-reports>

-------------------------------------------------------
 T E S T S
-------------------------------------------------------
Running org.apache.tuscany.sca.binding.rmi.BindingTestCase
Aug 16, 2015 9:59:01 PM org.apache.tuscany.sca.node.impl.NodeImpl start
INFO: Starting node: http://tuscany.apache.org/sca/1.1/nodes/default0 domain: default
Aug 16, 2015 9:59:01 PM org.apache.tuscany.sca.node.impl.NodeFactoryImpl loadContributions
INFO: Loading contribution: <https://builds.apache.org/job/Tuscany-2x/ws/sca-2x/modules/binding-rmi-runtime/target/test-classes/>
Aug 16, 2015 9:59:02 PM org.apache.tuscany.sca.host.rmi.DefaultRMIHost registerService
INFO: RMI service registered: rmi://localhost:8099/HelloWorldRemoteService
Aug 16, 2015 9:59:02 PM org.apache.tuscany.sca.core.assembly.impl.DomainRegistryImpl addEndpoint
INFO: Add endpoint - binding.rmi - rmi://localhost:8099/HelloWorldRemoteService
Aug 16, 2015 9:59:02 PM org.apache.tuscany.sca.core.assembly.impl.DomainRegistryImpl addEndpoint
INFO: Add endpoint - binding.sca - HelloWorldRmiServiceComponent/HelloWorldRmiService
Hello from the RMI Service to - Tuscany World! thro the RMI Reference
Hi from Apache World in RMI Service to - Tuscany World! thro the RMI Reference
Expected exception :helloworld.HelloException
Aug 16, 2015 9:59:03 PM org.apache.tuscany.sca.node.impl.NodeImpl stop
INFO: Stopping node: http://tuscany.apache.org/sca/1.1/nodes/default0
Aug 16, 2015 9:59:03 PM org.apache.tuscany.sca.core.assembly.impl.DomainRegistryImpl removeEndpoint
INFO: Remove endpoint - binding.rmi - rmi://localhost:8099/HelloWorldRemoteService
Aug 16, 2015 9:59:03 PM org.apache.tuscany.sca.host.rmi.DefaultRMIHost unregisterService
INFO: RMI service unregistered: rmi://localhost:8099/HelloWorldRemoteService
Aug 16, 2015 9:59:03 PM org.apache.tuscany.sca.core.assembly.impl.DomainRegistryImpl removeEndpoint
INFO: Remove endpoint - binding.sca - HelloWorldRmiServiceComponent/HelloWorldRmiService
Tests run: 1, Failures: 0, Errors: 0, Skipped: 0, Time elapsed: 1.362 sec

Results :

Tests run: 1, Failures: 0, Errors: 0, Skipped: 0

[JENKINS] Recording test results
[INFO] [jar:jar {execution: default-jar}]
[INFO] Building jar: <https://builds.apache.org/job/Tuscany-2x/ws/sca-2x/modules/binding-rmi-runtime/target/tuscany-binding-rmi-runtime-2.5-SNAPSHOT.jar>
[INFO] [source:jar-no-fork {execution: attach-sources}]
[INFO] Building jar: <https://builds.apache.org/job/Tuscany-2x/ws/sca-2x/modules/binding-rmi-runtime/target/tuscany-binding-rmi-runtime-2.5-SNAPSHOT-sources.jar>
[INFO] [install:install {execution: default-install}]
[INFO] Installing <https://builds.apache.org/job/Tuscany-2x/ws/sca-2x/modules/binding-rmi-runtime/target/tuscany-binding-rmi-runtime-2.5-SNAPSHOT.jar> to <https://builds.apache.org/job/Tuscany-2x/ws/.repository/org/apache/tuscany/sca/tuscany-binding-rmi-runtime/2.5-SNAPSHOT/tuscany-binding-rmi-runtime-2.5-SNAPSHOT.jar>
[INFO] Installing <https://builds.apache.org/job/Tuscany-2x/ws/sca-2x/modules/binding-rmi-runtime/target/tuscany-binding-rmi-runtime-2.5-SNAPSHOT-sources.jar> to <https://builds.apache.org/job/Tuscany-2x/ws/.repository/org/apache/tuscany/sca/tuscany-binding-rmi-runtime/2.5-SNAPSHOT/tuscany-binding-rmi-runtime-2.5-SNAPSHOT-sources.jar>
[JENKINS] Archiving disabled
[INFO] ------------------------------------------------------------------------
[INFO] Building Apache Tuscany SCA Websocket Binding Extension
[INFO]    task-segment: [clean, install]
[INFO] ------------------------------------------------------------------------
[INFO] [clean:clean {execution: default-clean}]
Downloading: http://svn.apache.org/repos/asf/tuscany/maven/org/eclipse/jetty/jetty-websocket/8.0.1.v20110908/jetty-websocket-8.0.1.v20110908.pom
[INFO] Unable to find resource 'org.eclipse.jetty:jetty-websocket:pom:8.0.1.v20110908' in repository tuscany.repo (http://svn.apache.org/repos/asf/tuscany/maven)
Downloading: https://repository.apache.org/content/groups/public//org/eclipse/jetty/jetty-websocket/8.0.1.v20110908/jetty-websocket-8.0.1.v20110908.pom
[WARNING] Unable to get resource 'org.eclipse.jetty:jetty-websocket:pom:8.0.1.v20110908' from repository apache.nexus (https://repository.apache.org/content/groups/public/): Error transferring file: java.lang.RuntimeException: Could not generate DH keypair
Downloading: http://repo1.maven.org/maven2/org/eclipse/jetty/jetty-websocket/8.0.1.v20110908/jetty-websocket-8.0.1.v20110908.pom
3K downloaded  (jetty-websocket-8.0.1.v20110908.pom)
Downloading: http://svn.apache.org/repos/asf/tuscany/maven/org/eclipse/jetty/jetty-project/8.0.1.v20110908/jetty-project-8.0.1.v20110908.pom
[INFO] Unable to find resource 'org.eclipse.jetty:jetty-project:pom:8.0.1.v20110908' in repository tuscany.repo (http://svn.apache.org/repos/asf/tuscany/maven)
Downloading: https://repository.apache.org/content/groups/public//org/eclipse/jetty/jetty-project/8.0.1.v20110908/jetty-project-8.0.1.v20110908.pom
[WARNING] Unable to get resource 'org.eclipse.jetty:jetty-project:pom:8.0.1.v20110908' from repository apache.nexus (https://repository.apache.org/content/groups/public/): Error transferring file: java.lang.RuntimeException: Could not generate DH keypair
Downloading: http://repo1.maven.org/maven2/org/eclipse/jetty/jetty-project/8.0.1.v20110908/jetty-project-8.0.1.v20110908.pom
21K downloaded  (jetty-project-8.0.1.v20110908.pom)
Downloading: http://oss.sonatype.org/content/groups/jetty/org/eclipse/jetty/jetty-parent/18/jetty-parent-18.pom
178b downloaded  (jetty-parent-18.pom)
[WARNING] *** CHECKSUM FAILED - Checksum failed on download: local = '81ffbd1712afe8cdf138b570c0fc9934742c33c1'; remote = '<html>
<head><title>301' - RETRYING
Downloading: http://oss.sonatype.org/content/groups/jetty/org/eclipse/jetty/jetty-parent/18/jetty-parent-18.pom
178b downloaded  (jetty-parent-18.pom)
[WARNING] *** CHECKSUM FAILED - Checksum failed on download: local = '81ffbd1712afe8cdf138b570c0fc9934742c33c1'; remote = '<html>
<head><title>301' - IGNORING
[JENKINS] Archiving disabled
[INFO] ------------------------------------------------------------------------
[ERROR] BUILD ERROR
[INFO] ------------------------------------------------------------------------
[INFO] Error building POM (may not be this project's POM).


Project ID: org.eclipse.jetty:jetty-project:pom:8.0.1.v20110908

Reason: Cannot find parent: org.eclipse.jetty:jetty-parent for project: org.eclipse.jetty:jetty-project:pom:8.0.1.v20110908 for project org.eclipse.jetty:jetty-project:pom:8.0.1.v20110908


[INFO] ------------------------------------------------------------------------
[INFO] For more information, run Maven with the -e switch
[INFO] ------------------------------------------------------------------------
[INFO] Total time: 13 minutes 19 seconds
[INFO] Finished at: Sun Aug 16 21:59:06 UTC 2015
[INFO] Final Memory: 288M/977M
[INFO] ------------------------------------------------------------------------
Waiting for Jenkins to finish collecting data
channel stopped

Build failed in Jenkins: Tuscany-2x #1791

Posted by Apache Jenkins Server <je...@builds.apache.org>.
See <https://builds.apache.org/job/Tuscany-2x/1791/>

------------------------------------------
[...truncated 25357 lines...]
Aug 15, 2015 6:54:51 PM org.apache.tuscany.sca.core.assembly.impl.DomainRegistryImpl removeEndpoint
INFO: Remove endpoint - binding.rest - http://localhost:8085/EchoService/json/
Aug 15, 2015 6:54:51 PM org.apache.tuscany.sca.http.jetty.JettyServer removeServletMapping
INFO: Removed Servlet mapping: /EchoService/json/*
Aug 15, 2015 6:54:51 PM org.apache.tuscany.sca.core.assembly.impl.DomainRegistryImpl removeEndpoint
INFO: Remove endpoint - binding.rest - http://localhost:8085/EchoService/xml/
Aug 15, 2015 6:54:51 PM org.apache.tuscany.sca.http.jetty.JettyServer removeServletMapping
INFO: Removed Servlet mapping: /EchoService/xml/*
Aug 15, 2015 6:54:51 PM org.apache.tuscany.sca.http.jetty.JettyLogger info
INFO: Stopped SelectChannelConnector@localhost:8085
Running org.apache.tuscany.sca.binding.rest.rpc.EchoServiceTestCase
Tests run: 6, Failures: 0, Errors: 0, Skipped: 0, Time elapsed: 0.355 sec
Running org.apache.tuscany.sca.binding.rest.RESTBindingCacheTestCase
Tests run: 36, Failures: 0, Errors: 0, Skipped: 0, Time elapsed: 0.009 sec
Running org.apache.tuscany.sca.binding.rest.wireformat.json.CatalogServiceTestCase
Tests run: 7, Failures: 0, Errors: 0, Skipped: 0, Time elapsed: 0.004 sec
Running org.apache.tuscany.sca.binding.rest.RESTReferenceTestCase
Tests run: 1, Failures: 0, Errors: 1, Skipped: 0, Time elapsed: 0.003 sec <<< FAILURE!
testInvokeReference(org.apache.tuscany.sca.binding.rest.RESTReferenceTestCase)  Time elapsed: 0.001 sec  <<< ERROR!
java.lang.reflect.UndeclaredThrowableException
	at $Proxy39.echo(Unknown Source)
	at org.apache.tuscany.sca.binding.rest.RESTReferenceTestCase.testInvokeReference(RESTReferenceTestCase.java:61)
	at sun.reflect.NativeMethodAccessorImpl.invoke0(Native Method)
	at sun.reflect.NativeMethodAccessorImpl.invoke(NativeMethodAccessorImpl.java:39)
	at sun.reflect.DelegatingMethodAccessorImpl.invoke(DelegatingMethodAccessorImpl.java:25)
	at java.lang.reflect.Method.invoke(Method.java:597)
	at org.junit.runners.model.FrameworkMethod$1.runReflectiveCall(FrameworkMethod.java:44)
	at org.junit.internal.runners.model.ReflectiveCallable.run(ReflectiveCallable.java:15)
	at org.junit.runners.model.FrameworkMethod.invokeExplosively(FrameworkMethod.java:41)
	at org.junit.internal.runners.statements.InvokeMethod.evaluate(InvokeMethod.java:20)
	at org.junit.internal.runners.statements.RunBefores.evaluate(RunBefores.java:28)
	at org.junit.internal.runners.statements.RunAfters.evaluate(RunAfters.java:31)
	at org.junit.runners.BlockJUnit4ClassRunner.runChild(BlockJUnit4ClassRunner.java:76)
	at org.junit.runners.BlockJUnit4ClassRunner.runChild(BlockJUnit4ClassRunner.java:50)
	at org.junit.runners.ParentRunner$3.run(ParentRunner.java:193)
	at org.junit.runners.ParentRunner$1.schedule(ParentRunner.java:52)
	at org.junit.runners.ParentRunner.runChildren(ParentRunner.java:191)
	at org.junit.runners.ParentRunner.access$000(ParentRunner.java:42)
	at org.junit.runners.ParentRunner$2.evaluate(ParentRunner.java:184)
	at org.junit.runners.ParentRunner.run(ParentRunner.java:236)
	at org.junit.runners.Suite.runChild(Suite.java:128)
	at org.junit.runners.Suite.runChild(Suite.java:24)
	at org.junit.runners.ParentRunner$3.run(ParentRunner.java:193)
	at org.junit.runners.ParentRunner$1.schedule(ParentRunner.java:52)
	at org.junit.runners.ParentRunner.runChildren(ParentRunner.java:191)
	at org.junit.runners.ParentRunner.access$000(ParentRunner.java:42)
	at org.junit.runners.ParentRunner$2.evaluate(ParentRunner.java:184)
	at org.junit.runners.ParentRunner.run(ParentRunner.java:236)
	at org.junit.runner.JUnitCore.run(JUnitCore.java:157)
	at org.junit.runner.JUnitCore.run(JUnitCore.java:136)
	at org.junit.runner.JUnitCore.run(JUnitCore.java:127)
	at org.apache.maven.surefire.junitcore.JUnitCoreTestSet.runJunitCore(JUnitCoreTestSet.java:180)
	at org.apache.maven.surefire.junitcore.JUnitCoreTestSet.execute(JUnitCoreTestSet.java:86)
	at org.apache.maven.surefire.junitcore.JUnitCoreDirectoryTestSuite.execute(JUnitCoreDirectoryTestSuite.java:58)
	at org.apache.maven.surefire.Surefire.run(Surefire.java:180)
	at sun.reflect.NativeMethodAccessorImpl.invoke0(Native Method)
	at sun.reflect.NativeMethodAccessorImpl.invoke(NativeMethodAccessorImpl.java:39)
	at sun.reflect.DelegatingMethodAccessorImpl.invoke(DelegatingMethodAccessorImpl.java:25)
	at java.lang.reflect.Method.invoke(Method.java:597)
	at org.apache.maven.surefire.booter.SurefireBooter.runSuitesInProcess(SurefireBooter.java:350)
	at org.apache.maven.surefire.booter.SurefireBooter.main(SurefireBooter.java:1021)
Caused by: org.apache.tuscany.sca.core.scope.TargetResolutionException: scope container not running, lifecycleState=0
	at org.apache.tuscany.sca.core.scope.impl.StatelessScopeContainer.getWrapper(StatelessScopeContainer.java:42)
	at org.apache.tuscany.sca.implementation.java.invocation.JavaImplementationInvoker.invoke(JavaImplementationInvoker.java:122)
	at org.apache.tuscany.sca.binding.local.LocalSCABindingInvocationInterceptor.invoke(LocalSCABindingInvocationInterceptor.java:48)
	at org.apache.tuscany.sca.core.invocation.InterceptorAsyncImpl.invoke(InterceptorAsyncImpl.java:58)
	at org.apache.tuscany.sca.core.invocation.impl.JDKInvocationHandler.invoke(JDKInvocationHandler.java:351)
	at org.apache.tuscany.sca.core.invocation.impl.JDKInvocationHandler.invoke(JDKInvocationHandler.java:294)
	at org.apache.tuscany.sca.core.invocation.impl.JDKInvocationHandler.invoke(JDKInvocationHandler.java:125)
	at org.apache.tuscany.sca.core.invocation.impl.AsyncJDKInvocationHandler.doInvokeSync(AsyncJDKInvocationHandler.java:238)
	at org.apache.tuscany.sca.core.invocation.impl.AsyncJDKInvocationHandler.invoke(AsyncJDKInvocationHandler.java:157)
	... 41 more

Running org.apache.tuscany.sca.binding.rest.wireformat.binary.BinaryServiceTestCase
Tests run: 2, Failures: 0, Errors: 0, Skipped: 0, Time elapsed: 0.002 sec
Running org.apache.tuscany.sca.binding.rest.RESTBindingTestCase
Tests run: 2, Failures: 0, Errors: 0, Skipped: 0, Time elapsed: 0.003 sec
Running org.apache.tuscany.sca.binding.rest.wireformat.xml.CustomerServiceTestCase
Tests run: 4, Failures: 0, Errors: 0, Skipped: 0, Time elapsed: 0.002 sec

Results :

Tests in error: 
  testInvokeReference(org.apache.tuscany.sca.binding.rest.RESTReferenceTestCase)

Tests run: 58, Failures: 0, Errors: 1, Skipped: 0

[ERROR] There are test failures.

Please refer to <https://builds.apache.org/job/Tuscany-2x/ws/sca-2x/modules/binding-rest-runtime/target/surefire-reports> for the individual test results.
[JENKINS] Recording test results
[INFO] [jar:jar {execution: default-jar}]
[INFO] Building jar: <https://builds.apache.org/job/Tuscany-2x/ws/sca-2x/modules/binding-rest-runtime/target/tuscany-binding-rest-runtime-2.5-SNAPSHOT.jar>
[INFO] [source:jar-no-fork {execution: attach-sources}]
[INFO] Building jar: <https://builds.apache.org/job/Tuscany-2x/ws/sca-2x/modules/binding-rest-runtime/target/tuscany-binding-rest-runtime-2.5-SNAPSHOT-sources.jar>
[INFO] [install:install {execution: default-install}]
[INFO] Installing <https://builds.apache.org/job/Tuscany-2x/ws/sca-2x/modules/binding-rest-runtime/target/tuscany-binding-rest-runtime-2.5-SNAPSHOT.jar> to <https://builds.apache.org/job/Tuscany-2x/ws/.repository/org/apache/tuscany/sca/tuscany-binding-rest-runtime/2.5-SNAPSHOT/tuscany-binding-rest-runtime-2.5-SNAPSHOT.jar>
[INFO] Installing <https://builds.apache.org/job/Tuscany-2x/ws/sca-2x/modules/binding-rest-runtime/target/tuscany-binding-rest-runtime-2.5-SNAPSHOT-sources.jar> to <https://builds.apache.org/job/Tuscany-2x/ws/.repository/org/apache/tuscany/sca/tuscany-binding-rest-runtime/2.5-SNAPSHOT/tuscany-binding-rest-runtime-2.5-SNAPSHOT-sources.jar>
[JENKINS] Archiving disabled
[INFO] ------------------------------------------------------------------------
[INFO] Building Apache Tuscany SCA RMI Host Extension Point
[INFO]    task-segment: [clean, install]
[INFO] ------------------------------------------------------------------------
[INFO] [clean:clean {execution: default-clean}]
[INFO] [enforcer:enforce {execution: enforce-plugin-versions}]
[INFO] [remote-resources:process {execution: default}]
[INFO] [resources:resources {execution: default-resources}]
[INFO] Using 'UTF-8' encoding to copy filtered resources.
[INFO] Copying 1 resource
[INFO] Copying 3 resources
[INFO] Copying 3 resources
[INFO] [compiler:compile {execution: default-compile}]
[INFO] Compiling 8 source files to <https://builds.apache.org/job/Tuscany-2x/ws/sca-2x/modules/host-rmi/target/classes>
[INFO] [resources:testResources {execution: default-testResources}]
[INFO] Using 'UTF-8' encoding to copy filtered resources.
[INFO] skip non existing resourceDirectory <https://builds.apache.org/job/Tuscany-2x/ws/sca-2x/modules/host-rmi/src/test/resources>
[INFO] Copying 3 resources
[INFO] [compiler:testCompile {execution: default-testCompile}]
[INFO] Compiling 1 source file to <https://builds.apache.org/job/Tuscany-2x/ws/sca-2x/modules/host-rmi/target/test-classes>
[INFO] [surefire:test {execution: default-test}]
[INFO] Surefire report directory: <https://builds.apache.org/job/Tuscany-2x/ws/sca-2x/modules/host-rmi/target/surefire-reports>

-------------------------------------------------------
 T E S T S
-------------------------------------------------------
Running org.apache.tuscany.sca.host.rmi.RMIHostImplTestCase
Aug 15, 2015 6:57:02 PM org.apache.tuscany.sca.host.rmi.DefaultRMIHost registerService
INFO: RMI service registered: rmi://localhost:9996/foo1
Aug 15, 2015 6:57:02 PM org.apache.tuscany.sca.host.rmi.DefaultRMIHost unregisterService
INFO: RMI service unregistered: rmi://localhost:9996/foo1
Aug 15, 2015 6:57:02 PM org.apache.tuscany.sca.host.rmi.DefaultRMIHost registerService
INFO: RMI service registered: rmi://localhost:9995/foo1
Aug 15, 2015 6:57:02 PM org.apache.tuscany.sca.host.rmi.DefaultRMIHost registerService
INFO: RMI service registered: rmi://localhost:9995/foo2
Aug 15, 2015 6:57:02 PM org.apache.tuscany.sca.host.rmi.DefaultRMIHost unregisterService
INFO: RMI service unregistered: rmi://localhost:9995/foo1
Aug 15, 2015 6:57:02 PM org.apache.tuscany.sca.host.rmi.DefaultRMIHost unregisterService
INFO: RMI service unregistered: rmi://localhost:9995/foo2
Aug 15, 2015 6:57:02 PM org.apache.tuscany.sca.host.rmi.DefaultRMIHost registerService
INFO: RMI service registered: rmi://localhost:9999/bar1
Aug 15, 2015 6:57:02 PM org.apache.tuscany.sca.host.rmi.DefaultRMIHost unregisterService
INFO: RMI service unregistered: rmi://localhost:9999/bar1
Aug 15, 2015 6:57:02 PM org.apache.tuscany.sca.host.rmi.DefaultRMIHost registerService
INFO: RMI service registered: rmi://localhost:9997/bar2
Aug 15, 2015 6:57:02 PM org.apache.tuscany.sca.host.rmi.DefaultRMIHost unregisterService
INFO: RMI service unregistered: rmi://localhost:9997/bar2
Tests run: 7, Failures: 0, Errors: 0, Skipped: 0, Time elapsed: 127.457 sec

Results :

Tests run: 7, Failures: 0, Errors: 0, Skipped: 0

[JENKINS] Recording test results
[INFO] [jar:jar {execution: default-jar}]
[INFO] Building jar: <https://builds.apache.org/job/Tuscany-2x/ws/sca-2x/modules/host-rmi/target/tuscany-host-rmi-2.5-SNAPSHOT.jar>
[INFO] [source:jar-no-fork {execution: attach-sources}]
[INFO] Building jar: <https://builds.apache.org/job/Tuscany-2x/ws/sca-2x/modules/host-rmi/target/tuscany-host-rmi-2.5-SNAPSHOT-sources.jar>
[INFO] [install:install {execution: default-install}]
[INFO] Installing <https://builds.apache.org/job/Tuscany-2x/ws/sca-2x/modules/host-rmi/target/tuscany-host-rmi-2.5-SNAPSHOT.jar> to <https://builds.apache.org/job/Tuscany-2x/ws/.repository/org/apache/tuscany/sca/tuscany-host-rmi/2.5-SNAPSHOT/tuscany-host-rmi-2.5-SNAPSHOT.jar>
[INFO] Installing <https://builds.apache.org/job/Tuscany-2x/ws/sca-2x/modules/host-rmi/target/tuscany-host-rmi-2.5-SNAPSHOT-sources.jar> to <https://builds.apache.org/job/Tuscany-2x/ws/.repository/org/apache/tuscany/sca/tuscany-host-rmi/2.5-SNAPSHOT/tuscany-host-rmi-2.5-SNAPSHOT-sources.jar>
[JENKINS] Archiving disabled
[INFO] ------------------------------------------------------------------------
[INFO] Building Apache Tuscany SCA RMI Binding Extension
[INFO]    task-segment: [clean, install]
[INFO] ------------------------------------------------------------------------
[INFO] [clean:clean {execution: default-clean}]
[INFO] [enforcer:enforce {execution: enforce-plugin-versions}]
[INFO] [remote-resources:process {execution: default}]
[INFO] [resources:resources {execution: default-resources}]
[INFO] Using 'UTF-8' encoding to copy filtered resources.
[INFO] Copying 1 resource
[INFO] Copying 3 resources
[INFO] Copying 3 resources
[INFO] [compiler:compile {execution: default-compile}]
[INFO] Compiling 5 source files to <https://builds.apache.org/job/Tuscany-2x/ws/sca-2x/modules/binding-rmi-runtime/target/classes>
[INFO] [resources:testResources {execution: default-testResources}]
[INFO] Using 'UTF-8' encoding to copy filtered resources.
[INFO] Copying 3 resources
[INFO] Copying 3 resources
[INFO] [compiler:testCompile {execution: default-testCompile}]
[INFO] Compiling 6 source files to <https://builds.apache.org/job/Tuscany-2x/ws/sca-2x/modules/binding-rmi-runtime/target/test-classes>
[INFO] [surefire:test {execution: default-test}]
[INFO] Surefire report directory: <https://builds.apache.org/job/Tuscany-2x/ws/sca-2x/modules/binding-rmi-runtime/target/surefire-reports>

-------------------------------------------------------
 T E S T S
-------------------------------------------------------
Running org.apache.tuscany.sca.binding.rmi.BindingTestCase
Aug 15, 2015 6:57:05 PM org.apache.tuscany.sca.node.impl.NodeImpl start
INFO: Starting node: http://tuscany.apache.org/sca/1.1/nodes/default0 domain: default
Aug 15, 2015 6:57:05 PM org.apache.tuscany.sca.node.impl.NodeFactoryImpl loadContributions
INFO: Loading contribution: <https://builds.apache.org/job/Tuscany-2x/ws/sca-2x/modules/binding-rmi-runtime/target/test-classes/>
Aug 15, 2015 6:57:06 PM org.apache.tuscany.sca.host.rmi.DefaultRMIHost registerService
INFO: RMI service registered: rmi://localhost:8099/HelloWorldRemoteService
Aug 15, 2015 6:57:06 PM org.apache.tuscany.sca.core.assembly.impl.DomainRegistryImpl addEndpoint
INFO: Add endpoint - binding.rmi - rmi://localhost:8099/HelloWorldRemoteService
Aug 15, 2015 6:57:06 PM org.apache.tuscany.sca.core.assembly.impl.DomainRegistryImpl addEndpoint
INFO: Add endpoint - binding.sca - HelloWorldRmiServiceComponent/HelloWorldRmiService
Hello from the RMI Service to - Tuscany World! thro the RMI Reference
Hi from Apache World in RMI Service to - Tuscany World! thro the RMI Reference
Expected exception :helloworld.HelloException
Aug 15, 2015 6:57:06 PM org.apache.tuscany.sca.node.impl.NodeImpl stop
INFO: Stopping node: http://tuscany.apache.org/sca/1.1/nodes/default0
Aug 15, 2015 6:57:06 PM org.apache.tuscany.sca.core.assembly.impl.DomainRegistryImpl removeEndpoint
INFO: Remove endpoint - binding.rmi - rmi://localhost:8099/HelloWorldRemoteService
Aug 15, 2015 6:57:06 PM org.apache.tuscany.sca.host.rmi.DefaultRMIHost unregisterService
INFO: RMI service unregistered: rmi://localhost:8099/HelloWorldRemoteService
Aug 15, 2015 6:57:06 PM org.apache.tuscany.sca.core.assembly.impl.DomainRegistryImpl removeEndpoint
INFO: Remove endpoint - binding.sca - HelloWorldRmiServiceComponent/HelloWorldRmiService
Tests run: 1, Failures: 0, Errors: 0, Skipped: 0, Time elapsed: 1.401 sec

Results :

Tests run: 1, Failures: 0, Errors: 0, Skipped: 0

[JENKINS] Recording test results
[INFO] [jar:jar {execution: default-jar}]
[INFO] Building jar: <https://builds.apache.org/job/Tuscany-2x/ws/sca-2x/modules/binding-rmi-runtime/target/tuscany-binding-rmi-runtime-2.5-SNAPSHOT.jar>
[INFO] [source:jar-no-fork {execution: attach-sources}]
[INFO] Building jar: <https://builds.apache.org/job/Tuscany-2x/ws/sca-2x/modules/binding-rmi-runtime/target/tuscany-binding-rmi-runtime-2.5-SNAPSHOT-sources.jar>
[INFO] [install:install {execution: default-install}]
[INFO] Installing <https://builds.apache.org/job/Tuscany-2x/ws/sca-2x/modules/binding-rmi-runtime/target/tuscany-binding-rmi-runtime-2.5-SNAPSHOT.jar> to <https://builds.apache.org/job/Tuscany-2x/ws/.repository/org/apache/tuscany/sca/tuscany-binding-rmi-runtime/2.5-SNAPSHOT/tuscany-binding-rmi-runtime-2.5-SNAPSHOT.jar>
[INFO] Installing <https://builds.apache.org/job/Tuscany-2x/ws/sca-2x/modules/binding-rmi-runtime/target/tuscany-binding-rmi-runtime-2.5-SNAPSHOT-sources.jar> to <https://builds.apache.org/job/Tuscany-2x/ws/.repository/org/apache/tuscany/sca/tuscany-binding-rmi-runtime/2.5-SNAPSHOT/tuscany-binding-rmi-runtime-2.5-SNAPSHOT-sources.jar>
[JENKINS] Archiving disabled
[INFO] ------------------------------------------------------------------------
[INFO] Building Apache Tuscany SCA Websocket Binding Extension
[INFO]    task-segment: [clean, install]
[INFO] ------------------------------------------------------------------------
[INFO] [clean:clean {execution: default-clean}]
[JENKINS] Archiving disabled
[INFO] ------------------------------------------------------------------------
[ERROR] BUILD ERROR
[INFO] ------------------------------------------------------------------------
[INFO] Error building POM (may not be this project's POM).


Project ID: org.eclipse.jetty:jetty-project:pom:8.0.1.v20110908

Reason: Cannot find parent: org.eclipse.jetty:jetty-parent for project: org.eclipse.jetty:jetty-project:pom:8.0.1.v20110908 for project org.eclipse.jetty:jetty-project:pom:8.0.1.v20110908


[INFO] ------------------------------------------------------------------------
[INFO] For more information, run Maven with the -e switch
[INFO] ------------------------------------------------------------------------
[INFO] Total time: 9 minutes 3 seconds
[INFO] Finished at: Sat Aug 15 18:57:11 UTC 2015
[INFO] Final Memory: 273M/1133M
[INFO] ------------------------------------------------------------------------
channel stopped

Build failed in Jenkins: Tuscany-2x #1790

Posted by Apache Jenkins Server <je...@builds.apache.org>.
See <https://builds.apache.org/job/Tuscany-2x/1790/>

------------------------------------------
[...truncated 25315 lines...]
Aug 14, 2015 6:59:53 PM org.apache.tuscany.sca.core.assembly.impl.DomainRegistryImpl removeEndpoint
INFO: Remove endpoint - binding.rest - http://localhost:8085/EchoService/json/
Aug 14, 2015 6:59:53 PM org.apache.tuscany.sca.http.jetty.JettyServer removeServletMapping
INFO: Removed Servlet mapping: /EchoService/json/*
Aug 14, 2015 6:59:53 PM org.apache.tuscany.sca.core.assembly.impl.DomainRegistryImpl removeEndpoint
INFO: Remove endpoint - binding.rest - http://localhost:8085/EchoService/xml/
Aug 14, 2015 6:59:53 PM org.apache.tuscany.sca.http.jetty.JettyServer removeServletMapping
INFO: Removed Servlet mapping: /EchoService/xml/*
Aug 14, 2015 6:59:53 PM org.apache.tuscany.sca.http.jetty.JettyLogger info
INFO: Stopped SelectChannelConnector@localhost:8085
Running org.apache.tuscany.sca.binding.rest.rpc.EchoServiceTestCase
Tests run: 6, Failures: 0, Errors: 0, Skipped: 0, Time elapsed: 0.027 sec
Running org.apache.tuscany.sca.binding.rest.RESTBindingCacheTestCase
Tests run: 36, Failures: 0, Errors: 0, Skipped: 0, Time elapsed: 0.01 sec
Running org.apache.tuscany.sca.binding.rest.wireformat.json.CatalogServiceTestCase
Tests run: 7, Failures: 0, Errors: 0, Skipped: 0, Time elapsed: 0.003 sec
Running org.apache.tuscany.sca.binding.rest.RESTReferenceTestCase
Tests run: 1, Failures: 0, Errors: 1, Skipped: 0, Time elapsed: 0.004 sec <<< FAILURE!
testInvokeReference(org.apache.tuscany.sca.binding.rest.RESTReferenceTestCase)  Time elapsed: 0.001 sec  <<< ERROR!
java.lang.reflect.UndeclaredThrowableException
	at $Proxy39.echo(Unknown Source)
	at org.apache.tuscany.sca.binding.rest.RESTReferenceTestCase.testInvokeReference(RESTReferenceTestCase.java:61)
	at sun.reflect.NativeMethodAccessorImpl.invoke0(Native Method)
	at sun.reflect.NativeMethodAccessorImpl.invoke(NativeMethodAccessorImpl.java:39)
	at sun.reflect.DelegatingMethodAccessorImpl.invoke(DelegatingMethodAccessorImpl.java:25)
	at java.lang.reflect.Method.invoke(Method.java:597)
	at org.junit.runners.model.FrameworkMethod$1.runReflectiveCall(FrameworkMethod.java:44)
	at org.junit.internal.runners.model.ReflectiveCallable.run(ReflectiveCallable.java:15)
	at org.junit.runners.model.FrameworkMethod.invokeExplosively(FrameworkMethod.java:41)
	at org.junit.internal.runners.statements.InvokeMethod.evaluate(InvokeMethod.java:20)
	at org.junit.internal.runners.statements.RunBefores.evaluate(RunBefores.java:28)
	at org.junit.internal.runners.statements.RunAfters.evaluate(RunAfters.java:31)
	at org.junit.runners.BlockJUnit4ClassRunner.runChild(BlockJUnit4ClassRunner.java:76)
	at org.junit.runners.BlockJUnit4ClassRunner.runChild(BlockJUnit4ClassRunner.java:50)
	at org.junit.runners.ParentRunner$3.run(ParentRunner.java:193)
	at org.junit.runners.ParentRunner$1.schedule(ParentRunner.java:52)
	at org.junit.runners.ParentRunner.runChildren(ParentRunner.java:191)
	at org.junit.runners.ParentRunner.access$000(ParentRunner.java:42)
	at org.junit.runners.ParentRunner$2.evaluate(ParentRunner.java:184)
	at org.junit.runners.ParentRunner.run(ParentRunner.java:236)
	at org.junit.runners.Suite.runChild(Suite.java:128)
	at org.junit.runners.Suite.runChild(Suite.java:24)
	at org.junit.runners.ParentRunner$3.run(ParentRunner.java:193)
	at org.junit.runners.ParentRunner$1.schedule(ParentRunner.java:52)
	at org.junit.runners.ParentRunner.runChildren(ParentRunner.java:191)
	at org.junit.runners.ParentRunner.access$000(ParentRunner.java:42)
	at org.junit.runners.ParentRunner$2.evaluate(ParentRunner.java:184)
	at org.junit.runners.ParentRunner.run(ParentRunner.java:236)
	at org.junit.runner.JUnitCore.run(JUnitCore.java:157)
	at org.junit.runner.JUnitCore.run(JUnitCore.java:136)
	at org.junit.runner.JUnitCore.run(JUnitCore.java:127)
	at org.apache.maven.surefire.junitcore.JUnitCoreTestSet.runJunitCore(JUnitCoreTestSet.java:180)
	at org.apache.maven.surefire.junitcore.JUnitCoreTestSet.execute(JUnitCoreTestSet.java:86)
	at org.apache.maven.surefire.junitcore.JUnitCoreDirectoryTestSuite.execute(JUnitCoreDirectoryTestSuite.java:58)
	at org.apache.maven.surefire.Surefire.run(Surefire.java:180)
	at sun.reflect.NativeMethodAccessorImpl.invoke0(Native Method)
	at sun.reflect.NativeMethodAccessorImpl.invoke(NativeMethodAccessorImpl.java:39)
	at sun.reflect.DelegatingMethodAccessorImpl.invoke(DelegatingMethodAccessorImpl.java:25)
	at java.lang.reflect.Method.invoke(Method.java:597)
	at org.apache.maven.surefire.booter.SurefireBooter.runSuitesInProcess(SurefireBooter.java:350)
	at org.apache.maven.surefire.booter.SurefireBooter.main(SurefireBooter.java:1021)
Caused by: org.apache.tuscany.sca.core.scope.TargetResolutionException: scope container not running, lifecycleState=0
	at org.apache.tuscany.sca.core.scope.impl.StatelessScopeContainer.getWrapper(StatelessScopeContainer.java:42)
	at org.apache.tuscany.sca.implementation.java.invocation.JavaImplementationInvoker.invoke(JavaImplementationInvoker.java:122)
	at org.apache.tuscany.sca.binding.local.LocalSCABindingInvocationInterceptor.invoke(LocalSCABindingInvocationInterceptor.java:48)
	at org.apache.tuscany.sca.core.invocation.InterceptorAsyncImpl.invoke(InterceptorAsyncImpl.java:58)
	at org.apache.tuscany.sca.core.invocation.impl.JDKInvocationHandler.invoke(JDKInvocationHandler.java:351)
	at org.apache.tuscany.sca.core.invocation.impl.JDKInvocationHandler.invoke(JDKInvocationHandler.java:294)
	at org.apache.tuscany.sca.core.invocation.impl.JDKInvocationHandler.invoke(JDKInvocationHandler.java:125)
	at org.apache.tuscany.sca.core.invocation.impl.AsyncJDKInvocationHandler.doInvokeSync(AsyncJDKInvocationHandler.java:238)
	at org.apache.tuscany.sca.core.invocation.impl.AsyncJDKInvocationHandler.invoke(AsyncJDKInvocationHandler.java:157)
	... 41 more

Running org.apache.tuscany.sca.binding.rest.wireformat.binary.BinaryServiceTestCase
Tests run: 2, Failures: 0, Errors: 0, Skipped: 0, Time elapsed: 0.003 sec
Running org.apache.tuscany.sca.binding.rest.RESTBindingTestCase
Tests run: 2, Failures: 0, Errors: 0, Skipped: 0, Time elapsed: 0.003 sec
Running org.apache.tuscany.sca.binding.rest.wireformat.xml.CustomerServiceTestCase
Tests run: 4, Failures: 0, Errors: 0, Skipped: 0, Time elapsed: 0.002 sec

Results :

Tests in error: 
  testInvokeReference(org.apache.tuscany.sca.binding.rest.RESTReferenceTestCase)

Tests run: 58, Failures: 0, Errors: 1, Skipped: 0

[ERROR] There are test failures.

Please refer to <https://builds.apache.org/job/Tuscany-2x/ws/sca-2x/modules/binding-rest-runtime/target/surefire-reports> for the individual test results.
[JENKINS] Recording test results
[INFO] [jar:jar {execution: default-jar}]
[INFO] Building jar: <https://builds.apache.org/job/Tuscany-2x/ws/sca-2x/modules/binding-rest-runtime/target/tuscany-binding-rest-runtime-2.5-SNAPSHOT.jar>
[INFO] [source:jar-no-fork {execution: attach-sources}]
[INFO] Building jar: <https://builds.apache.org/job/Tuscany-2x/ws/sca-2x/modules/binding-rest-runtime/target/tuscany-binding-rest-runtime-2.5-SNAPSHOT-sources.jar>
[INFO] [install:install {execution: default-install}]
[INFO] Installing <https://builds.apache.org/job/Tuscany-2x/ws/sca-2x/modules/binding-rest-runtime/target/tuscany-binding-rest-runtime-2.5-SNAPSHOT.jar> to <https://builds.apache.org/job/Tuscany-2x/ws/.repository/org/apache/tuscany/sca/tuscany-binding-rest-runtime/2.5-SNAPSHOT/tuscany-binding-rest-runtime-2.5-SNAPSHOT.jar>
[INFO] Installing <https://builds.apache.org/job/Tuscany-2x/ws/sca-2x/modules/binding-rest-runtime/target/tuscany-binding-rest-runtime-2.5-SNAPSHOT-sources.jar> to <https://builds.apache.org/job/Tuscany-2x/ws/.repository/org/apache/tuscany/sca/tuscany-binding-rest-runtime/2.5-SNAPSHOT/tuscany-binding-rest-runtime-2.5-SNAPSHOT-sources.jar>
[JENKINS] Archiving disabled
[INFO] ------------------------------------------------------------------------
[INFO] Building Apache Tuscany SCA RMI Host Extension Point
[INFO]    task-segment: [clean, install]
[INFO] ------------------------------------------------------------------------
[INFO] [clean:clean {execution: default-clean}]
[INFO] [enforcer:enforce {execution: enforce-plugin-versions}]
[INFO] [remote-resources:process {execution: default}]
[INFO] [resources:resources {execution: default-resources}]
[INFO] Using 'UTF-8' encoding to copy filtered resources.
[INFO] Copying 1 resource
[INFO] Copying 3 resources
[INFO] Copying 3 resources
[INFO] [compiler:compile {execution: default-compile}]
[INFO] Compiling 8 source files to <https://builds.apache.org/job/Tuscany-2x/ws/sca-2x/modules/host-rmi/target/classes>
[INFO] [resources:testResources {execution: default-testResources}]
[INFO] Using 'UTF-8' encoding to copy filtered resources.
[INFO] skip non existing resourceDirectory <https://builds.apache.org/job/Tuscany-2x/ws/sca-2x/modules/host-rmi/src/test/resources>
[INFO] Copying 3 resources
[INFO] [compiler:testCompile {execution: default-testCompile}]
[INFO] Compiling 1 source file to <https://builds.apache.org/job/Tuscany-2x/ws/sca-2x/modules/host-rmi/target/test-classes>
[INFO] [surefire:test {execution: default-test}]
[INFO] Surefire report directory: <https://builds.apache.org/job/Tuscany-2x/ws/sca-2x/modules/host-rmi/target/surefire-reports>

-------------------------------------------------------
 T E S T S
-------------------------------------------------------
Running org.apache.tuscany.sca.host.rmi.RMIHostImplTestCase
Aug 14, 2015 7:02:05 PM org.apache.tuscany.sca.host.rmi.DefaultRMIHost registerService
INFO: RMI service registered: rmi://localhost:9996/foo1
Aug 14, 2015 7:02:05 PM org.apache.tuscany.sca.host.rmi.DefaultRMIHost unregisterService
INFO: RMI service unregistered: rmi://localhost:9996/foo1
Aug 14, 2015 7:02:05 PM org.apache.tuscany.sca.host.rmi.DefaultRMIHost registerService
INFO: RMI service registered: rmi://localhost:9995/foo1
Aug 14, 2015 7:02:05 PM org.apache.tuscany.sca.host.rmi.DefaultRMIHost registerService
INFO: RMI service registered: rmi://localhost:9995/foo2
Aug 14, 2015 7:02:05 PM org.apache.tuscany.sca.host.rmi.DefaultRMIHost unregisterService
INFO: RMI service unregistered: rmi://localhost:9995/foo1
Aug 14, 2015 7:02:05 PM org.apache.tuscany.sca.host.rmi.DefaultRMIHost unregisterService
INFO: RMI service unregistered: rmi://localhost:9995/foo2
Aug 14, 2015 7:02:05 PM org.apache.tuscany.sca.host.rmi.DefaultRMIHost registerService
INFO: RMI service registered: rmi://localhost:9999/bar1
Aug 14, 2015 7:02:05 PM org.apache.tuscany.sca.host.rmi.DefaultRMIHost unregisterService
INFO: RMI service unregistered: rmi://localhost:9999/bar1
Aug 14, 2015 7:02:05 PM org.apache.tuscany.sca.host.rmi.DefaultRMIHost registerService
INFO: RMI service registered: rmi://localhost:9997/bar2
Aug 14, 2015 7:02:05 PM org.apache.tuscany.sca.host.rmi.DefaultRMIHost unregisterService
INFO: RMI service unregistered: rmi://localhost:9997/bar2
Tests run: 7, Failures: 0, Errors: 0, Skipped: 0, Time elapsed: 127.792 sec

Results :

Tests run: 7, Failures: 0, Errors: 0, Skipped: 0

[JENKINS] Recording test results
[INFO] [jar:jar {execution: default-jar}]
[INFO] Building jar: <https://builds.apache.org/job/Tuscany-2x/ws/sca-2x/modules/host-rmi/target/tuscany-host-rmi-2.5-SNAPSHOT.jar>
[INFO] [source:jar-no-fork {execution: attach-sources}]
[INFO] Building jar: <https://builds.apache.org/job/Tuscany-2x/ws/sca-2x/modules/host-rmi/target/tuscany-host-rmi-2.5-SNAPSHOT-sources.jar>
[INFO] [install:install {execution: default-install}]
[INFO] Installing <https://builds.apache.org/job/Tuscany-2x/ws/sca-2x/modules/host-rmi/target/tuscany-host-rmi-2.5-SNAPSHOT.jar> to <https://builds.apache.org/job/Tuscany-2x/ws/.repository/org/apache/tuscany/sca/tuscany-host-rmi/2.5-SNAPSHOT/tuscany-host-rmi-2.5-SNAPSHOT.jar>
[INFO] Installing <https://builds.apache.org/job/Tuscany-2x/ws/sca-2x/modules/host-rmi/target/tuscany-host-rmi-2.5-SNAPSHOT-sources.jar> to <https://builds.apache.org/job/Tuscany-2x/ws/.repository/org/apache/tuscany/sca/tuscany-host-rmi/2.5-SNAPSHOT/tuscany-host-rmi-2.5-SNAPSHOT-sources.jar>
[JENKINS] Archiving disabled
[INFO] ------------------------------------------------------------------------
[INFO] Building Apache Tuscany SCA RMI Binding Extension
[INFO]    task-segment: [clean, install]
[INFO] ------------------------------------------------------------------------
[INFO] [clean:clean {execution: default-clean}]
[INFO] [enforcer:enforce {execution: enforce-plugin-versions}]
[INFO] [remote-resources:process {execution: default}]
[INFO] [resources:resources {execution: default-resources}]
[INFO] Using 'UTF-8' encoding to copy filtered resources.
[INFO] Copying 1 resource
[INFO] Copying 3 resources
[INFO] Copying 3 resources
[INFO] [compiler:compile {execution: default-compile}]
[INFO] Compiling 5 source files to <https://builds.apache.org/job/Tuscany-2x/ws/sca-2x/modules/binding-rmi-runtime/target/classes>
[INFO] [resources:testResources {execution: default-testResources}]
[INFO] Using 'UTF-8' encoding to copy filtered resources.
[INFO] Copying 3 resources
[INFO] Copying 3 resources
[INFO] [compiler:testCompile {execution: default-testCompile}]
[INFO] Compiling 6 source files to <https://builds.apache.org/job/Tuscany-2x/ws/sca-2x/modules/binding-rmi-runtime/target/test-classes>
[INFO] [surefire:test {execution: default-test}]
[INFO] Surefire report directory: <https://builds.apache.org/job/Tuscany-2x/ws/sca-2x/modules/binding-rmi-runtime/target/surefire-reports>

-------------------------------------------------------
 T E S T S
-------------------------------------------------------
Running org.apache.tuscany.sca.binding.rmi.BindingTestCase
Aug 14, 2015 7:02:09 PM org.apache.tuscany.sca.node.impl.NodeImpl start
INFO: Starting node: http://tuscany.apache.org/sca/1.1/nodes/default0 domain: default
Aug 14, 2015 7:02:09 PM org.apache.tuscany.sca.node.impl.NodeFactoryImpl loadContributions
INFO: Loading contribution: <https://builds.apache.org/job/Tuscany-2x/ws/sca-2x/modules/binding-rmi-runtime/target/test-classes/>
Aug 14, 2015 7:02:10 PM org.apache.tuscany.sca.host.rmi.DefaultRMIHost registerService
INFO: RMI service registered: rmi://localhost:8099/HelloWorldRemoteService
Aug 14, 2015 7:02:10 PM org.apache.tuscany.sca.core.assembly.impl.DomainRegistryImpl addEndpoint
INFO: Add endpoint - binding.rmi - rmi://localhost:8099/HelloWorldRemoteService
Aug 14, 2015 7:02:10 PM org.apache.tuscany.sca.core.assembly.impl.DomainRegistryImpl addEndpoint
INFO: Add endpoint - binding.sca - HelloWorldRmiServiceComponent/HelloWorldRmiService
Hello from the RMI Service to - Tuscany World! thro the RMI Reference
Hi from Apache World in RMI Service to - Tuscany World! thro the RMI Reference
Expected exception :helloworld.HelloException
Aug 14, 2015 7:02:10 PM org.apache.tuscany.sca.node.impl.NodeImpl stop
INFO: Stopping node: http://tuscany.apache.org/sca/1.1/nodes/default0
Aug 14, 2015 7:02:10 PM org.apache.tuscany.sca.core.assembly.impl.DomainRegistryImpl removeEndpoint
INFO: Remove endpoint - binding.rmi - rmi://localhost:8099/HelloWorldRemoteService
Aug 14, 2015 7:02:10 PM org.apache.tuscany.sca.host.rmi.DefaultRMIHost unregisterService
INFO: RMI service unregistered: rmi://localhost:8099/HelloWorldRemoteService
Aug 14, 2015 7:02:10 PM org.apache.tuscany.sca.core.assembly.impl.DomainRegistryImpl removeEndpoint
INFO: Remove endpoint - binding.sca - HelloWorldRmiServiceComponent/HelloWorldRmiService
Tests run: 1, Failures: 0, Errors: 0, Skipped: 0, Time elapsed: 1.42 sec

Results :

Tests run: 1, Failures: 0, Errors: 0, Skipped: 0

[JENKINS] Recording test results
[INFO] [jar:jar {execution: default-jar}]
[INFO] Building jar: <https://builds.apache.org/job/Tuscany-2x/ws/sca-2x/modules/binding-rmi-runtime/target/tuscany-binding-rmi-runtime-2.5-SNAPSHOT.jar>
[INFO] [source:jar-no-fork {execution: attach-sources}]
[INFO] Building jar: <https://builds.apache.org/job/Tuscany-2x/ws/sca-2x/modules/binding-rmi-runtime/target/tuscany-binding-rmi-runtime-2.5-SNAPSHOT-sources.jar>
[INFO] [install:install {execution: default-install}]
[INFO] Installing <https://builds.apache.org/job/Tuscany-2x/ws/sca-2x/modules/binding-rmi-runtime/target/tuscany-binding-rmi-runtime-2.5-SNAPSHOT.jar> to <https://builds.apache.org/job/Tuscany-2x/ws/.repository/org/apache/tuscany/sca/tuscany-binding-rmi-runtime/2.5-SNAPSHOT/tuscany-binding-rmi-runtime-2.5-SNAPSHOT.jar>
[INFO] Installing <https://builds.apache.org/job/Tuscany-2x/ws/sca-2x/modules/binding-rmi-runtime/target/tuscany-binding-rmi-runtime-2.5-SNAPSHOT-sources.jar> to <https://builds.apache.org/job/Tuscany-2x/ws/.repository/org/apache/tuscany/sca/tuscany-binding-rmi-runtime/2.5-SNAPSHOT/tuscany-binding-rmi-runtime-2.5-SNAPSHOT-sources.jar>
[JENKINS] Archiving disabled
[INFO] ------------------------------------------------------------------------
[INFO] Building Apache Tuscany SCA Websocket Binding Extension
[INFO]    task-segment: [clean, install]
[INFO] ------------------------------------------------------------------------
[INFO] [clean:clean {execution: default-clean}]
[JENKINS] Archiving disabled
[INFO] ------------------------------------------------------------------------
[ERROR] BUILD ERROR
[INFO] ------------------------------------------------------------------------
[INFO] Error building POM (may not be this project's POM).


Project ID: org.eclipse.jetty:jetty-project:pom:8.0.1.v20110908

Reason: Cannot find parent: org.eclipse.jetty:jetty-parent for project: org.eclipse.jetty:jetty-project:pom:8.0.1.v20110908 for project org.eclipse.jetty:jetty-project:pom:8.0.1.v20110908


[INFO] ------------------------------------------------------------------------
[INFO] For more information, run Maven with the -e switch
[INFO] ------------------------------------------------------------------------
[INFO] Total time: 13 minutes 5 seconds
[INFO] Finished at: Fri Aug 14 19:02:12 UTC 2015
[INFO] Final Memory: 272M/1024M
[INFO] ------------------------------------------------------------------------
channel stopped

Build failed in Jenkins: Tuscany-2x #1789

Posted by Apache Jenkins Server <je...@builds.apache.org>.
See <https://builds.apache.org/job/Tuscany-2x/1789/>

------------------------------------------
[...truncated 16541 lines...]
)
Aug 13, 2015 6:51:20 PM org.apache.tuscany.sca.contribution.namespace.impl.NamespaceImportProcessor [] (AttributeNameSpaceMissing)
SEVERE: Attribute ''namespace'' is missing
Tests run: 2, Failures: 0, Errors: 0, Skipped: 0, Time elapsed: 0.022 sec

Results :

Tests run: 26, Failures: 0, Errors: 0, Skipped: 0

[JENKINS] Recording test results
[INFO] [jar:jar {execution: default-jar}]
[INFO] Building jar: <https://builds.apache.org/job/Tuscany-2x/ws/sca-2x/modules/contribution/target/tuscany-contribution-2.5-SNAPSHOT.jar>
[INFO] [source:jar-no-fork {execution: attach-sources}]
[INFO] Building jar: <https://builds.apache.org/job/Tuscany-2x/ws/sca-2x/modules/contribution/target/tuscany-contribution-2.5-SNAPSHOT-sources.jar>
[INFO] [install:install {execution: default-install}]
[INFO] Installing <https://builds.apache.org/job/Tuscany-2x/ws/sca-2x/modules/contribution/target/tuscany-contribution-2.5-SNAPSHOT.jar> to <https://builds.apache.org/job/Tuscany-2x/ws/.repository/org/apache/tuscany/sca/tuscany-contribution/2.5-SNAPSHOT/tuscany-contribution-2.5-SNAPSHOT.jar>
[INFO] Installing <https://builds.apache.org/job/Tuscany-2x/ws/sca-2x/modules/contribution/target/tuscany-contribution-2.5-SNAPSHOT-sources.jar> to <https://builds.apache.org/job/Tuscany-2x/ws/.repository/org/apache/tuscany/sca/tuscany-contribution/2.5-SNAPSHOT/tuscany-contribution-2.5-SNAPSHOT-sources.jar>
[JENKINS] Archiving disabled
[INFO] ------------------------------------------------------------------------
[INFO] Building Apache Tuscany SCA Node API
[INFO]    task-segment: [clean, install]
[INFO] ------------------------------------------------------------------------
[INFO] [clean:clean {execution: default-clean}]
[INFO] [enforcer:enforce {execution: enforce-plugin-versions}]
[INFO] [remote-resources:process {execution: default}]
[INFO] [resources:resources {execution: default-resources}]
[INFO] Using 'UTF-8' encoding to copy filtered resources.
[INFO] skip non existing resourceDirectory <https://builds.apache.org/job/Tuscany-2x/ws/sca-2x/modules/node-api/src/main/resources>
[INFO] Copying 3 resources
[INFO] Copying 3 resources
[INFO] [compiler:compile {execution: default-compile}]
[INFO] Compiling 19 source files to <https://builds.apache.org/job/Tuscany-2x/ws/sca-2x/modules/node-api/target/classes>
[INFO] [resources:testResources {execution: default-testResources}]
[INFO] Using 'UTF-8' encoding to copy filtered resources.
[INFO] skip non existing resourceDirectory <https://builds.apache.org/job/Tuscany-2x/ws/sca-2x/modules/node-api/src/test/resources>
[INFO] Copying 3 resources
[INFO] [compiler:testCompile {execution: default-testCompile}]
[INFO] No sources to compile
[INFO] [surefire:test {execution: default-test}]
[INFO] Surefire report directory: <https://builds.apache.org/job/Tuscany-2x/ws/sca-2x/modules/node-api/target/surefire-reports>

-------------------------------------------------------
 T E S T S
-------------------------------------------------------
There are no tests to run.

Results :

Tests run: 0, Failures: 0, Errors: 0, Skipped: 0

[JENKINS] Recording test results
[INFO] [jar:jar {execution: default-jar}]
[INFO] Building jar: <https://builds.apache.org/job/Tuscany-2x/ws/sca-2x/modules/node-api/target/tuscany-node-api-2.5-SNAPSHOT.jar>
[INFO] [source:jar-no-fork {execution: attach-sources}]
[INFO] Building jar: <https://builds.apache.org/job/Tuscany-2x/ws/sca-2x/modules/node-api/target/tuscany-node-api-2.5-SNAPSHOT-sources.jar>
[INFO] [install:install {execution: default-install}]
[INFO] Installing <https://builds.apache.org/job/Tuscany-2x/ws/sca-2x/modules/node-api/target/tuscany-node-api-2.5-SNAPSHOT.jar> to <https://builds.apache.org/job/Tuscany-2x/ws/.repository/org/apache/tuscany/sca/tuscany-node-api/2.5-SNAPSHOT/tuscany-node-api-2.5-SNAPSHOT.jar>
[INFO] Installing <https://builds.apache.org/job/Tuscany-2x/ws/sca-2x/modules/node-api/target/tuscany-node-api-2.5-SNAPSHOT-sources.jar> to <https://builds.apache.org/job/Tuscany-2x/ws/.repository/org/apache/tuscany/sca/tuscany-node-api/2.5-SNAPSHOT/tuscany-node-api-2.5-SNAPSHOT-sources.jar>
[JENKINS] Archiving disabled
[INFO] ------------------------------------------------------------------------
[INFO] Building Apache Tuscany SCA Core SPI
[INFO]    task-segment: [clean, install]
[INFO] ------------------------------------------------------------------------
Downloading: http://repo1.maven.org/maven2/org/codehaus/mojo/buildnumber-maven-plugin/1.0-beta-4/buildnumber-maven-plugin-1.0-beta-4.pom
9K downloaded  (buildnumber-maven-plugin-1.0-beta-4.pom)
Downloading: http://repo1.maven.org/maven2/org/codehaus/mojo/mojo-parent/22/mojo-parent-22.pom
18K downloaded  (mojo-parent-22.pom)
Downloading: http://repo1.maven.org/maven2/org/codehaus/mojo/buildnumber-maven-plugin/1.0-beta-4/buildnumber-maven-plugin-1.0-beta-4.jar
21K downloaded  (buildnumber-maven-plugin-1.0-beta-4.jar)
Downloading: http://repo1.maven.org/maven2/org/apache/maven/plugins/maven-antrun-plugin/1.7/maven-antrun-plugin-1.7.pom
4K downloaded  (maven-antrun-plugin-1.7.pom)
Downloading: http://repo1.maven.org/maven2/org/apache/maven/plugins/maven-plugins/22/maven-plugins-22.pom
12K downloaded  (maven-plugins-22.pom)
Downloading: http://repo1.maven.org/maven2/org/apache/maven/plugins/maven-antrun-plugin/1.7/maven-antrun-plugin-1.7.jar
30K downloaded  (maven-antrun-plugin-1.7.jar)
[INFO] [clean:clean {execution: default-clean}]
[INFO] [enforcer:enforce {execution: enforce-plugin-versions}]
Downloading: http://repo1.maven.org/maven2/org/apache/maven/scm/maven-scm-api/1.2/maven-scm-api-1.2.pom
1K downloaded  (maven-scm-api-1.2.pom)
Downloading: http://repo1.maven.org/maven2/org/apache/maven/scm/maven-scm/1.2/maven-scm-1.2.pom
11K downloaded  (maven-scm-1.2.pom)
Downloading: http://repo1.maven.org/maven2/org/apache/maven/scm/maven-scm-manager-plexus/1.2/maven-scm-manager-plexus-1.2.pom
2K downloaded  (maven-scm-manager-plexus-1.2.pom)
Downloading: http://repo1.maven.org/maven2/org/apache/maven/scm/maven-scm-managers/1.2/maven-scm-managers-1.2.pom
1K downloaded  (maven-scm-managers-1.2.pom)
Downloading: http://repo1.maven.org/maven2/org/apache/maven/scm/maven-scm-provider-svnexe/1.2/maven-scm-provider-svnexe-1.2.pom
2K downloaded  (maven-scm-provider-svnexe-1.2.pom)
Downloading: http://repo1.maven.org/maven2/org/apache/maven/scm/maven-scm-providers-svn/1.2/maven-scm-providers-svn-1.2.pom
1K downloaded  (maven-scm-providers-svn-1.2.pom)
Downloading: http://repo1.maven.org/maven2/org/apache/maven/scm/maven-scm-providers/1.2/maven-scm-providers-1.2.pom
3K downloaded  (maven-scm-providers-1.2.pom)
Downloading: http://svn.apache.org/repos/asf/tuscany/maven/org/apache/maven/scm/maven-scm-provider-svn-commons/1.2/maven-scm-provider-svn-commons-1.2.pom
[INFO] Unable to find resource 'org.apache.maven.scm:maven-scm-provider-svn-commons:pom:1.2' in repository tuscany.repo (http://svn.apache.org/repos/asf/tuscany/maven)
Downloading: https://repository.apache.org/content/groups/public//org/apache/maven/scm/maven-scm-provider-svn-commons/1.2/maven-scm-provider-svn-commons-1.2.pom
[WARNING] Unable to get resource 'org.apache.maven.scm:maven-scm-provider-svn-commons:pom:1.2' from repository apache.nexus (https://repository.apache.org/content/groups/public/): Error transferring file: java.lang.RuntimeException: Could not generate DH keypair
Downloading: http://repo1.maven.org/maven2/org/apache/maven/scm/maven-scm-provider-svn-commons/1.2/maven-scm-provider-svn-commons-1.2.pom
1K downloaded  (maven-scm-provider-svn-commons-1.2.pom)
Downloading: http://svn.apache.org/repos/asf/tuscany/maven/regexp/regexp/1.3/regexp-1.3.pom
[INFO] Unable to find resource 'regexp:regexp:pom:1.3' in repository tuscany.repo (http://svn.apache.org/repos/asf/tuscany/maven)
Downloading: https://repository.apache.org/content/groups/public//regexp/regexp/1.3/regexp-1.3.pom
[WARNING] Unable to get resource 'regexp:regexp:pom:1.3' from repository apache.nexus (https://repository.apache.org/content/groups/public/): Error transferring file: java.lang.RuntimeException: Could not generate DH keypair
Downloading: http://repo1.maven.org/maven2/regexp/regexp/1.3/regexp-1.3.pom
145b downloaded  (regexp-1.3.pom)
Downloading: http://repo1.maven.org/maven2/org/apache/maven/scm/maven-scm-provider-cvsexe/1.2/maven-scm-provider-cvsexe-1.2.pom
2K downloaded  (maven-scm-provider-cvsexe-1.2.pom)
Downloading: http://repo1.maven.org/maven2/org/apache/maven/scm/maven-scm-providers-cvs/1.2/maven-scm-providers-cvs-1.2.pom
1K downloaded  (maven-scm-providers-cvs-1.2.pom)
Downloading: http://svn.apache.org/repos/asf/tuscany/maven/org/apache/maven/scm/maven-scm-provider-cvs-commons/1.2/maven-scm-provider-cvs-commons-1.2.pom
[INFO] Unable to find resource 'org.apache.maven.scm:maven-scm-provider-cvs-commons:pom:1.2' in repository tuscany.repo (http://svn.apache.org/repos/asf/tuscany/maven)
Downloading: https://repository.apache.org/content/groups/public//org/apache/maven/scm/maven-scm-provider-cvs-commons/1.2/maven-scm-provider-cvs-commons-1.2.pom
[WARNING] Unable to get resource 'org.apache.maven.scm:maven-scm-provider-cvs-commons:pom:1.2' from repository apache.nexus (https://repository.apache.org/content/groups/public/): Error transferring file: java.lang.RuntimeException: Could not generate DH keypair
Downloading: http://repo1.maven.org/maven2/org/apache/maven/scm/maven-scm-provider-cvs-commons/1.2/maven-scm-provider-cvs-commons-1.2.pom
2K downloaded  (maven-scm-provider-cvs-commons-1.2.pom)
Downloading: http://repo1.maven.org/maven2/org/apache/maven/scm/maven-scm-provider-starteam/1.2/maven-scm-provider-starteam-1.2.pom
2K downloaded  (maven-scm-provider-starteam-1.2.pom)
Downloading: http://repo1.maven.org/maven2/org/apache/maven/scm/maven-scm-provider-clearcase/1.2/maven-scm-provider-clearcase-1.2.pom
2K downloaded  (maven-scm-provider-clearcase-1.2.pom)
Downloading: http://repo1.maven.org/maven2/org/apache/maven/scm/maven-scm-provider-perforce/1.2/maven-scm-provider-perforce-1.2.pom
2K downloaded  (maven-scm-provider-perforce-1.2.pom)
Downloading: http://repo1.maven.org/maven2/org/apache/maven/scm/maven-scm-provider-hg/1.2/maven-scm-provider-hg-1.2.pom
2K downloaded  (maven-scm-provider-hg-1.2.pom)
Downloading: http://repo1.maven.org/maven2/com/google/code/maven-scm-provider-svnjava/maven-scm-provider-svnjava/1.8/maven-scm-provider-svnjava-1.8.pom
7K downloaded  (maven-scm-provider-svnjava-1.8.pom)
Downloading: http://svn.apache.org/repos/asf/tuscany/maven/net/java/dev/jna/jna/3.2.2/jna-3.2.2.pom
[INFO] Unable to find resource 'net.java.dev.jna:jna:pom:3.2.2' in repository tuscany.repo (http://svn.apache.org/repos/asf/tuscany/maven)
Downloading: https://repository.apache.org/content/groups/public//net/java/dev/jna/jna/3.2.2/jna-3.2.2.pom
[WARNING] Unable to get resource 'net.java.dev.jna:jna:pom:3.2.2' from repository apache.nexus (https://repository.apache.org/content/groups/public/): Error transferring file: java.lang.RuntimeException: Could not generate DH keypair
Downloading: http://repo1.maven.org/maven2/net/java/dev/jna/jna/3.2.2/jna-3.2.2.pom
1K downloaded  (jna-3.2.2.pom)
Downloading: http://repo1.maven.org/maven2/org/tmatesoft/svnkit/svnkit/1.3.1-1/svnkit-1.3.1-1.pom
1K downloaded  (svnkit-1.3.1-1.pom)
Downloading: http://svn.apache.org/repos/asf/tuscany/maven/com/trilead/trilead-ssh2/build213-svnkit-1.3-patch/trilead-ssh2-build213-svnkit-1.3-patch.pom
[INFO] Unable to find resource 'com.trilead:trilead-ssh2:pom:build213-svnkit-1.3-patch' in repository tuscany.repo (http://svn.apache.org/repos/asf/tuscany/maven)
Downloading: https://repository.apache.org/content/groups/public//com/trilead/trilead-ssh2/build213-svnkit-1.3-patch/trilead-ssh2-build213-svnkit-1.3-patch.pom
[WARNING] Unable to get resource 'com.trilead:trilead-ssh2:pom:build213-svnkit-1.3-patch' from repository apache.nexus (https://repository.apache.org/content/groups/public/): Error transferring file: java.lang.RuntimeException: Could not generate DH keypair
Downloading: http://repo1.maven.org/maven2/com/trilead/trilead-ssh2/build213-svnkit-1.3-patch/trilead-ssh2-build213-svnkit-1.3-patch.pom
716b downloaded  (trilead-ssh2-build213-svnkit-1.3-patch.pom)
Downloading: http://svn.apache.org/repos/asf/tuscany/maven/org/tmatesoft/sqljet/sqljet/1.0.0-1/sqljet-1.0.0-1.pom
[INFO] Unable to find resource 'org.tmatesoft.sqljet:sqljet:pom:1.0.0-1' in repository tuscany.repo (http://svn.apache.org/repos/asf/tuscany/maven)
Downloading: https://repository.apache.org/content/groups/public//org/tmatesoft/sqljet/sqljet/1.0.0-1/sqljet-1.0.0-1.pom
[WARNING] Unable to get resource 'org.tmatesoft.sqljet:sqljet:pom:1.0.0-1' from repository apache.nexus (https://repository.apache.org/content/groups/public/): Error transferring file: java.lang.RuntimeException: Could not generate DH keypair
Downloading: http://repo1.maven.org/maven2/org/tmatesoft/sqljet/sqljet/1.0.0-1/sqljet-1.0.0-1.pom
774b downloaded  (sqljet-1.0.0-1.pom)
Downloading: http://svn.apache.org/repos/asf/tuscany/maven/org/antlr/antlr-runtime/3.1.3/antlr-runtime-3.1.3.pom
[INFO] Unable to find resource 'org.antlr:antlr-runtime:pom:3.1.3' in repository tuscany.repo (http://svn.apache.org/repos/asf/tuscany/maven)
Downloading: https://repository.apache.org/content/groups/public//org/antlr/antlr-runtime/3.1.3/antlr-runtime-3.1.3.pom
[WARNING] Unable to get resource 'org.antlr:antlr-runtime:pom:3.1.3' from repository apache.nexus (https://repository.apache.org/content/groups/public/): Error transferring file: java.lang.RuntimeException: Could not generate DH keypair
Downloading: http://repo1.maven.org/maven2/org/antlr/antlr-runtime/3.1.3/antlr-runtime-3.1.3.pom
3K downloaded  (antlr-runtime-3.1.3.pom)
Downloading: http://svn.apache.org/repos/asf/tuscany/maven/org/antlr/antlr-master/3.1.3/antlr-master-3.1.3.pom
[INFO] Unable to find resource 'org.antlr:antlr-master:pom:3.1.3' in repository tuscany.repo (http://svn.apache.org/repos/asf/tuscany/maven)
Downloading: https://repository.apache.org/content/groups/public//org/antlr/antlr-master/3.1.3/antlr-master-3.1.3.pom
[WARNING] Unable to get resource 'org.antlr:antlr-master:pom:3.1.3' from repository apache.nexus (https://repository.apache.org/content/groups/public/): Error transferring file: java.lang.RuntimeException: Could not generate DH keypair
Downloading: http://repo1.maven.org/maven2/org/antlr/antlr-master/3.1.3/antlr-master-3.1.3.pom
8K downloaded  (antlr-master-3.1.3.pom)
Downloading: http://svn.apache.org/repos/asf/tuscany/maven/org/antlr/stringtemplate/3.2/stringtemplate-3.2.pom
[INFO] Unable to find resource 'org.antlr:stringtemplate:pom:3.2' in repository tuscany.repo (http://svn.apache.org/repos/asf/tuscany/maven)
Downloading: https://repository.apache.org/content/groups/public//org/antlr/stringtemplate/3.2/stringtemplate-3.2.pom
[WARNING] Unable to get resource 'org.antlr:stringtemplate:pom:3.2' from repository apache.nexus (https://repository.apache.org/content/groups/public/): Error transferring file: java.lang.RuntimeException: Could not generate DH keypair
Downloading: http://antlr.org/antlr-snapshot/org/antlr/stringtemplate/3.2/stringtemplate-3.2.pom
[INFO] Unable to find resource 'org.antlr:stringtemplate:pom:3.2' in repository antlr-snapshot (http://antlr.org/antlr-snapshot)
Downloading: http://repo1.maven.org/maven2/org/antlr/stringtemplate/3.2/stringtemplate-3.2.pom
1K downloaded  (stringtemplate-3.2.pom)
Downloading: http://repo1.maven.org/maven2/org/tmatesoft/svnkit/svnkit/1.3.1-1/svnkit-1.3.1-1.jar
Downloading: http://repo1.maven.org/maven2/org/apache/maven/scm/maven-scm-api/1.2/maven-scm-api-1.2.jar
Downloading: http://svn.apache.org/repos/asf/tuscany/maven/org/antlr/antlr-runtime/3.1.3/antlr-runtime-3.1.3.jar
Downloading: http://svn.apache.org/repos/asf/tuscany/maven/org/tmatesoft/sqljet/sqljet/1.0.0-1/sqljet-1.0.0-1.jar
Downloading: http://repo1.maven.org/maven2/net/java/dev/jna/jna/3.2.2/jna-3.2.2.jar
82K downloaded  (maven-scm-api-1.2.jar)
Downloading: http://svn.apache.org/repos/asf/tuscany/maven/com/trilead/trilead-ssh2/build213-svnkit-1.3-patch/trilead-ssh2-build213-svnkit-1.3-patch.jar
1882K downloaded  (svnkit-1.3.1-1.jar)
838K downloaded  (jna-3.2.2.jar)
Downloading: http://repo1.maven.org/maven2/com/google/code/maven-scm-provider-svnjava/maven-scm-provider-svnjava/1.8/maven-scm-provider-svnjava-1.8.jar
Downloading: http://svn.apache.org/repos/asf/tuscany/maven/regexp/regexp/1.3/regexp-1.3.jar
43K downloaded  (maven-scm-provider-svnjava-1.8.jar)
Downloading: http://repo1.maven.org/maven2/org/apache/maven/scm/maven-scm-manager-plexus/1.2/maven-scm-manager-plexus-1.2.jar
10K downloaded  (maven-scm-manager-plexus-1.2.jar)
[INFO] Unable to find resource 'org.tmatesoft.sqljet:sqljet:jar:1.0.0-1' in repository tuscany.repo (http://svn.apache.org/repos/asf/tuscany/maven)
Downloading: https://repository.apache.org/content/groups/public//org/tmatesoft/sqljet/sqljet/1.0.0-1/sqljet-1.0.0-1.jar
[INFO] Unable to find resource 'org.antlr:antlr-runtime:jar:3.1.3' in repository tuscany.repo (http://svn.apache.org/repos/asf/tuscany/maven)
Downloading: https://repository.apache.org/content/groups/public//org/antlr/antlr-runtime/3.1.3/antlr-runtime-3.1.3.jar
Downloading: http://repo1.maven.org/maven2/org/apache/maven/scm/maven-scm-provider-svnexe/1.2/maven-scm-provider-svnexe-1.2.jar
58K downloaded  (maven-scm-provider-svnexe-1.2.jar)
Downloading: http://repo1.maven.org/maven2/org/apache/maven/scm/maven-scm-provider-svn-commons/1.2/maven-scm-provider-svn-commons-1.2.jar
36K downloaded  (maven-scm-provider-svn-commons-1.2.jar)
[INFO] Unable to find resource 'com.trilead:trilead-ssh2:jar:build213-svnkit-1.3-patch' in repository tuscany.repo (http://svn.apache.org/repos/asf/tuscany/maven)
Downloading: https://repository.apache.org/content/groups/public//com/trilead/trilead-ssh2/build213-svnkit-1.3-patch/trilead-ssh2-build213-svnkit-1.3-patch.jar
Downloading: http://repo1.maven.org/maven2/org/apache/maven/scm/maven-scm-provider-cvsexe/1.2/maven-scm-provider-cvsexe-1.2.jar
26K downloaded  (maven-scm-provider-cvsexe-1.2.jar)
Downloading: http://svn.apache.org/repos/asf/tuscany/maven/org/apache/maven/scm/maven-scm-provider-cvs-commons/1.2/maven-scm-provider-cvs-commons-1.2.jar
[INFO] Unable to find resource 'regexp:regexp:jar:1.3' in repository tuscany.repo (http://svn.apache.org/repos/asf/tuscany/maven)
Downloading: https://repository.apache.org/content/groups/public//regexp/regexp/1.3/regexp-1.3.jar
[INFO] Unable to find resource 'org.apache.maven.scm:maven-scm-provider-cvs-commons:jar:1.2' in repository tuscany.repo (http://svn.apache.org/repos/asf/tuscany/maven)
Downloading: https://repository.apache.org/content/groups/public//org/apache/maven/scm/maven-scm-provider-cvs-commons/1.2/maven-scm-provider-cvs-commons-1.2.jar
[WARNING] Unable to get resource 'org.antlr:antlr-runtime:jar:3.1.3' from repository apache.nexus (https://repository.apache.org/content/groups/public/): Error transferring file: java.lang.RuntimeException: Could not generate DH keypair
Downloading: http://repo1.maven.org/maven2/org/antlr/antlr-runtime/3.1.3/antlr-runtime-3.1.3.jar
[WARNING] Unable to get resource 'org.tmatesoft.sqljet:sqljet:jar:1.0.0-1' from repository apache.nexus (https://repository.apache.org/content/groups/public/): Error transferring file: java.lang.RuntimeException: Could not generate DH keypair
Downloading: http://repo1.maven.org/maven2/org/tmatesoft/sqljet/sqljet/1.0.0-1/sqljet-1.0.0-1.jar
147K downloaded  (antlr-runtime-3.1.3.jar)
Downloading: http://svn.apache.org/repos/asf/tuscany/maven/org/antlr/stringtemplate/3.2/stringtemplate-3.2.jar
[WARNING] Unable to get resource 'com.trilead:trilead-ssh2:jar:build213-svnkit-1.3-patch' from repository apache.nexus (https://repository.apache.org/content/groups/public/): Error transferring file: java.lang.RuntimeException: Could not generate DH keypair
Downloading: http://repo1.maven.org/maven2/com/trilead/trilead-ssh2/build213-svnkit-1.3-patch/trilead-ssh2-build213-svnkit-1.3-patch.jar
245K downloaded  (trilead-ssh2-build213-svnkit-1.3-patch.jar)
656K downloaded  (sqljet-1.0.0-1.jar)
[WARNING] Unable to get resource 'regexp:regexp:jar:1.3' from repository apache.nexus (https://repository.apache.org/content/groups/public/): Error transferring file: java.lang.RuntimeException: Could not generate DH keypair
Downloading: http://repo1.maven.org/maven2/regexp/regexp/1.3/regexp-1.3.jar
24K downloaded  (regexp-1.3.jar)
[INFO] Unable to find resource 'org.antlr:stringtemplate:jar:3.2' in repository tuscany.repo (http://svn.apache.org/repos/asf/tuscany/maven)
Downloading: https://repository.apache.org/content/groups/public//org/antlr/stringtemplate/3.2/stringtemplate-3.2.jar
[WARNING] Unable to get resource 'org.apache.maven.scm:maven-scm-provider-cvs-commons:jar:1.2' from repository apache.nexus (https://repository.apache.org/content/groups/public/): Error transferring file: java.lang.RuntimeException: Could not generate DH keypair
Downloading: http://repo1.maven.org/maven2/org/apache/maven/scm/maven-scm-provider-cvs-commons/1.2/maven-scm-provider-cvs-commons-1.2.jar
69K downloaded  (maven-scm-provider-cvs-commons-1.2.jar)
Downloading: http://repo1.maven.org/maven2/org/apache/maven/scm/maven-scm-provider-starteam/1.2/maven-scm-provider-starteam-1.2.jar
69K downloaded  (maven-scm-provider-starteam-1.2.jar)
Downloading: http://repo1.maven.org/maven2/org/apache/maven/scm/maven-scm-provider-clearcase/1.2/maven-scm-provider-clearcase-1.2.jar
62K downloaded  (maven-scm-provider-clearcase-1.2.jar)
Downloading: http://repo1.maven.org/maven2/org/apache/maven/scm/maven-scm-provider-perforce/1.2/maven-scm-provider-perforce-1.2.jar
66K downloaded  (maven-scm-provider-perforce-1.2.jar)
Downloading: http://repo1.maven.org/maven2/org/apache/maven/scm/maven-scm-provider-hg/1.2/maven-scm-provider-hg-1.2.jar
51K downloaded  (maven-scm-provider-hg-1.2.jar)
[WARNING] Unable to get resource 'org.antlr:stringtemplate:jar:3.2' from repository apache.nexus (https://repository.apache.org/content/groups/public/): Error transferring file: java.lang.RuntimeException: Could not generate DH keypair
Downloading: http://antlr.org/antlr-snapshot/org/antlr/stringtemplate/3.2/stringtemplate-3.2.jar
[INFO] Unable to find resource 'org.antlr:stringtemplate:jar:3.2' in repository antlr-snapshot (http://antlr.org/antlr-snapshot)
Downloading: http://repo1.maven.org/maven2/org/antlr/stringtemplate/3.2/stringtemplate-3.2.jar
167K downloaded  (stringtemplate-3.2.jar)
[INFO] [buildnumber:create {execution: default}]
[INFO] Checking for local modifications: skipped.
[INFO] Executing: /bin/sh -c cd <https://builds.apache.org/job/Tuscany-2x/ws/sca-2x/modules/core-spi> && svn --non-interactive update <https://builds.apache.org/job/Tuscany-2x/ws/sca-2x/modules/core-spi>
[INFO] Working directory: <https://builds.apache.org/job/Tuscany-2x/ws/sca-2x/modules/core-spi>
Provider message:
The svn command failed.
Command output:
svn: SSL is not supported

[JENKINS] Archiving disabled
[INFO] ------------------------------------------------------------------------
[ERROR] BUILD ERROR
[INFO] ------------------------------------------------------------------------
[INFO] Couldn't update project.

Embedded error: Error!
[INFO] ------------------------------------------------------------------------
[INFO] For more information, run Maven with the -e switch
[INFO] ------------------------------------------------------------------------
[INFO] Total time: 3 minutes 4 seconds
[INFO] Finished at: Thu Aug 13 18:51:33 UTC 2015
[INFO] Final Memory: 96M/902M
[INFO] ------------------------------------------------------------------------
channel stopped

Build failed in Jenkins: Tuscany-2x #1788

Posted by Apache Jenkins Server <je...@builds.apache.org>.
See <https://builds.apache.org/job/Tuscany-2x/1788/>

------------------------------------------
[...truncated 25270 lines...]
	at org.apache.maven.surefire.booter.SurefireBooter.runSuitesInProcess(SurefireBooter.java:350)
	at org.apache.maven.surefire.booter.SurefireBooter.main(SurefireBooter.java:1021)
Aug 12, 2015 6:55:05 PM org.apache.tuscany.sca.http.jetty.JettyLogger info
INFO: Stopped SelectChannelConnector@0.0.0.0:8080
Aug 12, 2015 6:55:05 PM org.apache.tuscany.sca.node.impl.NodeImpl start
INFO: Starting node: http://tuscany.apache.org/sca/1.1/nodes/default0 domain: default
Aug 12, 2015 6:55:05 PM org.apache.tuscany.sca.node.impl.NodeFactoryImpl loadContributions
INFO: Loading contribution: <https://builds.apache.org/job/Tuscany-2x/ws/sca-2x/modules/binding-rest-runtime/target/test-classes/>
Aug 12, 2015 6:55:05 PM org.apache.tuscany.sca.http.jetty.JettyLogger info
INFO: jetty-6.1.26
Aug 12, 2015 6:55:05 PM org.apache.tuscany.sca.http.jetty.JettyLogger info
INFO: Started SelectChannelConnector@localhost:8085
Aug 12, 2015 6:55:05 PM org.apache.tuscany.sca.http.jetty.JettyServer addServletMapping
INFO: Added Servlet mapping: http://localhost:8085/EchoService/json/*
Aug 12, 2015 6:55:05 PM org.apache.tuscany.sca.core.assembly.impl.DomainRegistryImpl addEndpoint
INFO: Add endpoint - binding.rest - http://localhost:8085/EchoService/json/
Aug 12, 2015 6:55:05 PM org.apache.tuscany.sca.http.jetty.JettyServer addServletMapping
INFO: Added Servlet mapping: http://localhost:8085/EchoService/xml/*
Aug 12, 2015 6:55:05 PM org.apache.tuscany.sca.core.assembly.impl.DomainRegistryImpl addEndpoint
INFO: Add endpoint - binding.rest - http://localhost:8085/EchoService/xml/
Aug 12, 2015 6:55:05 PM org.apache.tuscany.sca.node.impl.NodeImpl stop
INFO: Stopping node: http://tuscany.apache.org/sca/1.1/nodes/default0
Aug 12, 2015 6:55:05 PM org.apache.tuscany.sca.core.assembly.impl.DomainRegistryImpl removeEndpoint
INFO: Remove endpoint - binding.rest - http://localhost:8085/EchoService/json/
Aug 12, 2015 6:55:05 PM org.apache.tuscany.sca.http.jetty.JettyServer removeServletMapping
INFO: Removed Servlet mapping: /EchoService/json/*
Aug 12, 2015 6:55:05 PM org.apache.tuscany.sca.core.assembly.impl.DomainRegistryImpl removeEndpoint
INFO: Remove endpoint - binding.rest - http://localhost:8085/EchoService/xml/
Aug 12, 2015 6:55:05 PM org.apache.tuscany.sca.http.jetty.JettyServer removeServletMapping
INFO: Removed Servlet mapping: /EchoService/xml/*
Aug 12, 2015 6:55:05 PM org.apache.tuscany.sca.http.jetty.JettyLogger info
INFO: Stopped SelectChannelConnector@localhost:8085
Running org.apache.tuscany.sca.binding.rest.rpc.EchoServiceTestCase
Tests run: 6, Failures: 0, Errors: 0, Skipped: 0, Time elapsed: 0.026 sec
Running org.apache.tuscany.sca.binding.rest.RESTBindingCacheTestCase
Tests run: 36, Failures: 0, Errors: 0, Skipped: 0, Time elapsed: 0.01 sec
Running org.apache.tuscany.sca.binding.rest.wireformat.json.CatalogServiceTestCase
Tests run: 7, Failures: 0, Errors: 0, Skipped: 0, Time elapsed: 0.003 sec
Running org.apache.tuscany.sca.binding.rest.RESTReferenceTestCase
Tests run: 1, Failures: 0, Errors: 1, Skipped: 0, Time elapsed: 0.004 sec <<< FAILURE!
testInvokeReference(org.apache.tuscany.sca.binding.rest.RESTReferenceTestCase)  Time elapsed: 0.001 sec  <<< ERROR!
java.lang.reflect.UndeclaredThrowableException
	at $Proxy39.echo(Unknown Source)
	at org.apache.tuscany.sca.binding.rest.RESTReferenceTestCase.testInvokeReference(RESTReferenceTestCase.java:61)
	at sun.reflect.NativeMethodAccessorImpl.invoke0(Native Method)
	at sun.reflect.NativeMethodAccessorImpl.invoke(NativeMethodAccessorImpl.java:39)
	at sun.reflect.DelegatingMethodAccessorImpl.invoke(DelegatingMethodAccessorImpl.java:25)
	at java.lang.reflect.Method.invoke(Method.java:597)
	at org.junit.runners.model.FrameworkMethod$1.runReflectiveCall(FrameworkMethod.java:44)
	at org.junit.internal.runners.model.ReflectiveCallable.run(ReflectiveCallable.java:15)
	at org.junit.runners.model.FrameworkMethod.invokeExplosively(FrameworkMethod.java:41)
	at org.junit.internal.runners.statements.InvokeMethod.evaluate(InvokeMethod.java:20)
	at org.junit.internal.runners.statements.RunBefores.evaluate(RunBefores.java:28)
	at org.junit.internal.runners.statements.RunAfters.evaluate(RunAfters.java:31)
	at org.junit.runners.BlockJUnit4ClassRunner.runChild(BlockJUnit4ClassRunner.java:76)
	at org.junit.runners.BlockJUnit4ClassRunner.runChild(BlockJUnit4ClassRunner.java:50)
	at org.junit.runners.ParentRunner$3.run(ParentRunner.java:193)
	at org.junit.runners.ParentRunner$1.schedule(ParentRunner.java:52)
	at org.junit.runners.ParentRunner.runChildren(ParentRunner.java:191)
	at org.junit.runners.ParentRunner.access$000(ParentRunner.java:42)
	at org.junit.runners.ParentRunner$2.evaluate(ParentRunner.java:184)
	at org.junit.runners.ParentRunner.run(ParentRunner.java:236)
	at org.junit.runners.Suite.runChild(Suite.java:128)
	at org.junit.runners.Suite.runChild(Suite.java:24)
	at org.junit.runners.ParentRunner$3.run(ParentRunner.java:193)
	at org.junit.runners.ParentRunner$1.schedule(ParentRunner.java:52)
	at org.junit.runners.ParentRunner.runChildren(ParentRunner.java:191)
	at org.junit.runners.ParentRunner.access$000(ParentRunner.java:42)
	at org.junit.runners.ParentRunner$2.evaluate(ParentRunner.java:184)
	at org.junit.runners.ParentRunner.run(ParentRunner.java:236)
	at org.junit.runner.JUnitCore.run(JUnitCore.java:157)
	at org.junit.runner.JUnitCore.run(JUnitCore.java:136)
	at org.junit.runner.JUnitCore.run(JUnitCore.java:127)
	at org.apache.maven.surefire.junitcore.JUnitCoreTestSet.runJunitCore(JUnitCoreTestSet.java:180)
	at org.apache.maven.surefire.junitcore.JUnitCoreTestSet.execute(JUnitCoreTestSet.java:86)
	at org.apache.maven.surefire.junitcore.JUnitCoreDirectoryTestSuite.execute(JUnitCoreDirectoryTestSuite.java:58)
	at org.apache.maven.surefire.Surefire.run(Surefire.java:180)
	at sun.reflect.NativeMethodAccessorImpl.invoke0(Native Method)
	at sun.reflect.NativeMethodAccessorImpl.invoke(NativeMethodAccessorImpl.java:39)
	at sun.reflect.DelegatingMethodAccessorImpl.invoke(DelegatingMethodAccessorImpl.java:25)
	at java.lang.reflect.Method.invoke(Method.java:597)
	at org.apache.maven.surefire.booter.SurefireBooter.runSuitesInProcess(SurefireBooter.java:350)
	at org.apache.maven.surefire.booter.SurefireBooter.main(SurefireBooter.java:1021)
Caused by: org.apache.tuscany.sca.core.scope.TargetResolutionException: scope container not running, lifecycleState=0
	at org.apache.tuscany.sca.core.scope.impl.StatelessScopeContainer.getWrapper(StatelessScopeContainer.java:42)
	at org.apache.tuscany.sca.implementation.java.invocation.JavaImplementationInvoker.invoke(JavaImplementationInvoker.java:122)
	at org.apache.tuscany.sca.binding.local.LocalSCABindingInvocationInterceptor.invoke(LocalSCABindingInvocationInterceptor.java:48)
	at org.apache.tuscany.sca.core.invocation.InterceptorAsyncImpl.invoke(InterceptorAsyncImpl.java:58)
	at org.apache.tuscany.sca.core.invocation.impl.JDKInvocationHandler.invoke(JDKInvocationHandler.java:351)
	at org.apache.tuscany.sca.core.invocation.impl.JDKInvocationHandler.invoke(JDKInvocationHandler.java:294)
	at org.apache.tuscany.sca.core.invocation.impl.JDKInvocationHandler.invoke(JDKInvocationHandler.java:125)
	at org.apache.tuscany.sca.core.invocation.impl.AsyncJDKInvocationHandler.doInvokeSync(AsyncJDKInvocationHandler.java:238)
	at org.apache.tuscany.sca.core.invocation.impl.AsyncJDKInvocationHandler.invoke(AsyncJDKInvocationHandler.java:157)
	... 41 more

Running org.apache.tuscany.sca.binding.rest.wireformat.binary.BinaryServiceTestCase
Tests run: 2, Failures: 0, Errors: 0, Skipped: 0, Time elapsed: 0.003 sec
Running org.apache.tuscany.sca.binding.rest.RESTBindingTestCase
Tests run: 2, Failures: 0, Errors: 0, Skipped: 0, Time elapsed: 0.002 sec
Running org.apache.tuscany.sca.binding.rest.wireformat.xml.CustomerServiceTestCase
Tests run: 4, Failures: 0, Errors: 0, Skipped: 0, Time elapsed: 0.002 sec

Results :

Tests in error: 
  testInvokeReference(org.apache.tuscany.sca.binding.rest.RESTReferenceTestCase)

Tests run: 58, Failures: 0, Errors: 1, Skipped: 0

[ERROR] There are test failures.

Please refer to <https://builds.apache.org/job/Tuscany-2x/ws/sca-2x/modules/binding-rest-runtime/target/surefire-reports> for the individual test results.
[JENKINS] Recording test results
[INFO] [jar:jar {execution: default-jar}]
[INFO] Building jar: <https://builds.apache.org/job/Tuscany-2x/ws/sca-2x/modules/binding-rest-runtime/target/tuscany-binding-rest-runtime-2.5-SNAPSHOT.jar>
[INFO] [source:jar-no-fork {execution: attach-sources}]
[INFO] Building jar: <https://builds.apache.org/job/Tuscany-2x/ws/sca-2x/modules/binding-rest-runtime/target/tuscany-binding-rest-runtime-2.5-SNAPSHOT-sources.jar>
[INFO] [install:install {execution: default-install}]
[INFO] Installing <https://builds.apache.org/job/Tuscany-2x/ws/sca-2x/modules/binding-rest-runtime/target/tuscany-binding-rest-runtime-2.5-SNAPSHOT.jar> to <https://builds.apache.org/job/Tuscany-2x/ws/.repository/org/apache/tuscany/sca/tuscany-binding-rest-runtime/2.5-SNAPSHOT/tuscany-binding-rest-runtime-2.5-SNAPSHOT.jar>
[INFO] Installing <https://builds.apache.org/job/Tuscany-2x/ws/sca-2x/modules/binding-rest-runtime/target/tuscany-binding-rest-runtime-2.5-SNAPSHOT-sources.jar> to <https://builds.apache.org/job/Tuscany-2x/ws/.repository/org/apache/tuscany/sca/tuscany-binding-rest-runtime/2.5-SNAPSHOT/tuscany-binding-rest-runtime-2.5-SNAPSHOT-sources.jar>
[JENKINS] Archiving disabled
[INFO] ------------------------------------------------------------------------
[INFO] Building Apache Tuscany SCA RMI Host Extension Point
[INFO]    task-segment: [clean, install]
[INFO] ------------------------------------------------------------------------
[INFO] [clean:clean {execution: default-clean}]
[INFO] [enforcer:enforce {execution: enforce-plugin-versions}]
[INFO] [remote-resources:process {execution: default}]
[INFO] [resources:resources {execution: default-resources}]
[INFO] Using 'UTF-8' encoding to copy filtered resources.
[INFO] Copying 1 resource
[INFO] Copying 3 resources
[INFO] Copying 3 resources
[INFO] [compiler:compile {execution: default-compile}]
[INFO] Compiling 8 source files to <https://builds.apache.org/job/Tuscany-2x/ws/sca-2x/modules/host-rmi/target/classes>
[INFO] [resources:testResources {execution: default-testResources}]
[INFO] Using 'UTF-8' encoding to copy filtered resources.
[INFO] skip non existing resourceDirectory <https://builds.apache.org/job/Tuscany-2x/ws/sca-2x/modules/host-rmi/src/test/resources>
[INFO] Copying 3 resources
[INFO] [compiler:testCompile {execution: default-testCompile}]
[INFO] Compiling 1 source file to <https://builds.apache.org/job/Tuscany-2x/ws/sca-2x/modules/host-rmi/target/test-classes>
[INFO] [surefire:test {execution: default-test}]
[INFO] Surefire report directory: <https://builds.apache.org/job/Tuscany-2x/ws/sca-2x/modules/host-rmi/target/surefire-reports>

-------------------------------------------------------
 T E S T S
-------------------------------------------------------
Running org.apache.tuscany.sca.host.rmi.RMIHostImplTestCase
Killed
[ERROR] There are test failures.

Please refer to <https://builds.apache.org/job/Tuscany-2x/ws/sca-2x/modules/host-rmi/target/surefire-reports> for the individual test results.
[JENKINS] Recording test results
[INFO] [jar:jar {execution: default-jar}]
[INFO] Building jar: <https://builds.apache.org/job/Tuscany-2x/ws/sca-2x/modules/host-rmi/target/tuscany-host-rmi-2.5-SNAPSHOT.jar>
[INFO] [source:jar-no-fork {execution: attach-sources}]
[INFO] Building jar: <https://builds.apache.org/job/Tuscany-2x/ws/sca-2x/modules/host-rmi/target/tuscany-host-rmi-2.5-SNAPSHOT-sources.jar>
[INFO] [install:install {execution: default-install}]
[INFO] Installing <https://builds.apache.org/job/Tuscany-2x/ws/sca-2x/modules/host-rmi/target/tuscany-host-rmi-2.5-SNAPSHOT.jar> to <https://builds.apache.org/job/Tuscany-2x/ws/.repository/org/apache/tuscany/sca/tuscany-host-rmi/2.5-SNAPSHOT/tuscany-host-rmi-2.5-SNAPSHOT.jar>
[INFO] Installing <https://builds.apache.org/job/Tuscany-2x/ws/sca-2x/modules/host-rmi/target/tuscany-host-rmi-2.5-SNAPSHOT-sources.jar> to <https://builds.apache.org/job/Tuscany-2x/ws/.repository/org/apache/tuscany/sca/tuscany-host-rmi/2.5-SNAPSHOT/tuscany-host-rmi-2.5-SNAPSHOT-sources.jar>
[JENKINS] Archiving disabled
[INFO] ------------------------------------------------------------------------
[INFO] Building Apache Tuscany SCA RMI Binding Extension
[INFO]    task-segment: [clean, install]
[INFO] ------------------------------------------------------------------------
[INFO] [clean:clean {execution: default-clean}]
[INFO] [enforcer:enforce {execution: enforce-plugin-versions}]
[INFO] [remote-resources:process {execution: default}]
[INFO] [resources:resources {execution: default-resources}]
[INFO] Using 'UTF-8' encoding to copy filtered resources.
[INFO] Copying 1 resource
[INFO] Copying 3 resources
[INFO] Copying 3 resources
[INFO] [compiler:compile {execution: default-compile}]
[INFO] Compiling 5 source files to <https://builds.apache.org/job/Tuscany-2x/ws/sca-2x/modules/binding-rmi-runtime/target/classes>
[INFO] [resources:testResources {execution: default-testResources}]
[INFO] Using 'UTF-8' encoding to copy filtered resources.
[INFO] Copying 3 resources
[INFO] Copying 3 resources
[INFO] [compiler:testCompile {execution: default-testCompile}]
[INFO] Compiling 6 source files to <https://builds.apache.org/job/Tuscany-2x/ws/sca-2x/modules/binding-rmi-runtime/target/test-classes>
[INFO] [surefire:test {execution: default-test}]
[INFO] Surefire report directory: <https://builds.apache.org/job/Tuscany-2x/ws/sca-2x/modules/binding-rmi-runtime/target/surefire-reports>

-------------------------------------------------------
 T E S T S
-------------------------------------------------------
Running org.apache.tuscany.sca.binding.rmi.BindingTestCase
Aug 12, 2015 6:55:37 PM org.apache.tuscany.sca.node.impl.NodeImpl start
INFO: Starting node: http://tuscany.apache.org/sca/1.1/nodes/default0 domain: default
Aug 12, 2015 6:55:37 PM org.apache.tuscany.sca.node.impl.NodeFactoryImpl loadContributions
INFO: Loading contribution: <https://builds.apache.org/job/Tuscany-2x/ws/sca-2x/modules/binding-rmi-runtime/target/test-classes/>
Aug 12, 2015 6:55:38 PM org.apache.tuscany.sca.host.rmi.DefaultRMIHost registerService
INFO: RMI service registered: rmi://localhost:8099/HelloWorldRemoteService
Aug 12, 2015 6:55:38 PM org.apache.tuscany.sca.core.assembly.impl.DomainRegistryImpl addEndpoint
INFO: Add endpoint - binding.rmi - rmi://localhost:8099/HelloWorldRemoteService
Aug 12, 2015 6:55:38 PM org.apache.tuscany.sca.core.assembly.impl.DomainRegistryImpl addEndpoint
INFO: Add endpoint - binding.sca - HelloWorldRmiServiceComponent/HelloWorldRmiService
Hello from the RMI Service to - Tuscany World! thro the RMI Reference
Hi from Apache World in RMI Service to - Tuscany World! thro the RMI Reference
Expected exception :helloworld.HelloException
Aug 12, 2015 6:55:38 PM org.apache.tuscany.sca.node.impl.NodeImpl stop
INFO: Stopping node: http://tuscany.apache.org/sca/1.1/nodes/default0
Aug 12, 2015 6:55:38 PM org.apache.tuscany.sca.core.assembly.impl.DomainRegistryImpl removeEndpoint
INFO: Remove endpoint - binding.rmi - rmi://localhost:8099/HelloWorldRemoteService
Aug 12, 2015 6:55:38 PM org.apache.tuscany.sca.host.rmi.DefaultRMIHost unregisterService
INFO: RMI service unregistered: rmi://localhost:8099/HelloWorldRemoteService
Aug 12, 2015 6:55:38 PM org.apache.tuscany.sca.core.assembly.impl.DomainRegistryImpl removeEndpoint
INFO: Remove endpoint - binding.sca - HelloWorldRmiServiceComponent/HelloWorldRmiService
Tests run: 1, Failures: 0, Errors: 0, Skipped: 0, Time elapsed: 1.395 sec

Results :

Tests run: 1, Failures: 0, Errors: 0, Skipped: 0

[JENKINS] Recording test results
[INFO] [jar:jar {execution: default-jar}]
[INFO] Building jar: <https://builds.apache.org/job/Tuscany-2x/ws/sca-2x/modules/binding-rmi-runtime/target/tuscany-binding-rmi-runtime-2.5-SNAPSHOT.jar>
[INFO] [source:jar-no-fork {execution: attach-sources}]
[INFO] Building jar: <https://builds.apache.org/job/Tuscany-2x/ws/sca-2x/modules/binding-rmi-runtime/target/tuscany-binding-rmi-runtime-2.5-SNAPSHOT-sources.jar>
[INFO] [install:install {execution: default-install}]
[INFO] Installing <https://builds.apache.org/job/Tuscany-2x/ws/sca-2x/modules/binding-rmi-runtime/target/tuscany-binding-rmi-runtime-2.5-SNAPSHOT.jar> to <https://builds.apache.org/job/Tuscany-2x/ws/.repository/org/apache/tuscany/sca/tuscany-binding-rmi-runtime/2.5-SNAPSHOT/tuscany-binding-rmi-runtime-2.5-SNAPSHOT.jar>
[INFO] Installing <https://builds.apache.org/job/Tuscany-2x/ws/sca-2x/modules/binding-rmi-runtime/target/tuscany-binding-rmi-runtime-2.5-SNAPSHOT-sources.jar> to <https://builds.apache.org/job/Tuscany-2x/ws/.repository/org/apache/tuscany/sca/tuscany-binding-rmi-runtime/2.5-SNAPSHOT/tuscany-binding-rmi-runtime-2.5-SNAPSHOT-sources.jar>
[JENKINS] Archiving disabled
[INFO] ------------------------------------------------------------------------
[INFO] Building Apache Tuscany SCA Websocket Binding Extension
[INFO]    task-segment: [clean, install]
[INFO] ------------------------------------------------------------------------
[INFO] [clean:clean {execution: default-clean}]
[JENKINS] Archiving disabled
[INFO] ------------------------------------------------------------------------
[ERROR] BUILD ERROR
[INFO] ------------------------------------------------------------------------
[INFO] Error building POM (may not be this project's POM).


Project ID: org.eclipse.jetty:jetty-project:pom:8.0.1.v20110908

Reason: Cannot find parent: org.eclipse.jetty:jetty-parent for project: org.eclipse.jetty:jetty-project:pom:8.0.1.v20110908 for project org.eclipse.jetty:jetty-project:pom:8.0.1.v20110908


[INFO] ------------------------------------------------------------------------
[INFO] For more information, run Maven with the -e switch
[INFO] ------------------------------------------------------------------------
[INFO] Total time: 6 minutes 9 seconds
[INFO] Finished at: Wed Aug 12 18:55:40 UTC 2015
[INFO] Final Memory: 273M/1134M
[INFO] ------------------------------------------------------------------------
channel stopped

Build failed in Jenkins: Tuscany-2x #1787

Posted by Apache Jenkins Server <je...@builds.apache.org>.
See <https://builds.apache.org/job/Tuscany-2x/1787/>

------------------------------------------
[...truncated 16541 lines...]
)
Aug 11, 2015 6:51:15 PM org.apache.tuscany.sca.contribution.namespace.impl.NamespaceImportProcessor [] (AttributeNameSpaceMissing)
SEVERE: Attribute ''namespace'' is missing
Tests run: 2, Failures: 0, Errors: 0, Skipped: 0, Time elapsed: 0.022 sec

Results :

Tests run: 26, Failures: 0, Errors: 0, Skipped: 0

[JENKINS] Recording test results
[INFO] [jar:jar {execution: default-jar}]
[INFO] Building jar: <https://builds.apache.org/job/Tuscany-2x/ws/sca-2x/modules/contribution/target/tuscany-contribution-2.5-SNAPSHOT.jar>
[INFO] [source:jar-no-fork {execution: attach-sources}]
[INFO] Building jar: <https://builds.apache.org/job/Tuscany-2x/ws/sca-2x/modules/contribution/target/tuscany-contribution-2.5-SNAPSHOT-sources.jar>
[INFO] [install:install {execution: default-install}]
[INFO] Installing <https://builds.apache.org/job/Tuscany-2x/ws/sca-2x/modules/contribution/target/tuscany-contribution-2.5-SNAPSHOT.jar> to <https://builds.apache.org/job/Tuscany-2x/ws/.repository/org/apache/tuscany/sca/tuscany-contribution/2.5-SNAPSHOT/tuscany-contribution-2.5-SNAPSHOT.jar>
[INFO] Installing <https://builds.apache.org/job/Tuscany-2x/ws/sca-2x/modules/contribution/target/tuscany-contribution-2.5-SNAPSHOT-sources.jar> to <https://builds.apache.org/job/Tuscany-2x/ws/.repository/org/apache/tuscany/sca/tuscany-contribution/2.5-SNAPSHOT/tuscany-contribution-2.5-SNAPSHOT-sources.jar>
[JENKINS] Archiving disabled
[INFO] ------------------------------------------------------------------------
[INFO] Building Apache Tuscany SCA Node API
[INFO]    task-segment: [clean, install]
[INFO] ------------------------------------------------------------------------
[INFO] [clean:clean {execution: default-clean}]
[INFO] [enforcer:enforce {execution: enforce-plugin-versions}]
[INFO] [remote-resources:process {execution: default}]
[INFO] [resources:resources {execution: default-resources}]
[INFO] Using 'UTF-8' encoding to copy filtered resources.
[INFO] skip non existing resourceDirectory <https://builds.apache.org/job/Tuscany-2x/ws/sca-2x/modules/node-api/src/main/resources>
[INFO] Copying 3 resources
[INFO] Copying 3 resources
[INFO] [compiler:compile {execution: default-compile}]
[INFO] Compiling 19 source files to <https://builds.apache.org/job/Tuscany-2x/ws/sca-2x/modules/node-api/target/classes>
[INFO] [resources:testResources {execution: default-testResources}]
[INFO] Using 'UTF-8' encoding to copy filtered resources.
[INFO] skip non existing resourceDirectory <https://builds.apache.org/job/Tuscany-2x/ws/sca-2x/modules/node-api/src/test/resources>
[INFO] Copying 3 resources
[INFO] [compiler:testCompile {execution: default-testCompile}]
[INFO] No sources to compile
[INFO] [surefire:test {execution: default-test}]
[INFO] Surefire report directory: <https://builds.apache.org/job/Tuscany-2x/ws/sca-2x/modules/node-api/target/surefire-reports>

-------------------------------------------------------
 T E S T S
-------------------------------------------------------
There are no tests to run.

Results :

Tests run: 0, Failures: 0, Errors: 0, Skipped: 0

[JENKINS] Recording test results
[INFO] [jar:jar {execution: default-jar}]
[INFO] Building jar: <https://builds.apache.org/job/Tuscany-2x/ws/sca-2x/modules/node-api/target/tuscany-node-api-2.5-SNAPSHOT.jar>
[INFO] [source:jar-no-fork {execution: attach-sources}]
[INFO] Building jar: <https://builds.apache.org/job/Tuscany-2x/ws/sca-2x/modules/node-api/target/tuscany-node-api-2.5-SNAPSHOT-sources.jar>
[INFO] [install:install {execution: default-install}]
[INFO] Installing <https://builds.apache.org/job/Tuscany-2x/ws/sca-2x/modules/node-api/target/tuscany-node-api-2.5-SNAPSHOT.jar> to <https://builds.apache.org/job/Tuscany-2x/ws/.repository/org/apache/tuscany/sca/tuscany-node-api/2.5-SNAPSHOT/tuscany-node-api-2.5-SNAPSHOT.jar>
[INFO] Installing <https://builds.apache.org/job/Tuscany-2x/ws/sca-2x/modules/node-api/target/tuscany-node-api-2.5-SNAPSHOT-sources.jar> to <https://builds.apache.org/job/Tuscany-2x/ws/.repository/org/apache/tuscany/sca/tuscany-node-api/2.5-SNAPSHOT/tuscany-node-api-2.5-SNAPSHOT-sources.jar>
[JENKINS] Archiving disabled
[INFO] ------------------------------------------------------------------------
[INFO] Building Apache Tuscany SCA Core SPI
[INFO]    task-segment: [clean, install]
[INFO] ------------------------------------------------------------------------
Downloading: http://repo1.maven.org/maven2/org/codehaus/mojo/buildnumber-maven-plugin/1.0-beta-4/buildnumber-maven-plugin-1.0-beta-4.pom
9K downloaded  (buildnumber-maven-plugin-1.0-beta-4.pom)
Downloading: http://repo1.maven.org/maven2/org/codehaus/mojo/mojo-parent/22/mojo-parent-22.pom
18K downloaded  (mojo-parent-22.pom)
Downloading: http://repo1.maven.org/maven2/org/codehaus/mojo/buildnumber-maven-plugin/1.0-beta-4/buildnumber-maven-plugin-1.0-beta-4.jar
21K downloaded  (buildnumber-maven-plugin-1.0-beta-4.jar)
Downloading: http://repo1.maven.org/maven2/org/apache/maven/plugins/maven-antrun-plugin/1.7/maven-antrun-plugin-1.7.pom
4K downloaded  (maven-antrun-plugin-1.7.pom)
Downloading: http://repo1.maven.org/maven2/org/apache/maven/plugins/maven-plugins/22/maven-plugins-22.pom
12K downloaded  (maven-plugins-22.pom)
Downloading: http://repo1.maven.org/maven2/org/apache/maven/plugins/maven-antrun-plugin/1.7/maven-antrun-plugin-1.7.jar
30K downloaded  (maven-antrun-plugin-1.7.jar)
[INFO] [clean:clean {execution: default-clean}]
[INFO] [enforcer:enforce {execution: enforce-plugin-versions}]
Downloading: http://repo1.maven.org/maven2/org/apache/maven/scm/maven-scm-api/1.2/maven-scm-api-1.2.pom
1K downloaded  (maven-scm-api-1.2.pom)
Downloading: http://repo1.maven.org/maven2/org/apache/maven/scm/maven-scm/1.2/maven-scm-1.2.pom
11K downloaded  (maven-scm-1.2.pom)
Downloading: http://repo1.maven.org/maven2/org/apache/maven/scm/maven-scm-manager-plexus/1.2/maven-scm-manager-plexus-1.2.pom
2K downloaded  (maven-scm-manager-plexus-1.2.pom)
Downloading: http://repo1.maven.org/maven2/org/apache/maven/scm/maven-scm-managers/1.2/maven-scm-managers-1.2.pom
1K downloaded  (maven-scm-managers-1.2.pom)
Downloading: http://repo1.maven.org/maven2/org/apache/maven/scm/maven-scm-provider-svnexe/1.2/maven-scm-provider-svnexe-1.2.pom
2K downloaded  (maven-scm-provider-svnexe-1.2.pom)
Downloading: http://repo1.maven.org/maven2/org/apache/maven/scm/maven-scm-providers-svn/1.2/maven-scm-providers-svn-1.2.pom
1K downloaded  (maven-scm-providers-svn-1.2.pom)
Downloading: http://repo1.maven.org/maven2/org/apache/maven/scm/maven-scm-providers/1.2/maven-scm-providers-1.2.pom
3K downloaded  (maven-scm-providers-1.2.pom)
Downloading: http://svn.apache.org/repos/asf/tuscany/maven/org/apache/maven/scm/maven-scm-provider-svn-commons/1.2/maven-scm-provider-svn-commons-1.2.pom
[INFO] Unable to find resource 'org.apache.maven.scm:maven-scm-provider-svn-commons:pom:1.2' in repository tuscany.repo (http://svn.apache.org/repos/asf/tuscany/maven)
Downloading: https://repository.apache.org/content/groups/public//org/apache/maven/scm/maven-scm-provider-svn-commons/1.2/maven-scm-provider-svn-commons-1.2.pom
[WARNING] Unable to get resource 'org.apache.maven.scm:maven-scm-provider-svn-commons:pom:1.2' from repository apache.nexus (https://repository.apache.org/content/groups/public/): Error transferring file: java.lang.RuntimeException: Could not generate DH keypair
Downloading: http://repo1.maven.org/maven2/org/apache/maven/scm/maven-scm-provider-svn-commons/1.2/maven-scm-provider-svn-commons-1.2.pom
1K downloaded  (maven-scm-provider-svn-commons-1.2.pom)
Downloading: http://svn.apache.org/repos/asf/tuscany/maven/regexp/regexp/1.3/regexp-1.3.pom
[INFO] Unable to find resource 'regexp:regexp:pom:1.3' in repository tuscany.repo (http://svn.apache.org/repos/asf/tuscany/maven)
Downloading: https://repository.apache.org/content/groups/public//regexp/regexp/1.3/regexp-1.3.pom
[WARNING] Unable to get resource 'regexp:regexp:pom:1.3' from repository apache.nexus (https://repository.apache.org/content/groups/public/): Error transferring file: java.lang.RuntimeException: Could not generate DH keypair
Downloading: http://repo1.maven.org/maven2/regexp/regexp/1.3/regexp-1.3.pom
145b downloaded  (regexp-1.3.pom)
Downloading: http://repo1.maven.org/maven2/org/apache/maven/scm/maven-scm-provider-cvsexe/1.2/maven-scm-provider-cvsexe-1.2.pom
2K downloaded  (maven-scm-provider-cvsexe-1.2.pom)
Downloading: http://repo1.maven.org/maven2/org/apache/maven/scm/maven-scm-providers-cvs/1.2/maven-scm-providers-cvs-1.2.pom
1K downloaded  (maven-scm-providers-cvs-1.2.pom)
Downloading: http://svn.apache.org/repos/asf/tuscany/maven/org/apache/maven/scm/maven-scm-provider-cvs-commons/1.2/maven-scm-provider-cvs-commons-1.2.pom
[INFO] Unable to find resource 'org.apache.maven.scm:maven-scm-provider-cvs-commons:pom:1.2' in repository tuscany.repo (http://svn.apache.org/repos/asf/tuscany/maven)
Downloading: https://repository.apache.org/content/groups/public//org/apache/maven/scm/maven-scm-provider-cvs-commons/1.2/maven-scm-provider-cvs-commons-1.2.pom
[WARNING] Unable to get resource 'org.apache.maven.scm:maven-scm-provider-cvs-commons:pom:1.2' from repository apache.nexus (https://repository.apache.org/content/groups/public/): Error transferring file: java.lang.RuntimeException: Could not generate DH keypair
Downloading: http://repo1.maven.org/maven2/org/apache/maven/scm/maven-scm-provider-cvs-commons/1.2/maven-scm-provider-cvs-commons-1.2.pom
2K downloaded  (maven-scm-provider-cvs-commons-1.2.pom)
Downloading: http://repo1.maven.org/maven2/org/apache/maven/scm/maven-scm-provider-starteam/1.2/maven-scm-provider-starteam-1.2.pom
2K downloaded  (maven-scm-provider-starteam-1.2.pom)
Downloading: http://repo1.maven.org/maven2/org/apache/maven/scm/maven-scm-provider-clearcase/1.2/maven-scm-provider-clearcase-1.2.pom
2K downloaded  (maven-scm-provider-clearcase-1.2.pom)
Downloading: http://repo1.maven.org/maven2/org/apache/maven/scm/maven-scm-provider-perforce/1.2/maven-scm-provider-perforce-1.2.pom
2K downloaded  (maven-scm-provider-perforce-1.2.pom)
Downloading: http://repo1.maven.org/maven2/org/apache/maven/scm/maven-scm-provider-hg/1.2/maven-scm-provider-hg-1.2.pom
2K downloaded  (maven-scm-provider-hg-1.2.pom)
Downloading: http://repo1.maven.org/maven2/com/google/code/maven-scm-provider-svnjava/maven-scm-provider-svnjava/1.8/maven-scm-provider-svnjava-1.8.pom
7K downloaded  (maven-scm-provider-svnjava-1.8.pom)
Downloading: http://svn.apache.org/repos/asf/tuscany/maven/net/java/dev/jna/jna/3.2.2/jna-3.2.2.pom
[INFO] Unable to find resource 'net.java.dev.jna:jna:pom:3.2.2' in repository tuscany.repo (http://svn.apache.org/repos/asf/tuscany/maven)
Downloading: https://repository.apache.org/content/groups/public//net/java/dev/jna/jna/3.2.2/jna-3.2.2.pom
[WARNING] Unable to get resource 'net.java.dev.jna:jna:pom:3.2.2' from repository apache.nexus (https://repository.apache.org/content/groups/public/): Error transferring file: java.lang.RuntimeException: Could not generate DH keypair
Downloading: http://repo1.maven.org/maven2/net/java/dev/jna/jna/3.2.2/jna-3.2.2.pom
1K downloaded  (jna-3.2.2.pom)
Downloading: http://repo1.maven.org/maven2/org/tmatesoft/svnkit/svnkit/1.3.1-1/svnkit-1.3.1-1.pom
1K downloaded  (svnkit-1.3.1-1.pom)
Downloading: http://svn.apache.org/repos/asf/tuscany/maven/com/trilead/trilead-ssh2/build213-svnkit-1.3-patch/trilead-ssh2-build213-svnkit-1.3-patch.pom
[INFO] Unable to find resource 'com.trilead:trilead-ssh2:pom:build213-svnkit-1.3-patch' in repository tuscany.repo (http://svn.apache.org/repos/asf/tuscany/maven)
Downloading: https://repository.apache.org/content/groups/public//com/trilead/trilead-ssh2/build213-svnkit-1.3-patch/trilead-ssh2-build213-svnkit-1.3-patch.pom
[WARNING] Unable to get resource 'com.trilead:trilead-ssh2:pom:build213-svnkit-1.3-patch' from repository apache.nexus (https://repository.apache.org/content/groups/public/): Error transferring file: java.lang.RuntimeException: Could not generate DH keypair
Downloading: http://repo1.maven.org/maven2/com/trilead/trilead-ssh2/build213-svnkit-1.3-patch/trilead-ssh2-build213-svnkit-1.3-patch.pom
716b downloaded  (trilead-ssh2-build213-svnkit-1.3-patch.pom)
Downloading: http://svn.apache.org/repos/asf/tuscany/maven/org/tmatesoft/sqljet/sqljet/1.0.0-1/sqljet-1.0.0-1.pom
[INFO] Unable to find resource 'org.tmatesoft.sqljet:sqljet:pom:1.0.0-1' in repository tuscany.repo (http://svn.apache.org/repos/asf/tuscany/maven)
Downloading: https://repository.apache.org/content/groups/public//org/tmatesoft/sqljet/sqljet/1.0.0-1/sqljet-1.0.0-1.pom
[WARNING] Unable to get resource 'org.tmatesoft.sqljet:sqljet:pom:1.0.0-1' from repository apache.nexus (https://repository.apache.org/content/groups/public/): Error transferring file: java.lang.RuntimeException: Could not generate DH keypair
Downloading: http://repo1.maven.org/maven2/org/tmatesoft/sqljet/sqljet/1.0.0-1/sqljet-1.0.0-1.pom
774b downloaded  (sqljet-1.0.0-1.pom)
Downloading: http://svn.apache.org/repos/asf/tuscany/maven/org/antlr/antlr-runtime/3.1.3/antlr-runtime-3.1.3.pom
[INFO] Unable to find resource 'org.antlr:antlr-runtime:pom:3.1.3' in repository tuscany.repo (http://svn.apache.org/repos/asf/tuscany/maven)
Downloading: https://repository.apache.org/content/groups/public//org/antlr/antlr-runtime/3.1.3/antlr-runtime-3.1.3.pom
[WARNING] Unable to get resource 'org.antlr:antlr-runtime:pom:3.1.3' from repository apache.nexus (https://repository.apache.org/content/groups/public/): Error transferring file: java.lang.RuntimeException: Could not generate DH keypair
Downloading: http://repo1.maven.org/maven2/org/antlr/antlr-runtime/3.1.3/antlr-runtime-3.1.3.pom
3K downloaded  (antlr-runtime-3.1.3.pom)
Downloading: http://svn.apache.org/repos/asf/tuscany/maven/org/antlr/antlr-master/3.1.3/antlr-master-3.1.3.pom
[INFO] Unable to find resource 'org.antlr:antlr-master:pom:3.1.3' in repository tuscany.repo (http://svn.apache.org/repos/asf/tuscany/maven)
Downloading: https://repository.apache.org/content/groups/public//org/antlr/antlr-master/3.1.3/antlr-master-3.1.3.pom
[WARNING] Unable to get resource 'org.antlr:antlr-master:pom:3.1.3' from repository apache.nexus (https://repository.apache.org/content/groups/public/): Error transferring file: java.lang.RuntimeException: Could not generate DH keypair
Downloading: http://repo1.maven.org/maven2/org/antlr/antlr-master/3.1.3/antlr-master-3.1.3.pom
8K downloaded  (antlr-master-3.1.3.pom)
Downloading: http://svn.apache.org/repos/asf/tuscany/maven/org/antlr/stringtemplate/3.2/stringtemplate-3.2.pom
[INFO] Unable to find resource 'org.antlr:stringtemplate:pom:3.2' in repository tuscany.repo (http://svn.apache.org/repos/asf/tuscany/maven)
Downloading: https://repository.apache.org/content/groups/public//org/antlr/stringtemplate/3.2/stringtemplate-3.2.pom
[WARNING] Unable to get resource 'org.antlr:stringtemplate:pom:3.2' from repository apache.nexus (https://repository.apache.org/content/groups/public/): Error transferring file: java.lang.RuntimeException: Could not generate DH keypair
Downloading: http://antlr.org/antlr-snapshot/org/antlr/stringtemplate/3.2/stringtemplate-3.2.pom
[INFO] Unable to find resource 'org.antlr:stringtemplate:pom:3.2' in repository antlr-snapshot (http://antlr.org/antlr-snapshot)
Downloading: http://repo1.maven.org/maven2/org/antlr/stringtemplate/3.2/stringtemplate-3.2.pom
1K downloaded  (stringtemplate-3.2.pom)
Downloading: http://repo1.maven.org/maven2/org/tmatesoft/svnkit/svnkit/1.3.1-1/svnkit-1.3.1-1.jar
Downloading: http://repo1.maven.org/maven2/net/java/dev/jna/jna/3.2.2/jna-3.2.2.jar
Downloading: http://repo1.maven.org/maven2/org/apache/maven/scm/maven-scm-api/1.2/maven-scm-api-1.2.jar
Downloading: http://svn.apache.org/repos/asf/tuscany/maven/org/antlr/antlr-runtime/3.1.3/antlr-runtime-3.1.3.jar
Downloading: http://svn.apache.org/repos/asf/tuscany/maven/org/tmatesoft/sqljet/sqljet/1.0.0-1/sqljet-1.0.0-1.jar
82K downloaded  (maven-scm-api-1.2.jar)
Downloading: http://svn.apache.org/repos/asf/tuscany/maven/com/trilead/trilead-ssh2/build213-svnkit-1.3-patch/trilead-ssh2-build213-svnkit-1.3-patch.jar
838K downloaded  (jna-3.2.2.jar)
Downloading: http://repo1.maven.org/maven2/com/google/code/maven-scm-provider-svnjava/maven-scm-provider-svnjava/1.8/maven-scm-provider-svnjava-1.8.jar
[INFO] Unable to find resource 'org.antlr:antlr-runtime:jar:3.1.3' in repository tuscany.repo (http://svn.apache.org/repos/asf/tuscany/maven)
[INFO] Unable to find resource 'org.tmatesoft.sqljet:sqljet:jar:1.0.0-1' in repository tuscany.repo (http://svn.apache.org/repos/asf/tuscany/maven)
Downloading: https://repository.apache.org/content/groups/public//org/antlr/antlr-runtime/3.1.3/antlr-runtime-3.1.3.jar
Downloading: https://repository.apache.org/content/groups/public//org/tmatesoft/sqljet/sqljet/1.0.0-1/sqljet-1.0.0-1.jar
43K downloaded  (maven-scm-provider-svnjava-1.8.jar)
1882K downloaded  (svnkit-1.3.1-1.jar)
Downloading: http://svn.apache.org/repos/asf/tuscany/maven/regexp/regexp/1.3/regexp-1.3.jar
Downloading: http://repo1.maven.org/maven2/org/apache/maven/scm/maven-scm-manager-plexus/1.2/maven-scm-manager-plexus-1.2.jar
[INFO] Unable to find resource 'com.trilead:trilead-ssh2:jar:build213-svnkit-1.3-patch' in repository tuscany.repo (http://svn.apache.org/repos/asf/tuscany/maven)
Downloading: https://repository.apache.org/content/groups/public//com/trilead/trilead-ssh2/build213-svnkit-1.3-patch/trilead-ssh2-build213-svnkit-1.3-patch.jar
10K downloaded  (maven-scm-manager-plexus-1.2.jar)
Downloading: http://repo1.maven.org/maven2/org/apache/maven/scm/maven-scm-provider-svnexe/1.2/maven-scm-provider-svnexe-1.2.jar
58K downloaded  (maven-scm-provider-svnexe-1.2.jar)
Downloading: http://repo1.maven.org/maven2/org/apache/maven/scm/maven-scm-provider-svn-commons/1.2/maven-scm-provider-svn-commons-1.2.jar
36K downloaded  (maven-scm-provider-svn-commons-1.2.jar)
[INFO] Unable to find resource 'regexp:regexp:jar:1.3' in repository tuscany.repo (http://svn.apache.org/repos/asf/tuscany/maven)
Downloading: https://repository.apache.org/content/groups/public//regexp/regexp/1.3/regexp-1.3.jar
Downloading: http://repo1.maven.org/maven2/org/apache/maven/scm/maven-scm-provider-cvsexe/1.2/maven-scm-provider-cvsexe-1.2.jar
[WARNING] Unable to get resource 'org.antlr:antlr-runtime:jar:3.1.3' from repository apache.nexus (https://repository.apache.org/content/groups/public/): Error transferring file: java.lang.RuntimeException: Could not generate DH keypair
Downloading: http://repo1.maven.org/maven2/org/antlr/antlr-runtime/3.1.3/antlr-runtime-3.1.3.jar
26K downloaded  (maven-scm-provider-cvsexe-1.2.jar)
[WARNING] Unable to get resource 'org.tmatesoft.sqljet:sqljet:jar:1.0.0-1' from repository apache.nexus (https://repository.apache.org/content/groups/public/): Error transferring file: java.lang.RuntimeException: Could not generate DH keypair
Downloading: http://repo1.maven.org/maven2/org/tmatesoft/sqljet/sqljet/1.0.0-1/sqljet-1.0.0-1.jar
147K downloaded  (antlr-runtime-3.1.3.jar)
Downloading: http://svn.apache.org/repos/asf/tuscany/maven/org/apache/maven/scm/maven-scm-provider-cvs-commons/1.2/maven-scm-provider-cvs-commons-1.2.jar
Downloading: http://svn.apache.org/repos/asf/tuscany/maven/org/antlr/stringtemplate/3.2/stringtemplate-3.2.jar
[WARNING] Unable to get resource 'com.trilead:trilead-ssh2:jar:build213-svnkit-1.3-patch' from repository apache.nexus (https://repository.apache.org/content/groups/public/): Error transferring file: java.lang.RuntimeException: Could not generate DH keypair
Downloading: http://repo1.maven.org/maven2/com/trilead/trilead-ssh2/build213-svnkit-1.3-patch/trilead-ssh2-build213-svnkit-1.3-patch.jar
245K downloaded  (trilead-ssh2-build213-svnkit-1.3-patch.jar)
[INFO] Unable to find resource 'org.apache.maven.scm:maven-scm-provider-cvs-commons:jar:1.2' in repository tuscany.repo (http://svn.apache.org/repos/asf/tuscany/maven)
Downloading: https://repository.apache.org/content/groups/public//org/apache/maven/scm/maven-scm-provider-cvs-commons/1.2/maven-scm-provider-cvs-commons-1.2.jar
[INFO] Unable to find resource 'org.antlr:stringtemplate:jar:3.2' in repository tuscany.repo (http://svn.apache.org/repos/asf/tuscany/maven)
Downloading: https://repository.apache.org/content/groups/public//org/antlr/stringtemplate/3.2/stringtemplate-3.2.jar
[WARNING] Unable to get resource 'regexp:regexp:jar:1.3' from repository apache.nexus (https://repository.apache.org/content/groups/public/): Error transferring file: java.lang.RuntimeException: Could not generate DH keypair
Downloading: http://repo1.maven.org/maven2/regexp/regexp/1.3/regexp-1.3.jar
24K downloaded  (regexp-1.3.jar)
656K downloaded  (sqljet-1.0.0-1.jar)
[WARNING] Unable to get resource 'org.apache.maven.scm:maven-scm-provider-cvs-commons:jar:1.2' from repository apache.nexus (https://repository.apache.org/content/groups/public/): Error transferring file: java.lang.RuntimeException: Could not generate DH keypair
Downloading: http://repo1.maven.org/maven2/org/apache/maven/scm/maven-scm-provider-cvs-commons/1.2/maven-scm-provider-cvs-commons-1.2.jar
69K downloaded  (maven-scm-provider-cvs-commons-1.2.jar)
[WARNING] Unable to get resource 'org.antlr:stringtemplate:jar:3.2' from repository apache.nexus (https://repository.apache.org/content/groups/public/): Error transferring file: java.lang.RuntimeException: Could not generate DH keypair
Downloading: http://antlr.org/antlr-snapshot/org/antlr/stringtemplate/3.2/stringtemplate-3.2.jar
Downloading: http://repo1.maven.org/maven2/org/apache/maven/scm/maven-scm-provider-starteam/1.2/maven-scm-provider-starteam-1.2.jar
69K downloaded  (maven-scm-provider-starteam-1.2.jar)
Downloading: http://repo1.maven.org/maven2/org/apache/maven/scm/maven-scm-provider-clearcase/1.2/maven-scm-provider-clearcase-1.2.jar
62K downloaded  (maven-scm-provider-clearcase-1.2.jar)
Downloading: http://repo1.maven.org/maven2/org/apache/maven/scm/maven-scm-provider-perforce/1.2/maven-scm-provider-perforce-1.2.jar
66K downloaded  (maven-scm-provider-perforce-1.2.jar)
Downloading: http://repo1.maven.org/maven2/org/apache/maven/scm/maven-scm-provider-hg/1.2/maven-scm-provider-hg-1.2.jar
51K downloaded  (maven-scm-provider-hg-1.2.jar)
[INFO] Unable to find resource 'org.antlr:stringtemplate:jar:3.2' in repository antlr-snapshot (http://antlr.org/antlr-snapshot)
Downloading: http://repo1.maven.org/maven2/org/antlr/stringtemplate/3.2/stringtemplate-3.2.jar
167K downloaded  (stringtemplate-3.2.jar)
[INFO] [buildnumber:create {execution: default}]
[INFO] Checking for local modifications: skipped.
[INFO] Executing: /bin/sh -c cd <https://builds.apache.org/job/Tuscany-2x/ws/sca-2x/modules/core-spi> && svn --non-interactive update <https://builds.apache.org/job/Tuscany-2x/ws/sca-2x/modules/core-spi>
[INFO] Working directory: <https://builds.apache.org/job/Tuscany-2x/ws/sca-2x/modules/core-spi>
Provider message:
The svn command failed.
Command output:
svn: SSL is not supported

[JENKINS] Archiving disabled
[INFO] ------------------------------------------------------------------------
[ERROR] BUILD ERROR
[INFO] ------------------------------------------------------------------------
[INFO] Couldn't update project.

Embedded error: Error!
[INFO] ------------------------------------------------------------------------
[INFO] For more information, run Maven with the -e switch
[INFO] ------------------------------------------------------------------------
[INFO] Total time: 3 minutes 
[INFO] Finished at: Tue Aug 11 18:51:30 UTC 2015
[INFO] Final Memory: 97M/901M
[INFO] ------------------------------------------------------------------------
channel stopped

Build failed in Jenkins: Tuscany-2x #1786

Posted by Apache Jenkins Server <je...@builds.apache.org>.
See <https://builds.apache.org/job/Tuscany-2x/1786/>

------------------------------------------
[...truncated 16541 lines...]
)
Aug 10, 2015 6:56:00 PM org.apache.tuscany.sca.contribution.namespace.impl.NamespaceImportProcessor [] (AttributeNameSpaceMissing)
SEVERE: Attribute ''namespace'' is missing
Tests run: 2, Failures: 0, Errors: 0, Skipped: 0, Time elapsed: 0.023 sec

Results :

Tests run: 26, Failures: 0, Errors: 0, Skipped: 0

[JENKINS] Recording test results
[INFO] [jar:jar {execution: default-jar}]
[INFO] Building jar: <https://builds.apache.org/job/Tuscany-2x/ws/sca-2x/modules/contribution/target/tuscany-contribution-2.5-SNAPSHOT.jar>
[INFO] [source:jar-no-fork {execution: attach-sources}]
[INFO] Building jar: <https://builds.apache.org/job/Tuscany-2x/ws/sca-2x/modules/contribution/target/tuscany-contribution-2.5-SNAPSHOT-sources.jar>
[INFO] [install:install {execution: default-install}]
[INFO] Installing <https://builds.apache.org/job/Tuscany-2x/ws/sca-2x/modules/contribution/target/tuscany-contribution-2.5-SNAPSHOT.jar> to <https://builds.apache.org/job/Tuscany-2x/ws/.repository/org/apache/tuscany/sca/tuscany-contribution/2.5-SNAPSHOT/tuscany-contribution-2.5-SNAPSHOT.jar>
[INFO] Installing <https://builds.apache.org/job/Tuscany-2x/ws/sca-2x/modules/contribution/target/tuscany-contribution-2.5-SNAPSHOT-sources.jar> to <https://builds.apache.org/job/Tuscany-2x/ws/.repository/org/apache/tuscany/sca/tuscany-contribution/2.5-SNAPSHOT/tuscany-contribution-2.5-SNAPSHOT-sources.jar>
[JENKINS] Archiving disabled
[INFO] ------------------------------------------------------------------------
[INFO] Building Apache Tuscany SCA Node API
[INFO]    task-segment: [clean, install]
[INFO] ------------------------------------------------------------------------
[INFO] [clean:clean {execution: default-clean}]
[INFO] [enforcer:enforce {execution: enforce-plugin-versions}]
[INFO] [remote-resources:process {execution: default}]
[INFO] [resources:resources {execution: default-resources}]
[INFO] Using 'UTF-8' encoding to copy filtered resources.
[INFO] skip non existing resourceDirectory <https://builds.apache.org/job/Tuscany-2x/ws/sca-2x/modules/node-api/src/main/resources>
[INFO] Copying 3 resources
[INFO] Copying 3 resources
[INFO] [compiler:compile {execution: default-compile}]
[INFO] Compiling 19 source files to <https://builds.apache.org/job/Tuscany-2x/ws/sca-2x/modules/node-api/target/classes>
[INFO] [resources:testResources {execution: default-testResources}]
[INFO] Using 'UTF-8' encoding to copy filtered resources.
[INFO] skip non existing resourceDirectory <https://builds.apache.org/job/Tuscany-2x/ws/sca-2x/modules/node-api/src/test/resources>
[INFO] Copying 3 resources
[INFO] [compiler:testCompile {execution: default-testCompile}]
[INFO] No sources to compile
[INFO] [surefire:test {execution: default-test}]
[INFO] Surefire report directory: <https://builds.apache.org/job/Tuscany-2x/ws/sca-2x/modules/node-api/target/surefire-reports>

-------------------------------------------------------
 T E S T S
-------------------------------------------------------
There are no tests to run.

Results :

Tests run: 0, Failures: 0, Errors: 0, Skipped: 0

[JENKINS] Recording test results
[INFO] [jar:jar {execution: default-jar}]
[INFO] Building jar: <https://builds.apache.org/job/Tuscany-2x/ws/sca-2x/modules/node-api/target/tuscany-node-api-2.5-SNAPSHOT.jar>
[INFO] [source:jar-no-fork {execution: attach-sources}]
[INFO] Building jar: <https://builds.apache.org/job/Tuscany-2x/ws/sca-2x/modules/node-api/target/tuscany-node-api-2.5-SNAPSHOT-sources.jar>
[INFO] [install:install {execution: default-install}]
[INFO] Installing <https://builds.apache.org/job/Tuscany-2x/ws/sca-2x/modules/node-api/target/tuscany-node-api-2.5-SNAPSHOT.jar> to <https://builds.apache.org/job/Tuscany-2x/ws/.repository/org/apache/tuscany/sca/tuscany-node-api/2.5-SNAPSHOT/tuscany-node-api-2.5-SNAPSHOT.jar>
[INFO] Installing <https://builds.apache.org/job/Tuscany-2x/ws/sca-2x/modules/node-api/target/tuscany-node-api-2.5-SNAPSHOT-sources.jar> to <https://builds.apache.org/job/Tuscany-2x/ws/.repository/org/apache/tuscany/sca/tuscany-node-api/2.5-SNAPSHOT/tuscany-node-api-2.5-SNAPSHOT-sources.jar>
[JENKINS] Archiving disabled
[INFO] ------------------------------------------------------------------------
[INFO] Building Apache Tuscany SCA Core SPI
[INFO]    task-segment: [clean, install]
[INFO] ------------------------------------------------------------------------
Downloading: http://repo1.maven.org/maven2/org/codehaus/mojo/buildnumber-maven-plugin/1.0-beta-4/buildnumber-maven-plugin-1.0-beta-4.pom
9K downloaded  (buildnumber-maven-plugin-1.0-beta-4.pom)
Downloading: http://repo1.maven.org/maven2/org/codehaus/mojo/mojo-parent/22/mojo-parent-22.pom
18K downloaded  (mojo-parent-22.pom)
Downloading: http://repo1.maven.org/maven2/org/codehaus/mojo/buildnumber-maven-plugin/1.0-beta-4/buildnumber-maven-plugin-1.0-beta-4.jar
21K downloaded  (buildnumber-maven-plugin-1.0-beta-4.jar)
Downloading: http://repo1.maven.org/maven2/org/apache/maven/plugins/maven-antrun-plugin/1.7/maven-antrun-plugin-1.7.pom
4K downloaded  (maven-antrun-plugin-1.7.pom)
Downloading: http://repo1.maven.org/maven2/org/apache/maven/plugins/maven-plugins/22/maven-plugins-22.pom
12K downloaded  (maven-plugins-22.pom)
Downloading: http://repo1.maven.org/maven2/org/apache/maven/plugins/maven-antrun-plugin/1.7/maven-antrun-plugin-1.7.jar
30K downloaded  (maven-antrun-plugin-1.7.jar)
[INFO] [clean:clean {execution: default-clean}]
[INFO] [enforcer:enforce {execution: enforce-plugin-versions}]
Downloading: http://repo1.maven.org/maven2/org/apache/maven/scm/maven-scm-api/1.2/maven-scm-api-1.2.pom
1K downloaded  (maven-scm-api-1.2.pom)
Downloading: http://repo1.maven.org/maven2/org/apache/maven/scm/maven-scm/1.2/maven-scm-1.2.pom
11K downloaded  (maven-scm-1.2.pom)
Downloading: http://repo1.maven.org/maven2/org/apache/maven/scm/maven-scm-manager-plexus/1.2/maven-scm-manager-plexus-1.2.pom
2K downloaded  (maven-scm-manager-plexus-1.2.pom)
Downloading: http://repo1.maven.org/maven2/org/apache/maven/scm/maven-scm-managers/1.2/maven-scm-managers-1.2.pom
1K downloaded  (maven-scm-managers-1.2.pom)
Downloading: http://repo1.maven.org/maven2/org/apache/maven/scm/maven-scm-provider-svnexe/1.2/maven-scm-provider-svnexe-1.2.pom
2K downloaded  (maven-scm-provider-svnexe-1.2.pom)
Downloading: http://repo1.maven.org/maven2/org/apache/maven/scm/maven-scm-providers-svn/1.2/maven-scm-providers-svn-1.2.pom
1K downloaded  (maven-scm-providers-svn-1.2.pom)
Downloading: http://repo1.maven.org/maven2/org/apache/maven/scm/maven-scm-providers/1.2/maven-scm-providers-1.2.pom
3K downloaded  (maven-scm-providers-1.2.pom)
Downloading: http://svn.apache.org/repos/asf/tuscany/maven/org/apache/maven/scm/maven-scm-provider-svn-commons/1.2/maven-scm-provider-svn-commons-1.2.pom
[INFO] Unable to find resource 'org.apache.maven.scm:maven-scm-provider-svn-commons:pom:1.2' in repository tuscany.repo (http://svn.apache.org/repos/asf/tuscany/maven)
Downloading: https://repository.apache.org/content/groups/public//org/apache/maven/scm/maven-scm-provider-svn-commons/1.2/maven-scm-provider-svn-commons-1.2.pom
[WARNING] Unable to get resource 'org.apache.maven.scm:maven-scm-provider-svn-commons:pom:1.2' from repository apache.nexus (https://repository.apache.org/content/groups/public/): Error transferring file: java.lang.RuntimeException: Could not generate DH keypair
Downloading: http://repo1.maven.org/maven2/org/apache/maven/scm/maven-scm-provider-svn-commons/1.2/maven-scm-provider-svn-commons-1.2.pom
1K downloaded  (maven-scm-provider-svn-commons-1.2.pom)
Downloading: http://svn.apache.org/repos/asf/tuscany/maven/regexp/regexp/1.3/regexp-1.3.pom
[INFO] Unable to find resource 'regexp:regexp:pom:1.3' in repository tuscany.repo (http://svn.apache.org/repos/asf/tuscany/maven)
Downloading: https://repository.apache.org/content/groups/public//regexp/regexp/1.3/regexp-1.3.pom
[WARNING] Unable to get resource 'regexp:regexp:pom:1.3' from repository apache.nexus (https://repository.apache.org/content/groups/public/): Error transferring file: java.lang.RuntimeException: Could not generate DH keypair
Downloading: http://repo1.maven.org/maven2/regexp/regexp/1.3/regexp-1.3.pom
145b downloaded  (regexp-1.3.pom)
Downloading: http://repo1.maven.org/maven2/org/apache/maven/scm/maven-scm-provider-cvsexe/1.2/maven-scm-provider-cvsexe-1.2.pom
2K downloaded  (maven-scm-provider-cvsexe-1.2.pom)
Downloading: http://repo1.maven.org/maven2/org/apache/maven/scm/maven-scm-providers-cvs/1.2/maven-scm-providers-cvs-1.2.pom
1K downloaded  (maven-scm-providers-cvs-1.2.pom)
Downloading: http://svn.apache.org/repos/asf/tuscany/maven/org/apache/maven/scm/maven-scm-provider-cvs-commons/1.2/maven-scm-provider-cvs-commons-1.2.pom
[INFO] Unable to find resource 'org.apache.maven.scm:maven-scm-provider-cvs-commons:pom:1.2' in repository tuscany.repo (http://svn.apache.org/repos/asf/tuscany/maven)
Downloading: https://repository.apache.org/content/groups/public//org/apache/maven/scm/maven-scm-provider-cvs-commons/1.2/maven-scm-provider-cvs-commons-1.2.pom
[WARNING] Unable to get resource 'org.apache.maven.scm:maven-scm-provider-cvs-commons:pom:1.2' from repository apache.nexus (https://repository.apache.org/content/groups/public/): Error transferring file: java.lang.RuntimeException: Could not generate DH keypair
Downloading: http://repo1.maven.org/maven2/org/apache/maven/scm/maven-scm-provider-cvs-commons/1.2/maven-scm-provider-cvs-commons-1.2.pom
2K downloaded  (maven-scm-provider-cvs-commons-1.2.pom)
Downloading: http://repo1.maven.org/maven2/org/apache/maven/scm/maven-scm-provider-starteam/1.2/maven-scm-provider-starteam-1.2.pom
2K downloaded  (maven-scm-provider-starteam-1.2.pom)
Downloading: http://repo1.maven.org/maven2/org/apache/maven/scm/maven-scm-provider-clearcase/1.2/maven-scm-provider-clearcase-1.2.pom
2K downloaded  (maven-scm-provider-clearcase-1.2.pom)
Downloading: http://repo1.maven.org/maven2/org/apache/maven/scm/maven-scm-provider-perforce/1.2/maven-scm-provider-perforce-1.2.pom
2K downloaded  (maven-scm-provider-perforce-1.2.pom)
Downloading: http://repo1.maven.org/maven2/org/apache/maven/scm/maven-scm-provider-hg/1.2/maven-scm-provider-hg-1.2.pom
2K downloaded  (maven-scm-provider-hg-1.2.pom)
Downloading: http://repo1.maven.org/maven2/com/google/code/maven-scm-provider-svnjava/maven-scm-provider-svnjava/1.8/maven-scm-provider-svnjava-1.8.pom
7K downloaded  (maven-scm-provider-svnjava-1.8.pom)
Downloading: http://svn.apache.org/repos/asf/tuscany/maven/net/java/dev/jna/jna/3.2.2/jna-3.2.2.pom
[INFO] Unable to find resource 'net.java.dev.jna:jna:pom:3.2.2' in repository tuscany.repo (http://svn.apache.org/repos/asf/tuscany/maven)
Downloading: https://repository.apache.org/content/groups/public//net/java/dev/jna/jna/3.2.2/jna-3.2.2.pom
[WARNING] Unable to get resource 'net.java.dev.jna:jna:pom:3.2.2' from repository apache.nexus (https://repository.apache.org/content/groups/public/): Error transferring file: java.lang.RuntimeException: Could not generate DH keypair
Downloading: http://repo1.maven.org/maven2/net/java/dev/jna/jna/3.2.2/jna-3.2.2.pom
1K downloaded  (jna-3.2.2.pom)
Downloading: http://repo1.maven.org/maven2/org/tmatesoft/svnkit/svnkit/1.3.1-1/svnkit-1.3.1-1.pom
1K downloaded  (svnkit-1.3.1-1.pom)
Downloading: http://svn.apache.org/repos/asf/tuscany/maven/com/trilead/trilead-ssh2/build213-svnkit-1.3-patch/trilead-ssh2-build213-svnkit-1.3-patch.pom
[INFO] Unable to find resource 'com.trilead:trilead-ssh2:pom:build213-svnkit-1.3-patch' in repository tuscany.repo (http://svn.apache.org/repos/asf/tuscany/maven)
Downloading: https://repository.apache.org/content/groups/public//com/trilead/trilead-ssh2/build213-svnkit-1.3-patch/trilead-ssh2-build213-svnkit-1.3-patch.pom
[WARNING] Unable to get resource 'com.trilead:trilead-ssh2:pom:build213-svnkit-1.3-patch' from repository apache.nexus (https://repository.apache.org/content/groups/public/): Error transferring file: java.lang.RuntimeException: Could not generate DH keypair
Downloading: http://repo1.maven.org/maven2/com/trilead/trilead-ssh2/build213-svnkit-1.3-patch/trilead-ssh2-build213-svnkit-1.3-patch.pom
716b downloaded  (trilead-ssh2-build213-svnkit-1.3-patch.pom)
Downloading: http://svn.apache.org/repos/asf/tuscany/maven/org/tmatesoft/sqljet/sqljet/1.0.0-1/sqljet-1.0.0-1.pom
[INFO] Unable to find resource 'org.tmatesoft.sqljet:sqljet:pom:1.0.0-1' in repository tuscany.repo (http://svn.apache.org/repos/asf/tuscany/maven)
Downloading: https://repository.apache.org/content/groups/public//org/tmatesoft/sqljet/sqljet/1.0.0-1/sqljet-1.0.0-1.pom
[WARNING] Unable to get resource 'org.tmatesoft.sqljet:sqljet:pom:1.0.0-1' from repository apache.nexus (https://repository.apache.org/content/groups/public/): Error transferring file: java.lang.RuntimeException: Could not generate DH keypair
Downloading: http://repo1.maven.org/maven2/org/tmatesoft/sqljet/sqljet/1.0.0-1/sqljet-1.0.0-1.pom
774b downloaded  (sqljet-1.0.0-1.pom)
Downloading: http://svn.apache.org/repos/asf/tuscany/maven/org/antlr/antlr-runtime/3.1.3/antlr-runtime-3.1.3.pom
[INFO] Unable to find resource 'org.antlr:antlr-runtime:pom:3.1.3' in repository tuscany.repo (http://svn.apache.org/repos/asf/tuscany/maven)
Downloading: https://repository.apache.org/content/groups/public//org/antlr/antlr-runtime/3.1.3/antlr-runtime-3.1.3.pom
[WARNING] Unable to get resource 'org.antlr:antlr-runtime:pom:3.1.3' from repository apache.nexus (https://repository.apache.org/content/groups/public/): Error transferring file: java.lang.RuntimeException: Could not generate DH keypair
Downloading: http://repo1.maven.org/maven2/org/antlr/antlr-runtime/3.1.3/antlr-runtime-3.1.3.pom
3K downloaded  (antlr-runtime-3.1.3.pom)
Downloading: http://svn.apache.org/repos/asf/tuscany/maven/org/antlr/antlr-master/3.1.3/antlr-master-3.1.3.pom
[INFO] Unable to find resource 'org.antlr:antlr-master:pom:3.1.3' in repository tuscany.repo (http://svn.apache.org/repos/asf/tuscany/maven)
Downloading: https://repository.apache.org/content/groups/public//org/antlr/antlr-master/3.1.3/antlr-master-3.1.3.pom
[WARNING] Unable to get resource 'org.antlr:antlr-master:pom:3.1.3' from repository apache.nexus (https://repository.apache.org/content/groups/public/): Error transferring file: java.lang.RuntimeException: Could not generate DH keypair
Downloading: http://repo1.maven.org/maven2/org/antlr/antlr-master/3.1.3/antlr-master-3.1.3.pom
8K downloaded  (antlr-master-3.1.3.pom)
Downloading: http://svn.apache.org/repos/asf/tuscany/maven/org/antlr/stringtemplate/3.2/stringtemplate-3.2.pom
[INFO] Unable to find resource 'org.antlr:stringtemplate:pom:3.2' in repository tuscany.repo (http://svn.apache.org/repos/asf/tuscany/maven)
Downloading: https://repository.apache.org/content/groups/public//org/antlr/stringtemplate/3.2/stringtemplate-3.2.pom
[WARNING] Unable to get resource 'org.antlr:stringtemplate:pom:3.2' from repository apache.nexus (https://repository.apache.org/content/groups/public/): Error transferring file: java.lang.RuntimeException: Could not generate DH keypair
Downloading: http://antlr.org/antlr-snapshot/org/antlr/stringtemplate/3.2/stringtemplate-3.2.pom
[INFO] Unable to find resource 'org.antlr:stringtemplate:pom:3.2' in repository antlr-snapshot (http://antlr.org/antlr-snapshot)
Downloading: http://repo1.maven.org/maven2/org/antlr/stringtemplate/3.2/stringtemplate-3.2.pom
1K downloaded  (stringtemplate-3.2.pom)
Downloading: http://repo1.maven.org/maven2/org/tmatesoft/svnkit/svnkit/1.3.1-1/svnkit-1.3.1-1.jar
Downloading: http://repo1.maven.org/maven2/org/apache/maven/scm/maven-scm-api/1.2/maven-scm-api-1.2.jar
Downloading: http://svn.apache.org/repos/asf/tuscany/maven/org/tmatesoft/sqljet/sqljet/1.0.0-1/sqljet-1.0.0-1.jar
Downloading: http://svn.apache.org/repos/asf/tuscany/maven/org/antlr/antlr-runtime/3.1.3/antlr-runtime-3.1.3.jar
Downloading: http://repo1.maven.org/maven2/net/java/dev/jna/jna/3.2.2/jna-3.2.2.jar
82K downloaded  (maven-scm-api-1.2.jar)
Downloading: http://svn.apache.org/repos/asf/tuscany/maven/com/trilead/trilead-ssh2/build213-svnkit-1.3-patch/trilead-ssh2-build213-svnkit-1.3-patch.jar
1882K downloaded  (svnkit-1.3.1-1.jar)
Downloading: http://repo1.maven.org/maven2/com/google/code/maven-scm-provider-svnjava/maven-scm-provider-svnjava/1.8/maven-scm-provider-svnjava-1.8.jar
43K downloaded  (maven-scm-provider-svnjava-1.8.jar)
Downloading: http://svn.apache.org/repos/asf/tuscany/maven/regexp/regexp/1.3/regexp-1.3.jar
838K downloaded  (jna-3.2.2.jar)
Downloading: http://repo1.maven.org/maven2/org/apache/maven/scm/maven-scm-manager-plexus/1.2/maven-scm-manager-plexus-1.2.jar
10K downloaded  (maven-scm-manager-plexus-1.2.jar)
[INFO] Unable to find resource 'org.antlr:antlr-runtime:jar:3.1.3' in repository tuscany.repo (http://svn.apache.org/repos/asf/tuscany/maven)
[INFO] Unable to find resource 'org.tmatesoft.sqljet:sqljet:jar:1.0.0-1' in repository tuscany.repo (http://svn.apache.org/repos/asf/tuscany/maven)
Downloading: https://repository.apache.org/content/groups/public//org/antlr/antlr-runtime/3.1.3/antlr-runtime-3.1.3.jar
Downloading: http://repo1.maven.org/maven2/org/apache/maven/scm/maven-scm-provider-svnexe/1.2/maven-scm-provider-svnexe-1.2.jar
Downloading: https://repository.apache.org/content/groups/public//org/tmatesoft/sqljet/sqljet/1.0.0-1/sqljet-1.0.0-1.jar
58K downloaded  (maven-scm-provider-svnexe-1.2.jar)
Downloading: http://repo1.maven.org/maven2/org/apache/maven/scm/maven-scm-provider-svn-commons/1.2/maven-scm-provider-svn-commons-1.2.jar
36K downloaded  (maven-scm-provider-svn-commons-1.2.jar)
[INFO] Unable to find resource 'com.trilead:trilead-ssh2:jar:build213-svnkit-1.3-patch' in repository tuscany.repo (http://svn.apache.org/repos/asf/tuscany/maven)
Downloading: https://repository.apache.org/content/groups/public//com/trilead/trilead-ssh2/build213-svnkit-1.3-patch/trilead-ssh2-build213-svnkit-1.3-patch.jar
Downloading: http://repo1.maven.org/maven2/org/apache/maven/scm/maven-scm-provider-cvsexe/1.2/maven-scm-provider-cvsexe-1.2.jar
26K downloaded  (maven-scm-provider-cvsexe-1.2.jar)
Downloading: http://svn.apache.org/repos/asf/tuscany/maven/org/apache/maven/scm/maven-scm-provider-cvs-commons/1.2/maven-scm-provider-cvs-commons-1.2.jar
[INFO] Unable to find resource 'regexp:regexp:jar:1.3' in repository tuscany.repo (http://svn.apache.org/repos/asf/tuscany/maven)
Downloading: https://repository.apache.org/content/groups/public//regexp/regexp/1.3/regexp-1.3.jar
[INFO] Unable to find resource 'org.apache.maven.scm:maven-scm-provider-cvs-commons:jar:1.2' in repository tuscany.repo (http://svn.apache.org/repos/asf/tuscany/maven)
Downloading: https://repository.apache.org/content/groups/public//org/apache/maven/scm/maven-scm-provider-cvs-commons/1.2/maven-scm-provider-cvs-commons-1.2.jar
[WARNING] Unable to get resource 'org.antlr:antlr-runtime:jar:3.1.3' from repository apache.nexus (https://repository.apache.org/content/groups/public/): Error transferring file: java.lang.RuntimeException: Could not generate DH keypair
[WARNING] Unable to get resource 'org.tmatesoft.sqljet:sqljet:jar:1.0.0-1' from repository apache.nexus (https://repository.apache.org/content/groups/public/): Error transferring file: java.lang.RuntimeException: Could not generate DH keypair
Downloading: http://repo1.maven.org/maven2/org/antlr/antlr-runtime/3.1.3/antlr-runtime-3.1.3.jar
Downloading: http://repo1.maven.org/maven2/org/tmatesoft/sqljet/sqljet/1.0.0-1/sqljet-1.0.0-1.jar
147K downloaded  (antlr-runtime-3.1.3.jar)
656K downloaded  (sqljet-1.0.0-1.jar)
Downloading: http://svn.apache.org/repos/asf/tuscany/maven/org/antlr/stringtemplate/3.2/stringtemplate-3.2.jar
[WARNING] Unable to get resource 'com.trilead:trilead-ssh2:jar:build213-svnkit-1.3-patch' from repository apache.nexus (https://repository.apache.org/content/groups/public/): Error transferring file: java.lang.RuntimeException: Could not generate DH keypair
Downloading: http://repo1.maven.org/maven2/com/trilead/trilead-ssh2/build213-svnkit-1.3-patch/trilead-ssh2-build213-svnkit-1.3-patch.jar
245K downloaded  (trilead-ssh2-build213-svnkit-1.3-patch.jar)
[WARNING] Unable to get resource 'regexp:regexp:jar:1.3' from repository apache.nexus (https://repository.apache.org/content/groups/public/): Error transferring file: java.lang.RuntimeException: Could not generate DH keypair
Downloading: http://repo1.maven.org/maven2/regexp/regexp/1.3/regexp-1.3.jar
24K downloaded  (regexp-1.3.jar)
[INFO] Unable to find resource 'org.antlr:stringtemplate:jar:3.2' in repository tuscany.repo (http://svn.apache.org/repos/asf/tuscany/maven)
Downloading: https://repository.apache.org/content/groups/public//org/antlr/stringtemplate/3.2/stringtemplate-3.2.jar
[WARNING] Unable to get resource 'org.apache.maven.scm:maven-scm-provider-cvs-commons:jar:1.2' from repository apache.nexus (https://repository.apache.org/content/groups/public/): Error transferring file: java.lang.RuntimeException: Could not generate DH keypair
Downloading: http://repo1.maven.org/maven2/org/apache/maven/scm/maven-scm-provider-cvs-commons/1.2/maven-scm-provider-cvs-commons-1.2.jar
69K downloaded  (maven-scm-provider-cvs-commons-1.2.jar)
Downloading: http://repo1.maven.org/maven2/org/apache/maven/scm/maven-scm-provider-starteam/1.2/maven-scm-provider-starteam-1.2.jar
69K downloaded  (maven-scm-provider-starteam-1.2.jar)
Downloading: http://repo1.maven.org/maven2/org/apache/maven/scm/maven-scm-provider-clearcase/1.2/maven-scm-provider-clearcase-1.2.jar
62K downloaded  (maven-scm-provider-clearcase-1.2.jar)
Downloading: http://repo1.maven.org/maven2/org/apache/maven/scm/maven-scm-provider-perforce/1.2/maven-scm-provider-perforce-1.2.jar
66K downloaded  (maven-scm-provider-perforce-1.2.jar)
Downloading: http://repo1.maven.org/maven2/org/apache/maven/scm/maven-scm-provider-hg/1.2/maven-scm-provider-hg-1.2.jar
51K downloaded  (maven-scm-provider-hg-1.2.jar)
[WARNING] Unable to get resource 'org.antlr:stringtemplate:jar:3.2' from repository apache.nexus (https://repository.apache.org/content/groups/public/): Error transferring file: java.lang.RuntimeException: Could not generate DH keypair
Downloading: http://antlr.org/antlr-snapshot/org/antlr/stringtemplate/3.2/stringtemplate-3.2.jar
[INFO] Unable to find resource 'org.antlr:stringtemplate:jar:3.2' in repository antlr-snapshot (http://antlr.org/antlr-snapshot)
Downloading: http://repo1.maven.org/maven2/org/antlr/stringtemplate/3.2/stringtemplate-3.2.jar
167K downloaded  (stringtemplate-3.2.jar)
[INFO] [buildnumber:create {execution: default}]
[INFO] Checking for local modifications: skipped.
[INFO] Executing: /bin/sh -c cd <https://builds.apache.org/job/Tuscany-2x/ws/sca-2x/modules/core-spi> && svn --non-interactive update <https://builds.apache.org/job/Tuscany-2x/ws/sca-2x/modules/core-spi>
[INFO] Working directory: <https://builds.apache.org/job/Tuscany-2x/ws/sca-2x/modules/core-spi>
Provider message:
The svn command failed.
Command output:
svn: SSL is not supported

[JENKINS] Archiving disabled
[INFO] ------------------------------------------------------------------------
[ERROR] BUILD ERROR
[INFO] ------------------------------------------------------------------------
[INFO] Couldn't update project.

Embedded error: Error!
[INFO] ------------------------------------------------------------------------
[INFO] For more information, run Maven with the -e switch
[INFO] ------------------------------------------------------------------------
[INFO] Total time: 2 minutes 57 seconds
[INFO] Finished at: Mon Aug 10 18:56:13 UTC 2015
[INFO] Final Memory: 97M/901M
[INFO] ------------------------------------------------------------------------
channel stopped