You are viewing a plain text version of this content. The canonical link for it is here.
Posted to builds@lucene.apache.org by Policeman Jenkins Server via builds <bu...@lucene.apache.org> on 2026/08/09 20:55:13 UTC

[JENKINS] Lucene-nightly-main-Linux (64bit/hotspot/jdk-25.0.3) - Build # 1860 - Unstable!

Build: https://jenkins.thetaphi.de/job/Lucene-nightly-main-Linux/1860/
Java: 64bit/hotspot/jdk-25.0.3 -XX:-UseCompressedOops -XX:+UseZGC

1 tests failed.
FAILED:  org.apache.lucene.analysis.tests.TestRandomChains.testRandomChains

Error Message:
java.lang.IllegalStateException: stage 2: inconsistent endOffset at pos=1: 14 vs 16; token=🀚 🀣 🀪 ꜟ j

Stack Trace:
java.lang.IllegalStateException: stage 2: inconsistent endOffset at pos=1: 14 vs 16; token=🀚 🀣 🀪 ꜟ j
	at __randomizedtesting.SeedInfo.seed([F16650D03D6DF055:CC8779B17A7FED95]:0)
	at org.apache.lucene.test_framework@11.0.0-SNAPSHOT/org.apache.lucene.tests.analysis.ValidatingTokenFilter.incrementToken(ValidatingTokenFilter.java:164)
	at org.apache.lucene.analysis.common@11.0.0-SNAPSHOT/org.apache.lucene.analysis.cjk.CJKWidthFilter.incrementToken(CJKWidthFilter.java:62)
	at org.apache.lucene.test_framework@11.0.0-SNAPSHOT/org.apache.lucene.tests.analysis.ValidatingTokenFilter.incrementToken(ValidatingTokenFilter.java:81)
	at org.apache.lucene.analysis.common@11.0.0-SNAPSHOT/org.apache.lucene.analysis.miscellaneous.ConditionalTokenFilter$OneTimeWrapper.incrementToken(ConditionalTokenFilter.java:65)
	at org.apache.lucene.core@11.0.0-SNAPSHOT/org.apache.lucene.analysis.FilteringTokenFilter.incrementToken(FilteringTokenFilter.java:51)
	at org.apache.lucene.analysis.common@11.0.0-SNAPSHOT/org.apache.lucene.analysis.miscellaneous.ConditionalTokenFilter.incrementToken(ConditionalTokenFilter.java:203)
	at org.apache.lucene.test_framework@11.0.0-SNAPSHOT/org.apache.lucene.tests.analysis.ValidatingTokenFilter.incrementToken(ValidatingTokenFilter.java:81)
	at org.apache.lucene.test_framework@11.0.0-SNAPSHOT/org.apache.lucene.tests.analysis.BaseTokenStreamTestCase.checkAnalysisConsistency(BaseTokenStreamTestCase.java:1285)
	at org.apache.lucene.test_framework@11.0.0-SNAPSHOT/org.apache.lucene.tests.analysis.BaseTokenStreamTestCase.checkRandomData(BaseTokenStreamTestCase.java:1183)
	at org.apache.lucene.test_framework@11.0.0-SNAPSHOT/org.apache.lucene.tests.analysis.BaseTokenStreamTestCase.checkRandomData(BaseTokenStreamTestCase.java:1077)
	at org.apache.lucene.analysis.tests@11.0.0-SNAPSHOT/org.apache.lucene.analysis.tests.TestRandomChains.testRandomChains(TestRandomChains.java:941)