You are viewing a plain text version of this content. The canonical link for it is here.
Posted to commits@hc.apache.org by Apache Jenkins Server <je...@builds.apache.org> on 2025/12/21 00:08:42 UTC
Build failed in Jenkins: HttpComponents » HttpComponents Client 5.6.x Java17 #144
See <https://ci-builds.apache.org/job/HttpComponents/job/HttpComponents%20Client%205.6.x%20Java17/144/display/redirect>
Changes:
------------------------------------------
Started by an SCM change
Running as SYSTEM
[EnvInject] - Loading node environment variables.
Building remotely on builds31 (ubuntu) in workspace <https://ci-builds.apache.org/job/HttpComponents/job/HttpComponents%20Client%205.6.x%20Java17/ws/>
The recommended git tool is: NONE
No credentials specified
> git rev-parse --resolve-git-dir <https://ci-builds.apache.org/job/HttpComponents/job/HttpComponents%20Client%205.6.x%20Java17/ws/.git> # timeout=10
Fetching changes from the remote Git repository
> git config remote.origin.url https://github.com/apache/httpcomponents-client.git # timeout=10
Fetching upstream changes from https://github.com/apache/httpcomponents-client.git
> git --version # timeout=10
> git --version # 'git version 2.34.1'
> git fetch --tags --force --progress -- https://github.com/apache/httpcomponents-client.git +refs/heads/*:refs/remotes/origin/* # timeout=10
> git rev-parse refs/remotes/origin/5.6.x^{commit} # timeout=10
Checking out Revision abf74893d38ea2fa04fd0fe21ba7271303671224 (refs/remotes/origin/5.6.x)
> git config core.sparsecheckout # timeout=10
> git checkout -f abf74893d38ea2fa04fd0fe21ba7271303671224 # timeout=10
Commit message: "Upgraded HttpClient API level to 5.6"
First time build. Skipping changelog.
Parsing POMs
Discovered a new module org.apache.httpcomponents.client5:httpclient5-observation Apache HttpClient Observation
Modules changed, recalculating dependency graph
Established TCP socket on 34641
maven35-agent.jar already up to date
maven35-interceptor.jar already up to date
maven3-interceptor-commons.jar already up to date
[HttpComponents Client 5.6.x Java17] $ /home/jenkins/tools/java/latest17/bin/java -cp /home/jenkins/maven35-agent.jar:/home/jenkins/tools/maven/latest3/boot/plexus-classworlds-2.9.0.jar:/home/jenkins/tools/maven/latest3/conf/logging jenkins.maven3.agent.Maven35Main /home/jenkins/tools/maven/latest3 /home/jenkins/agent.jar /home/jenkins/maven35-interceptor.jar /home/jenkins/maven3-interceptor-commons.jar 34641
<===[JENKINS REMOTING CAPACITY]===> channel started
Executing Maven: -B -f <https://ci-builds.apache.org/job/HttpComponents/job/HttpComponents%20Client%205.6.x%20Java17/ws/pom.xml> clean verify install -P-use-toolchains -Pnodoclint
[INFO] Scanning for projects...
[HUDSON] Collecting dependencies info
[HUDSON] Collecting dependencies info
[HUDSON] Collecting dependencies info
[INFO] ------------------------------------------------------------------------
[HUDSON] Collecting dependencies info
[INFO] Reactor Build Order:
[INFO]
[HUDSON] Collecting dependencies info
[HUDSON] Collecting dependencies info
[INFO] Apache HttpComponents Client Parent [pom]
[INFO] Apache HttpClient [jar]
[INFO] Apache HttpClient Cache [jar]
[INFO] Apache HttpClient Observation [jar]
[INFO] Apache HttpClient Fluent [jar]
[INFO] Apache HttpClient Integration Tests [jar]
[INFO]
[INFO] --------< org.apache.httpcomponents.client5:httpclient5-parent >--------
[INFO] Building Apache HttpComponents Client Parent 5.6.1-SNAPSHOT [1/6]
[INFO] from pom.xml
[INFO] --------------------------------[ pom ]---------------------------------
[INFO]
[INFO] --- clean:3.2.0:clean (default-clean) @ httpclient5-parent ---
[INFO] Deleting <https://ci-builds.apache.org/job/HttpComponents/job/HttpComponents%20Client%205.6.x%20Java17/ws/target>
[INFO]
[INFO] --- enforcer:3.1.0:enforce (enforce-maven-version) @ httpclient5-parent ---
[INFO]
[INFO] --- enforcer:3.1.0:enforce (enforce-java-version) @ httpclient5-parent ---
[INFO]
[INFO] --- checkstyle:3.3.1:checkstyle (validate) @ httpclient5-parent ---
[INFO]
[INFO] --- checkstyle:3.3.1:checkstyle (validate-main) @ httpclient5-parent ---
[INFO]
[INFO] --- checkstyle:3.3.1:checkstyle (validate-test) @ httpclient5-parent ---
[INFO]
[INFO] --- build-helper:3.2.0:parse-version (parse-version) @ httpclient5-parent ---
[INFO]
[INFO] --- remote-resources:1.7.0:process (process-resource-bundles) @ httpclient5-parent ---
[INFO] Preparing remote bundle org.apache:apache-jar-resource-bundle:1.4
[INFO] Copying 3 resources from 1 bundle.
[INFO]
[INFO] --- animal-sniffer:1.24:check (checkAPIcompatibility) @ httpclient5-parent ---
[INFO] Checking unresolved references to org.codehaus.mojo.signature:java18:1.0
[INFO]
[INFO] --- site:3.12.1:attach-descriptor (attach-descriptor) @ httpclient5-parent ---
[INFO] Attaching 'src/site/site.xml' site descriptor with classifier 'site'.
[INFO]
[INFO] --- japicmp:0.21.2:cmp (default) @ httpclient5-parent ---
[INFO] Skipping execution because parameter 'skipPomModules' was set to true and this is artifact is of type pom.
[INFO]
[INFO] --- apache-rat:0.14:check (default) @ httpclient5-parent ---
[INFO] Enabled default license matchers.
[INFO] Will parse SCM ignores for exclusions...
[INFO] Parsing exclusions from <https://ci-builds.apache.org/job/HttpComponents/job/HttpComponents%20Client%205.6.x%20Java17/ws/.gitignore>
[INFO] Finished adding exclusions from SCM ignore files.
[INFO] 79 implicit excludes.
[INFO] 9 explicit excludes.
[INFO] 136 resources included
[INFO] Rat check: Summary over all files. Unapproved: 27, unknown: 27, generated: 0, approved: 24 licenses.
[INFO] Enabled default license matchers.
[INFO] Will parse SCM ignores for exclusions...
[INFO] Parsing exclusions from <https://ci-builds.apache.org/job/HttpComponents/job/HttpComponents%20Client%205.6.x%20Java17/ws/.gitignore>
[INFO] Finished adding exclusions from SCM ignore files.
[INFO] 79 implicit excludes.
[INFO] 9 explicit excludes.
[INFO] 136 resources included
[WARNING] Files with unapproved licenses:
httpclient5-sse/target/.plxarc
httpclient5-sse/target/maven-status/maven-compiler-plugin/testCompile/default-testCompile/inputFiles.lst
httpclient5-sse/target/maven-status/maven-compiler-plugin/testCompile/default-testCompile/createdFiles.lst
httpclient5-sse/target/maven-status/maven-compiler-plugin/compile/default-compile/inputFiles.lst
httpclient5-sse/target/maven-status/maven-compiler-plugin/compile/default-compile/createdFiles.lst
httpclient5-sse/target/checkstyle-cachefile
httpclient5-sse/target/surefire-reports/TEST-org.apache.hc.client5.http.sse.ExponentialJitterBackoffTest.xml
httpclient5-sse/target/surefire-reports/TEST-org.apache.hc.client5.http.sse.ServerSentEventReaderTest.xml
httpclient5-sse/target/surefire-reports/org.apache.hc.client5.http.sse.DefaultEventSourceIntegrationTest.txt
httpclient5-sse/target/surefire-reports/TEST-org.apache.hc.client5.http.sse.DefaultEventSourceIntegrationTest.xml
httpclient5-sse/target/surefire-reports/org.apache.hc.client5.http.sse.SseResponseConsumerTest.txt
httpclient5-sse/target/surefire-reports/org.apache.hc.client5.http.sse.SseEntityConsumerTest.txt
httpclient5-sse/target/surefire-reports/TEST-org.apache.hc.client5.http.sse.SseExecutorBuilderTest.xml
httpclient5-sse/target/surefire-reports/TEST-org.apache.hc.client5.http.sse.SseEntityConsumerTest.xml
httpclient5-sse/target/surefire-reports/org.apache.hc.client5.http.sse.ServerSentEventReaderTest.txt
httpclient5-sse/target/surefire-reports/org.apache.hc.client5.http.sse.ExponentialJitterBackoffTest.txt
httpclient5-sse/target/surefire-reports/TEST-org.apache.hc.client5.http.sse.ByteSseEntityConsumerTest.xml
httpclient5-sse/target/surefire-reports/org.apache.hc.client5.http.sse.ByteSseEntityConsumerTest.txt
httpclient5-sse/target/surefire-reports/org.apache.hc.client5.http.sse.SseExecutorBuilderTest.txt
httpclient5-sse/target/surefire-reports/TEST-org.apache.hc.client5.http.sse.SseResponseConsumerTest.xml
httpclient5-sse/target/surefire-reports/TEST-org.apache.hc.client5.http.sse.NoBackoffStrategyTest.xml
httpclient5-sse/target/surefire-reports/org.apache.hc.client5.http.sse.NoBackoffStrategyTest.txt
httpclient5-sse/target/maven-archiver/pom.properties
httpclient5-sse/target/rat.txt
httpclient5-sse/target/site/checkstyle.html
httpclient5-sse/target/site/css/site.css
httpclient5-sse/target/checkstyle-result.xml
[WARNING] Attempt to (de-)serialize anonymous class org.jfrog.hudson.maven2.MavenDependenciesRecorder$1; see: https://jenkins.io/redirect/serialization-of-anonymous-classes/
[INFO] ------------------------------------------------------------------------
[INFO] Reactor Summary for Apache HttpComponents Client Parent 5.6.1-SNAPSHOT:
[INFO]
[INFO] Apache HttpComponents Client Parent ................ FAILURE [ 20.705 s]
[INFO] Apache HttpClient .................................. SKIPPED
[INFO] Apache HttpClient Cache ............................ SKIPPED
[INFO] Apache HttpClient Observation ...................... SKIPPED
[INFO] Apache HttpClient Fluent ........................... SKIPPED
[INFO] Apache HttpClient Integration Tests ................ SKIPPED
[INFO] ------------------------------------------------------------------------
[INFO] BUILD FAILURE
[INFO] ------------------------------------------------------------------------
[INFO] Total time: 38.878 s
[INFO] Finished at: 2025-12-21T00:08:29Z
[INFO] ------------------------------------------------------------------------
Waiting for Jenkins to finish collecting data
[ERROR] Failed to execute goal org.apache.rat:apache-rat-plugin:0.14:check (default) on project httpclient5-parent: Too many files with unapproved license: 27 See RAT report in: <https://ci-builds.apache.org/job/HttpComponents/job/HttpComponents%20Client%205.6.x%20Java17/ws/target/rat.txt> -> [Help 1]
[ERROR]
[ERROR] To see the full stack trace of the errors, re-run Maven with the -e switch.
[ERROR] Re-run Maven using the -X switch to enable full debug logging.
[ERROR]
[ERROR] For more information about the errors and possible solutions, please read the following articles:
[ERROR] [Help 1] http://cwiki.apache.org/confluence/display/MAVEN/MojoFailureException
[JENKINS] Archiving <https://ci-builds.apache.org/job/HttpComponents/job/HttpComponents%20Client%205.6.x%20Java17/ws/httpclient5-cache/pom.xml> to org.apache.httpcomponents.client5/httpclient5-cache/5.6.1-SNAPSHOT/httpclient5-cache-5.6.1-SNAPSHOT.pom
[JENKINS] Archiving <https://ci-builds.apache.org/job/HttpComponents/job/HttpComponents%20Client%205.6.x%20Java17/ws/httpclient5/pom.xml> to org.apache.httpcomponents.client5/httpclient5/5.6.1-SNAPSHOT/httpclient5-5.6.1-SNAPSHOT.pom
[JENKINS] Archiving <https://ci-builds.apache.org/job/HttpComponents/job/HttpComponents%20Client%205.6.x%20Java17/ws/httpclient5-fluent/pom.xml> to org.apache.httpcomponents.client5/httpclient5-fluent/5.6.1-SNAPSHOT/httpclient5-fluent-5.6.1-SNAPSHOT.pom
[JENKINS] Archiving <https://ci-builds.apache.org/job/HttpComponents/job/HttpComponents%20Client%205.6.x%20Java17/ws/httpclient5-testing/pom.xml> to org.apache.httpcomponents.client5/httpclient5-testing/5.6.1-SNAPSHOT/httpclient5-testing-5.6.1-SNAPSHOT.pom
[JENKINS] Archiving <https://ci-builds.apache.org/job/HttpComponents/job/HttpComponents%20Client%205.6.x%20Java17/ws/pom.xml> to org.apache.httpcomponents.client5/httpclient5-parent/5.6.1-SNAPSHOT/httpclient5-parent-5.6.1-SNAPSHOT.pom
[JENKINS] Archiving <https://ci-builds.apache.org/job/HttpComponents/job/HttpComponents%20Client%205.6.x%20Java17/ws/target/httpclient5-parent-5.6.1-SNAPSHOT-site.xml> to org.apache.httpcomponents.client5/httpclient5-parent/5.6.1-SNAPSHOT/httpclient5-parent-5.6.1-SNAPSHOT-site.xml
[JENKINS] Archiving <https://ci-builds.apache.org/job/HttpComponents/job/HttpComponents%20Client%205.6.x%20Java17/ws/httpclient5-observation/pom.xml> to org.apache.httpcomponents.client5/httpclient5-observation/5.6.1-SNAPSHOT/httpclient5-observation-5.6.1-SNAPSHOT.pom
channel stopped
Jenkins build is back to normal : HttpComponents » HttpComponents Client 5.6.x Java17 #145
Posted by Apache Jenkins Server <je...@builds.apache.org>.
See <https://ci-builds.apache.org/job/HttpComponents/job/HttpComponents%20Client%205.6.x%20Java17/145/display/redirect>