You are viewing a plain text version of this content. The canonical link for it is here.
Posted to dev@royale.apache.org by ap...@gmail.com on 2020/02/19 23:25:00 UTC

Build failed in Jenkins: TourDeFlexMigration #647

See <http://apacheroyaleci2.westus2.cloudapp.azure.com:8080/job/TourDeFlexMigration/647/display/redirect?page=changes>

Changes:

[joshtynjala] fix asdoc example

[carlosrovira] jewel-buttonbar: fix IE11 issue in layout (was not completly cross

[carlosrovira] jewel-layouts: some cleaning of imports and commented code

[carlosrovira] jewel-card: updates to card structure and styles

[carlosrovira] tour-de-jewel: add new card examples (still WIP)

[carlosrovira] jewel-styles: application main color and alert color updates to get some


------------------------------------------
Started by upstream project "royale-asjs" build number 747
originally caused by:
 Started by upstream project "royale-asjs_jsonly" build number 848
 originally caused by:
  Started by an SCM change
Running as SYSTEM
[EnvInject] - Loading node environment variables.
Building remotely on agent1 in workspace <http://apacheroyaleci2.westus2.cloudapp.azure.com:8080/job/TourDeFlexMigration/ws/>
No credentials specified
 > C:\Program Files\Git\cmd\git.exe rev-parse --is-inside-work-tree # timeout=10
Fetching changes from the remote Git repository
 > C:\Program Files\Git\cmd\git.exe config remote.origin.url https://github.com/apache/royale-asjs # timeout=10
Fetching upstream changes from https://github.com/apache/royale-asjs
 > C:\Program Files\Git\cmd\git.exe --version # timeout=10
 > C:\Program Files\Git\cmd\git.exe fetch --tags --force --progress -- https://github.com/apache/royale-asjs +refs/heads/*:refs/remotes/origin/*
 > C:\Program Files\Git\cmd\git.exe rev-parse "refs/remotes/origin/develop^{commit}" # timeout=10
 > C:\Program Files\Git\cmd\git.exe rev-parse "refs/remotes/origin/origin/develop^{commit}" # timeout=10
Checking out Revision 238dcd1d75115dc75aedd02273d0a84d97062d73 (refs/remotes/origin/develop)
 > C:\Program Files\Git\cmd\git.exe config core.sparsecheckout # timeout=10
 > C:\Program Files\Git\cmd\git.exe checkout -f 238dcd1d75115dc75aedd02273d0a84d97062d73
Commit message: "jewel-styles: application main color and alert color updates to get some colored main background light and desaturated based on primary color as default"
 > C:\Program Files\Git\cmd\git.exe rev-list --no-walk a9e54e7f75d28f8f009a24f49f9dc4ffd81b8ceb # timeout=10
[tourdeflexmodules] $ cmd.exe /C "C:\apache\apache-ant-1.9.9\bin\ant.bat -file build.xml -Denv.FLASHPLAYER_DEBUGGER=C:\adobe\flash\11.7\flashplayerdebugger.exe -Denv.PLAYERGLOBAL_HOME=C:\adobe\flash -Denv.AIR_HOME=C:\adobe\air\4.0\AdobeAIRSDK -DROYALE_HOME=C:\jenkins\workspace\royale-asjs -Dbuild.noprompt=true -Dplayerglobal.version=11.7 clean compile && exit %%ERRORLEVEL%%"
Buildfile: <http://apacheroyaleci2.westus2.cloudapp.azure.com:8080/job/TourDeFlexMigration/ws/examples/mxroyale/tourdeflexmodules/build.xml>

clean:
   [delete] Deleting directory <http://apacheroyaleci2.westus2.cloudapp.azure.com:8080/job/TourDeFlexMigration/ws/examples/mxroyale/tourdeflexmodules/bin>

compile-shell:
    [mkdir] Created dir: <http://apacheroyaleci2.westus2.cloudapp.azure.com:8080/job/TourDeFlexMigration/647/artifact/examples/mxroyale/tourdeflexmodules/bin/js-debug>
    [mxmlc] MXMLJSC
    [mxmlc] -module-output=/
    [mxmlc] -js-compiler-option=--variable_map_output_file gcc_variablemap.txt
    [mxmlc] -js-compiler-option+=--property_map_output_file gcc_propertymap.txt
    [mxmlc] -externs-report=<http://apacheroyaleci2.westus2.cloudapp.azure.com:8080/job/TourDeFlexMigration/647/artifact/examples/mxroyale/tourdeflexmodules/bin/js-debug/externs_report.js>
    [mxmlc] -link-report=<http://apacheroyaleci2.westus2.cloudapp.azure.com:8080/job/TourDeFlexMigration/647/artifact/examples/mxroyale/tourdeflexmodules/bin/js-debug/link_report.xml>
    [mxmlc] +playerglobal.version=11.7
    [mxmlc] +env.AIR_HOME=C:\adobe\air\4.0\AdobeAIRSDK
    [mxmlc] +env.PLAYERGLOBAL_HOME=C:\adobe\flash
    [mxmlc] -compiler.debug=false
    [mxmlc] +royalelib=C:\jenkins\workspace\royale-asjs/frameworks/
    [mxmlc] -load-config=C:\jenkins\workspace\royale-asjs/frameworks/flex-config.xml
    [mxmlc] -output=<http://apacheroyaleci2.westus2.cloudapp.azure.com:8080/job/TourDeFlexMigration/ws/examples/mxroyale/tourdeflexmodules/bin-debug/explorer.swf>
    [mxmlc] --
    [mxmlc] <http://apacheroyaleci2.westus2.cloudapp.azure.com:8080/job/TourDeFlexMigration/ws/examples/mxroyale/tourdeflexmodules/src//explorer.mxml>
    [mxmlc] Loading configuration: C:\jenkins\workspace\royale-asjs\frameworks\flex-config.xml
    [mxmlc] 
    [mxmlc] 330078 bytes written to C:\jenkins\workspace\TourDeFlexMigration\examples\mxroyale\tourdeflexmodules\bin-debug\explorer.swf in 30.424 seconds
    [mxmlc] Feb 19, 2020 11:24:42 PM com.google.javascript.jscomp.LoggerErrorManager println
    [mxmlc] WARNING: c:/jenkins/workspace/TourDeFlexMigration/examples/mxroyale/tourdeflexmodules/bin/js-debug/SourceTab.js:124: WARNING - Invalid flags to RegExp constructor: STRING gs 124 [length: 4] [source_file: c:/jenkins/workspace/TourDeFlexMigration/examples/mxroyale/tourdeflexmodules/bin/js-debug/SourceTab.js] : string
    [mxmlc]   var /** @type {RegExp} */ r = new RegExp("\r\n", "gs");
    [mxmlc]                                                    ^^^^
    [mxmlc] 
    [mxmlc] Feb 19, 2020 11:24:42 PM com.google.javascript.jscomp.LoggerErrorManager println
    [mxmlc] WARNING: c:/jenkins/workspace/TourDeFlexMigration/examples/mxroyale/tourdeflexmodules/bin/js-debug/explorer.js:398: WARNING - Parse error. extra visibility tag
    [mxmlc]   * @private
    [mxmlc]     ^
    [mxmlc] 
    [mxmlc] Feb 19, 2020 11:24:42 PM com.google.javascript.jscomp.LoggerErrorManager println
    [mxmlc] WARNING: c:/jenkins/workspace/TourDeFlexMigration/examples/mxroyale/tourdeflexmodules/bin/js-debug/mx/containers/beads/DividedBoxLayout.js:60: WARNING - unreachable code
    [mxmlc]   this.mx_containers_beads_DividedBoxLayout_postLayoutAdjustment();
    [mxmlc]   ^^^^^^^^^^^^^^^^^^^^^^^^^^^^^^^^^^^^^^^^^^^^^^^^^^^^^^^^^^^^^^^^^
    [mxmlc] 
    [mxmlc] Feb 19, 2020 11:24:42 PM com.google.javascript.jscomp.LoggerErrorManager println
    [mxmlc] WARNING: c:/jenkins/workspace/TourDeFlexMigration/examples/mxroyale/tourdeflexmodules/bin/js-debug/mx/core/UIComponent.js:3204: WARNING - Suspicious code. This code lacks side-effects. Is there a bug?
    [mxmlc]   } else if ((this.mx_core_UIComponent__toolTip == null || this.mx_core_UIComponent__toolTip == "") && this.mx_core_UIComponent__toolTipBead != null) {
    [mxmlc]          ^^^^^^^^^^^^^^^^^^^^^^^^^^^^^^^^^^^^^^^^^^^^^^^^^^^^^^^^^^^^^^^^^^^^^^^^^^^^^^^^^^^^^^^^^^^^^^^^^^^^^^^^^^^^^^^^^^^^^^^^^^^^^^^^^^^^^^^^^^^^^^^
    [mxmlc] 
    [mxmlc] Feb 19, 2020 11:24:42 PM com.google.javascript.jscomp.LoggerErrorManager println
    [mxmlc] WARNING: c:/jenkins/workspace/TourDeFlexMigration/examples/mxroyale/tourdeflexmodules/bin/js-debug/mx/rpc/http/AbstractOperation.js:413: WARNING - unreachable code
    [mxmlc]         if (this.makeObjectsBindable && false) {
    [mxmlc]                                                ^^
    [mxmlc] 
    [mxmlc] Feb 19, 2020 11:24:42 PM com.google.javascript.jscomp.LoggerErrorManager printSummary
    [mxmlc] WARNING: 0 error(s), 5 warning(s), 98.4% typed
    [mxmlc] Picked up JAVA_TOOL_OPTIONS: -Dfile.encoding=UTF-8 -Xms384m -Xmx2g
    [mxmlc] The project 'explorer' has been successfully compiled and optimized.
    [mxmlc] 118.7893161 seconds
    [mxmlc] MXMLJSC
    [mxmlc] -module-output=/
    [mxmlc] -load-externs=<http://apacheroyaleci2.westus2.cloudapp.azure.com:8080/job/TourDeFlexMigration/647/artifact/examples/mxroyale/tourdeflexmodules/bin/js-debug/link_report-js.xml>
    [mxmlc] -js-compiler-option=--variable_map_input_file gcc_variablemap.txt
    [mxmlc] -js-compiler-option+=--property_map_input_file gcc_propertymap.txt
    [mxmlc] -js-compiler-option+=--externs <http://apacheroyaleci2.westus2.cloudapp.azure.com:8080/job/TourDeFlexMigration/647/artifact/examples/mxroyale/tourdeflexmodules/bin/js-debug/externs_report.js>
    [mxmlc] +playerglobal.version=11.7
    [mxmlc] +env.AIR_HOME=C:\adobe\air\4.0\AdobeAIRSDK
    [mxmlc] +env.PLAYERGLOBAL_HOME=C:\adobe\flash
    [mxmlc] -compiler.debug=false
    [mxmlc] +royalelib=C:\jenkins\workspace\royale-asjs/frameworks/
    [mxmlc] -load-config=C:\jenkins\workspace\royale-asjs/frameworks/flex-config.xml
    [mxmlc] -output=<http://apacheroyaleci2.westus2.cloudapp.azure.com:8080/job/TourDeFlexMigration/ws/examples/mxroyale/tourdeflexmodules/bin-debug/Welcome.swf>
    [mxmlc] --
    [mxmlc] <http://apacheroyaleci2.westus2.cloudapp.azure.com:8080/job/TourDeFlexMigration/ws/examples/mxroyale/tourdeflexmodules/src//Welcome.mxml>
    [mxmlc] Loading configuration: C:\jenkins\workspace\royale-asjs\frameworks\flex-config.xml
    [mxmlc] 
    [mxmlc] 43856 bytes written to C:\jenkins\workspace\TourDeFlexMigration\examples\mxroyale\tourdeflexmodules\bin-debug\Welcome.swf in 4.675 seconds
    [mxmlc] 15.3592044 seconds
    [mxmlc] Internal error: java.lang.IllegalArgumentException: Multiple entries with same value: clampToRange=UP and UP=UP com.google.common.collect.ImmutableMap.conflictException(ImmutableMap.java:215)com.google.common.collect.ImmutableMap.checkNoConflict(ImmutableMap.java:209)com.google.common.collect.RegularImmutableBiMap.checkNoConflictInValueBucket(RegularImmutableBiMap.java:131)com.google.common.collect.RegularImmutableBiMap.fromEntryArray(RegularImmutableBiMap.java:89)com.google.common.collect.RegularImmutableBiMap.fromEntries(RegularImmutableBiMap.java:58)com.google.common.collect.ImmutableBiMap.copyOf(ImmutableBiMap.java:368)com.google.common.collect.ImmutableBiMap.copyOf(ImmutableBiMap.java:340)com.google.javascript.jscomp.VariableMap.<init>(VariableMap.java:49)com.google.javascript.jscomp.VariableMap.fromMap(VariableMap.java:205)org.apache.royale.compiler.utils.JSClosureCompilerWrapper.compile(JSClosureCompilerWrapper.java:187)org.apache.royale.compiler.internal.codegen.mxml.royale.MXMLRoyalePublisher.publish(MXMLRoyalePublisher.java:574)org.apache.royale.compiler.clients.MXMLJSCRoyale.compile(MXMLJSCRoyale.java:446)org.apache.royale.compiler.clients.MXMLJSCRoyale._mainNoExit(MXMLJSCRoyale.java:267)org.apache.royale.compiler.clients.MXMLJSCRoyale.mainNoExit(MXMLJSCRoyale.java:224)org.apache.royale.compiler.clients.MXMLJSC._mainNoExit(MXMLJSC.java:371)org.apache.royale.compiler.clients.MXMLJSC.mainNoExit(MXMLJSC.java:306)org.apache.royale.compiler.clients.MXMLJSC.staticMainNoExit(MXMLJSC.java:264)org.apache.royale.compiler.clients.MXMLJSC.main(MXMLJSC.java:246)
    [mxmlc] 
    [mxmlc] 
    [mxmlc] Picked up JAVA_TOOL_OPTIONS: -Dfile.encoding=UTF-8 -Xms384m -Xmx2g

BUILD FAILED
<http://apacheroyaleci2.westus2.cloudapp.azure.com:8080/job/TourDeFlexMigration/ws/examples/mxroyale/tourdeflexmodules/build.xml>:166: The following error occurred while executing this line:
<http://apacheroyaleci2.westus2.cloudapp.azure.com:8080/job/TourDeFlexMigration/ws/examples/mxroyale/tourdeflexmodules/build.xml>:96: mxmlc task failed.

Total time: 2 minutes 16 seconds
Picked up JAVA_TOOL_OPTIONS: -Dfile.encoding=UTF-8 -Xms384m -Xmx2g
Build step 'Invoke Ant' marked build as failure
Skipped archiving because build is not successful

Jenkins build is back to normal : TourDeFlexMigration #652

Posted by ap...@gmail.com.
See <http://apacheroyaleci2.westus2.cloudapp.azure.com:8080/job/TourDeFlexMigration/652/display/redirect?page=changes>


Build failed in Jenkins: TourDeFlexMigration #651

Posted by ap...@gmail.com.
See <http://apacheroyaleci2.westus2.cloudapp.azure.com:8080/job/TourDeFlexMigration/651/display/redirect>

Changes:


------------------------------------------
Started by upstream project "royale-asjs" build number 751
originally caused by:
 Started by upstream project "royale-asjs_jsonly" build number 853
 originally caused by:
  Started by upstream project "royale-typedefs" build number 354
  originally caused by:
   Started by upstream project "royale-compiler" build number 218
   originally caused by:
    Started by timer
Running as SYSTEM
[EnvInject] - Loading node environment variables.
Building remotely on agent1 in workspace <http://apacheroyaleci2.westus2.cloudapp.azure.com:8080/job/TourDeFlexMigration/ws/>
No credentials specified
 > C:\Program Files\Git\cmd\git.exe rev-parse --is-inside-work-tree # timeout=10
Fetching changes from the remote Git repository
 > C:\Program Files\Git\cmd\git.exe config remote.origin.url https://github.com/apache/royale-asjs # timeout=10
Fetching upstream changes from https://github.com/apache/royale-asjs
 > C:\Program Files\Git\cmd\git.exe --version # timeout=10
 > C:\Program Files\Git\cmd\git.exe fetch --tags --force --progress -- https://github.com/apache/royale-asjs +refs/heads/*:refs/remotes/origin/*
 > C:\Program Files\Git\cmd\git.exe rev-parse "refs/remotes/origin/develop^{commit}" # timeout=10
 > C:\Program Files\Git\cmd\git.exe rev-parse "refs/remotes/origin/origin/develop^{commit}" # timeout=10
Checking out Revision b632cd95d755db31639eaf7940448f7e6a769f04 (refs/remotes/origin/develop)
 > C:\Program Files\Git\cmd\git.exe config core.sparsecheckout # timeout=10
 > C:\Program Files\Git\cmd\git.exe checkout -f b632cd95d755db31639eaf7940448f7e6a769f04
Commit message: "Merge branch 'develop' of https://github.com/apache/royale-asjs into develop"
 > C:\Program Files\Git\cmd\git.exe rev-list --no-walk b632cd95d755db31639eaf7940448f7e6a769f04 # timeout=10
[tourdeflexmodules] $ cmd.exe /C "C:\apache\apache-ant-1.9.9\bin\ant.bat -file build.xml -Denv.FLASHPLAYER_DEBUGGER=C:\adobe\flash\11.7\flashplayerdebugger.exe -Denv.PLAYERGLOBAL_HOME=C:\adobe\flash -Denv.AIR_HOME=C:\adobe\air\4.0\AdobeAIRSDK -DROYALE_HOME=C:\jenkins\workspace\royale-asjs -Dbuild.noprompt=true -Dplayerglobal.version=11.7 clean compile && exit %%ERRORLEVEL%%"
Buildfile: <http://apacheroyaleci2.westus2.cloudapp.azure.com:8080/job/TourDeFlexMigration/ws/examples/mxroyale/tourdeflexmodules/build.xml>

clean:
   [delete] Deleting directory <http://apacheroyaleci2.westus2.cloudapp.azure.com:8080/job/TourDeFlexMigration/ws/examples/mxroyale/tourdeflexmodules/bin>

compile-shell:
    [mkdir] Created dir: <http://apacheroyaleci2.westus2.cloudapp.azure.com:8080/job/TourDeFlexMigration/651/artifact/examples/mxroyale/tourdeflexmodules/bin/js-debug>
    [mxmlc] MXMLJSC
    [mxmlc] -module-output=/
    [mxmlc] -js-compiler-option=--variable_map_output_file gcc_variablemap.txt
    [mxmlc] -js-compiler-option+=--property_map_output_file gcc_propertymap.txt
    [mxmlc] -externs-report=<http://apacheroyaleci2.westus2.cloudapp.azure.com:8080/job/TourDeFlexMigration/651/artifact/examples/mxroyale/tourdeflexmodules/bin/js-debug/externs_report.js>
    [mxmlc] -link-report=<http://apacheroyaleci2.westus2.cloudapp.azure.com:8080/job/TourDeFlexMigration/651/artifact/examples/mxroyale/tourdeflexmodules/bin/js-debug/link_report.xml>
    [mxmlc] +playerglobal.version=11.7
    [mxmlc] +env.AIR_HOME=C:\adobe\air\4.0\AdobeAIRSDK
    [mxmlc] +env.PLAYERGLOBAL_HOME=C:\adobe\flash
    [mxmlc] -compiler.debug=false
    [mxmlc] +royalelib=C:\jenkins\workspace\royale-asjs/frameworks/
    [mxmlc] -load-config=C:\jenkins\workspace\royale-asjs/frameworks/flex-config.xml
    [mxmlc] -output=<http://apacheroyaleci2.westus2.cloudapp.azure.com:8080/job/TourDeFlexMigration/ws/examples/mxroyale/tourdeflexmodules/bin-debug/explorer.swf>
    [mxmlc] --
    [mxmlc] <http://apacheroyaleci2.westus2.cloudapp.azure.com:8080/job/TourDeFlexMigration/ws/examples/mxroyale/tourdeflexmodules/src//explorer.mxml>
    [mxmlc] Loading configuration: C:\jenkins\workspace\royale-asjs\frameworks\flex-config.xml
    [mxmlc] 
    [mxmlc] 331499 bytes written to C:\jenkins\workspace\TourDeFlexMigration\examples\mxroyale\tourdeflexmodules\bin-debug\explorer.swf in 19.175 seconds
    [mxmlc] Feb 20, 2020 1:32:21 PM com.google.javascript.jscomp.LoggerErrorManager println
    [mxmlc] WARNING: c:/jenkins/workspace/TourDeFlexMigration/examples/mxroyale/tourdeflexmodules/bin/js-debug/SourceTab.js:124: WARNING - Invalid flags to RegExp constructor: STRING gs 124 [length: 4] [source_file: c:/jenkins/workspace/TourDeFlexMigration/examples/mxroyale/tourdeflexmodules/bin/js-debug/SourceTab.js] : string
    [mxmlc]   var /** @type {RegExp} */ r = new RegExp("\r\n", "gs");
    [mxmlc]                                                    ^^^^
    [mxmlc] 
    [mxmlc] Feb 20, 2020 1:32:21 PM com.google.javascript.jscomp.LoggerErrorManager println
    [mxmlc] WARNING: c:/jenkins/workspace/TourDeFlexMigration/examples/mxroyale/tourdeflexmodules/bin/js-debug/explorer.js:398: WARNING - Parse error. extra visibility tag
    [mxmlc]   * @private
    [mxmlc]     ^
    [mxmlc] 
    [mxmlc] Feb 20, 2020 1:32:21 PM com.google.javascript.jscomp.LoggerErrorManager println
    [mxmlc] WARNING: c:/jenkins/workspace/TourDeFlexMigration/examples/mxroyale/tourdeflexmodules/bin/js-debug/mx/containers/beads/DividedBoxLayout.js:60: WARNING - unreachable code
    [mxmlc]   this.mx_containers_beads_DividedBoxLayout_postLayoutAdjustment();
    [mxmlc]   ^^^^^^^^^^^^^^^^^^^^^^^^^^^^^^^^^^^^^^^^^^^^^^^^^^^^^^^^^^^^^^^^^
    [mxmlc] 
    [mxmlc] Feb 20, 2020 1:32:21 PM com.google.javascript.jscomp.LoggerErrorManager println
    [mxmlc] WARNING: c:/jenkins/workspace/TourDeFlexMigration/examples/mxroyale/tourdeflexmodules/bin/js-debug/mx/core/UIComponent.js:3221: WARNING - Suspicious code. This code lacks side-effects. Is there a bug?
    [mxmlc]   } else if ((this.mx_core_UIComponent__toolTip == null || this.mx_core_UIComponent__toolTip == "") && this.mx_core_UIComponent__toolTipBead != null) {
    [mxmlc]          ^^^^^^^^^^^^^^^^^^^^^^^^^^^^^^^^^^^^^^^^^^^^^^^^^^^^^^^^^^^^^^^^^^^^^^^^^^^^^^^^^^^^^^^^^^^^^^^^^^^^^^^^^^^^^^^^^^^^^^^^^^^^^^^^^^^^^^^^^^^^^^^
    [mxmlc] 
    [mxmlc] Feb 20, 2020 1:32:21 PM com.google.javascript.jscomp.LoggerErrorManager println
    [mxmlc] WARNING: c:/jenkins/workspace/TourDeFlexMigration/examples/mxroyale/tourdeflexmodules/bin/js-debug/mx/rpc/http/AbstractOperation.js:413: WARNING - unreachable code
    [mxmlc]         if (this.makeObjectsBindable && false) {
    [mxmlc]                                                ^^
    [mxmlc] 
    [mxmlc] Feb 20, 2020 1:32:21 PM com.google.javascript.jscomp.LoggerErrorManager printSummary
    [mxmlc] WARNING: 0 error(s), 5 warning(s), 98.4% typed
    [mxmlc] Picked up JAVA_TOOL_OPTIONS: -Dfile.encoding=UTF-8 -Xms384m -Xmx2g
    [mxmlc] The project 'explorer' has been successfully compiled and optimized.
    [mxmlc] 120.9976205 seconds
    [mxmlc] MXMLJSC
    [mxmlc] -module-output=/
    [mxmlc] -load-externs=<http://apacheroyaleci2.westus2.cloudapp.azure.com:8080/job/TourDeFlexMigration/651/artifact/examples/mxroyale/tourdeflexmodules/bin/js-debug/link_report-js.xml>
    [mxmlc] -js-compiler-option=--variable_map_input_file gcc_variablemap.txt
    [mxmlc] -js-compiler-option+=--property_map_input_file gcc_propertymap.txt
    [mxmlc] -js-compiler-option+=--externs <http://apacheroyaleci2.westus2.cloudapp.azure.com:8080/job/TourDeFlexMigration/651/artifact/examples/mxroyale/tourdeflexmodules/bin/js-debug/externs_report.js>
    [mxmlc] +playerglobal.version=11.7
    [mxmlc] +env.AIR_HOME=C:\adobe\air\4.0\AdobeAIRSDK
    [mxmlc] +env.PLAYERGLOBAL_HOME=C:\adobe\flash
    [mxmlc] -compiler.debug=false
    [mxmlc] +royalelib=C:\jenkins\workspace\royale-asjs/frameworks/
    [mxmlc] -load-config=C:\jenkins\workspace\royale-asjs/frameworks/flex-config.xml
    [mxmlc] -output=<http://apacheroyaleci2.westus2.cloudapp.azure.com:8080/job/TourDeFlexMigration/ws/examples/mxroyale/tourdeflexmodules/bin-debug/Welcome.swf>
    [mxmlc] --
    [mxmlc] <http://apacheroyaleci2.westus2.cloudapp.azure.com:8080/job/TourDeFlexMigration/ws/examples/mxroyale/tourdeflexmodules/src//Welcome.mxml>
    [mxmlc] Loading configuration: C:\jenkins\workspace\royale-asjs\frameworks\flex-config.xml
    [mxmlc] 
    [mxmlc] 43847 bytes written to C:\jenkins\workspace\TourDeFlexMigration\examples\mxroyale\tourdeflexmodules\bin-debug\Welcome.swf in 10.480 seconds
    [mxmlc] Internal error: java.lang.IllegalArgumentException: Multiple entries with same value: clearCellList=UP and UP=UP com.google.common.collect.ImmutableMap.conflictException(ImmutableMap.java:215)com.google.common.collect.ImmutableMap.checkNoConflict(ImmutableMap.java:209)com.google.common.collect.RegularImmutableBiMap.checkNoConflictInValueBucket(RegularImmutableBiMap.java:131)com.google.common.collect.RegularImmutableBiMap.fromEntryArray(RegularImmutableBiMap.java:89)com.google.common.collect.RegularImmutableBiMap.fromEntries(RegularImmutableBiMap.java:58)com.google.common.collect.ImmutableBiMap.copyOf(ImmutableBiMap.java:368)com.google.common.collect.ImmutableBiMap.copyOf(ImmutableBiMap.java:340)com.google.javascript.jscomp.VariableMap.<init>(VariableMap.java:49)com.google.javascript.jscomp.VariableMap.fromMap(VariableMap.java:205)org.apache.royale.compiler.utils.JSClosureCompilerWrapper.compile(JSClosureCompilerWrapper.java:187)org.apache.royale.compiler.internal.codegen.mxml.royale.MXMLRoyalePublisher.publish(MXMLRoyalePublisher.java:574)org.apache.royale.compiler.clients.MXMLJSCRoyale.compile(MXMLJSCRoyale.java:446)org.apache.royale.compiler.clients.MXMLJSCRoyale._mainNoExit(MXMLJSCRoyale.java:267)org.apache.royale.compiler.clients.MXMLJSCRoyale.mainNoExit(MXMLJSCRoyale.java:224)org.apache.royale.compiler.clients.MXMLJSC._mainNoExit(MXMLJSC.java:371)org.apache.royale.compiler.clients.MXMLJSC.mainNoExit(MXMLJSC.java:306)org.apache.royale.compiler.clients.MXMLJSC.staticMainNoExit(MXMLJSC.java:264)org.apache.royale.compiler.clients.MXMLJSC.main(MXMLJSC.java:246)
    [mxmlc] 
    [mxmlc] 
    [mxmlc] 22.009828 seconds
    [mxmlc] Picked up JAVA_TOOL_OPTIONS: -Dfile.encoding=UTF-8 -Xms384m -Xmx2g

BUILD FAILED
<http://apacheroyaleci2.westus2.cloudapp.azure.com:8080/job/TourDeFlexMigration/ws/examples/mxroyale/tourdeflexmodules/build.xml>:166: The following error occurred while executing this line:
<http://apacheroyaleci2.westus2.cloudapp.azure.com:8080/job/TourDeFlexMigration/ws/examples/mxroyale/tourdeflexmodules/build.xml>:96: mxmlc task failed.

Total time: 2 minutes 25 seconds
Picked up JAVA_TOOL_OPTIONS: -Dfile.encoding=UTF-8 -Xms384m -Xmx2g
Build step 'Invoke Ant' marked build as failure
Skipped archiving because build is not successful

Build failed in Jenkins: TourDeFlexMigration #650

Posted by ap...@gmail.com.
See <http://apacheroyaleci2.westus2.cloudapp.azure.com:8080/job/TourDeFlexMigration/650/display/redirect>

Changes:


------------------------------------------
Started by upstream project "royale-asjs" build number 750
originally caused by:
 Started by upstream project "royale-asjs_jsonly" build number 851
 originally caused by:
  Started by upstream project "royale-typedefs" build number 352
  originally caused by:
   Started by upstream project "royale-compiler" build number 217
   originally caused by:
    Started by an SCM change
  Started by timer
  Started by an SCM change
Running as SYSTEM
[EnvInject] - Loading node environment variables.
Building remotely on agent1 in workspace <http://apacheroyaleci2.westus2.cloudapp.azure.com:8080/job/TourDeFlexMigration/ws/>
No credentials specified
 > C:\Program Files\Git\cmd\git.exe rev-parse --is-inside-work-tree # timeout=10
Fetching changes from the remote Git repository
 > C:\Program Files\Git\cmd\git.exe config remote.origin.url https://github.com/apache/royale-asjs # timeout=10
Fetching upstream changes from https://github.com/apache/royale-asjs
 > C:\Program Files\Git\cmd\git.exe --version # timeout=10
 > C:\Program Files\Git\cmd\git.exe fetch --tags --force --progress -- https://github.com/apache/royale-asjs +refs/heads/*:refs/remotes/origin/*
 > C:\Program Files\Git\cmd\git.exe rev-parse "refs/remotes/origin/develop^{commit}" # timeout=10
 > C:\Program Files\Git\cmd\git.exe rev-parse "refs/remotes/origin/origin/develop^{commit}" # timeout=10
Checking out Revision b632cd95d755db31639eaf7940448f7e6a769f04 (refs/remotes/origin/develop)
 > C:\Program Files\Git\cmd\git.exe config core.sparsecheckout # timeout=10
 > C:\Program Files\Git\cmd\git.exe checkout -f b632cd95d755db31639eaf7940448f7e6a769f04
Commit message: "Merge branch 'develop' of https://github.com/apache/royale-asjs into develop"
 > C:\Program Files\Git\cmd\git.exe rev-list --no-walk b632cd95d755db31639eaf7940448f7e6a769f04 # timeout=10
[tourdeflexmodules] $ cmd.exe /C "C:\apache\apache-ant-1.9.9\bin\ant.bat -file build.xml -Denv.FLASHPLAYER_DEBUGGER=C:\adobe\flash\11.7\flashplayerdebugger.exe -Denv.PLAYERGLOBAL_HOME=C:\adobe\flash -Denv.AIR_HOME=C:\adobe\air\4.0\AdobeAIRSDK -DROYALE_HOME=C:\jenkins\workspace\royale-asjs -Dbuild.noprompt=true -Dplayerglobal.version=11.7 clean compile && exit %%ERRORLEVEL%%"
Buildfile: <http://apacheroyaleci2.westus2.cloudapp.azure.com:8080/job/TourDeFlexMigration/ws/examples/mxroyale/tourdeflexmodules/build.xml>

clean:
   [delete] Deleting directory <http://apacheroyaleci2.westus2.cloudapp.azure.com:8080/job/TourDeFlexMigration/ws/examples/mxroyale/tourdeflexmodules/bin>

compile-shell:
    [mkdir] Created dir: <http://apacheroyaleci2.westus2.cloudapp.azure.com:8080/job/TourDeFlexMigration/650/artifact/examples/mxroyale/tourdeflexmodules/bin/js-debug>
    [mxmlc] MXMLJSC
    [mxmlc] -module-output=/
    [mxmlc] -js-compiler-option=--variable_map_output_file gcc_variablemap.txt
    [mxmlc] -js-compiler-option+=--property_map_output_file gcc_propertymap.txt
    [mxmlc] -externs-report=<http://apacheroyaleci2.westus2.cloudapp.azure.com:8080/job/TourDeFlexMigration/650/artifact/examples/mxroyale/tourdeflexmodules/bin/js-debug/externs_report.js>
    [mxmlc] -link-report=<http://apacheroyaleci2.westus2.cloudapp.azure.com:8080/job/TourDeFlexMigration/650/artifact/examples/mxroyale/tourdeflexmodules/bin/js-debug/link_report.xml>
    [mxmlc] +playerglobal.version=11.7
    [mxmlc] +env.AIR_HOME=C:\adobe\air\4.0\AdobeAIRSDK
    [mxmlc] +env.PLAYERGLOBAL_HOME=C:\adobe\flash
    [mxmlc] -compiler.debug=false
    [mxmlc] +royalelib=C:\jenkins\workspace\royale-asjs/frameworks/
    [mxmlc] -load-config=C:\jenkins\workspace\royale-asjs/frameworks/flex-config.xml
    [mxmlc] -output=<http://apacheroyaleci2.westus2.cloudapp.azure.com:8080/job/TourDeFlexMigration/ws/examples/mxroyale/tourdeflexmodules/bin-debug/explorer.swf>
    [mxmlc] --
    [mxmlc] <http://apacheroyaleci2.westus2.cloudapp.azure.com:8080/job/TourDeFlexMigration/ws/examples/mxroyale/tourdeflexmodules/src//explorer.mxml>
    [mxmlc] Loading configuration: C:\jenkins\workspace\royale-asjs\frameworks\flex-config.xml
    [mxmlc] 
    [mxmlc] 331499 bytes written to C:\jenkins\workspace\TourDeFlexMigration\examples\mxroyale\tourdeflexmodules\bin-debug\explorer.swf in 8.855 seconds
    [mxmlc] Feb 20, 2020 4:36:53 AM com.google.javascript.jscomp.LoggerErrorManager println
    [mxmlc] WARNING: c:/jenkins/workspace/TourDeFlexMigration/examples/mxroyale/tourdeflexmodules/bin/js-debug/SourceTab.js:124: WARNING - Invalid flags to RegExp constructor: STRING gs 124 [length: 4] [source_file: c:/jenkins/workspace/TourDeFlexMigration/examples/mxroyale/tourdeflexmodules/bin/js-debug/SourceTab.js] : string
    [mxmlc]   var /** @type {RegExp} */ r = new RegExp("\r\n", "gs");
    [mxmlc]                                                    ^^^^
    [mxmlc] 
    [mxmlc] Feb 20, 2020 4:36:53 AM com.google.javascript.jscomp.LoggerErrorManager println
    [mxmlc] WARNING: c:/jenkins/workspace/TourDeFlexMigration/examples/mxroyale/tourdeflexmodules/bin/js-debug/explorer.js:398: WARNING - Parse error. extra visibility tag
    [mxmlc]   * @private
    [mxmlc]     ^
    [mxmlc] 
    [mxmlc] Feb 20, 2020 4:36:53 AM com.google.javascript.jscomp.LoggerErrorManager println
    [mxmlc] WARNING: c:/jenkins/workspace/TourDeFlexMigration/examples/mxroyale/tourdeflexmodules/bin/js-debug/mx/containers/beads/DividedBoxLayout.js:60: WARNING - unreachable code
    [mxmlc]   this.mx_containers_beads_DividedBoxLayout_postLayoutAdjustment();
    [mxmlc]   ^^^^^^^^^^^^^^^^^^^^^^^^^^^^^^^^^^^^^^^^^^^^^^^^^^^^^^^^^^^^^^^^^
    [mxmlc] 
    [mxmlc] Feb 20, 2020 4:36:53 AM com.google.javascript.jscomp.LoggerErrorManager println
    [mxmlc] WARNING: c:/jenkins/workspace/TourDeFlexMigration/examples/mxroyale/tourdeflexmodules/bin/js-debug/mx/core/UIComponent.js:3221: WARNING - Suspicious code. This code lacks side-effects. Is there a bug?
    [mxmlc]   } else if ((this.mx_core_UIComponent__toolTip == null || this.mx_core_UIComponent__toolTip == "") && this.mx_core_UIComponent__toolTipBead != null) {
    [mxmlc]          ^^^^^^^^^^^^^^^^^^^^^^^^^^^^^^^^^^^^^^^^^^^^^^^^^^^^^^^^^^^^^^^^^^^^^^^^^^^^^^^^^^^^^^^^^^^^^^^^^^^^^^^^^^^^^^^^^^^^^^^^^^^^^^^^^^^^^^^^^^^^^^^
    [mxmlc] 
    [mxmlc] Feb 20, 2020 4:36:53 AM com.google.javascript.jscomp.LoggerErrorManager println
    [mxmlc] WARNING: c:/jenkins/workspace/TourDeFlexMigration/examples/mxroyale/tourdeflexmodules/bin/js-debug/mx/rpc/http/AbstractOperation.js:413: WARNING - unreachable code
    [mxmlc]         if (this.makeObjectsBindable && false) {
    [mxmlc]                                                ^^
    [mxmlc] 
    [mxmlc] Feb 20, 2020 4:36:53 AM com.google.javascript.jscomp.LoggerErrorManager printSummary
    [mxmlc] WARNING: 0 error(s), 5 warning(s), 98.4% typed
    [mxmlc] Picked up JAVA_TOOL_OPTIONS: -Dfile.encoding=UTF-8 -Xms384m -Xmx2g
    [mxmlc] The project 'explorer' has been successfully compiled and optimized.
    [mxmlc] 113.9986533 seconds
    [mxmlc] MXMLJSC
    [mxmlc] -module-output=/
    [mxmlc] -load-externs=<http://apacheroyaleci2.westus2.cloudapp.azure.com:8080/job/TourDeFlexMigration/650/artifact/examples/mxroyale/tourdeflexmodules/bin/js-debug/link_report-js.xml>
    [mxmlc] -js-compiler-option=--variable_map_input_file gcc_variablemap.txt
    [mxmlc] -js-compiler-option+=--property_map_input_file gcc_propertymap.txt
    [mxmlc] -js-compiler-option+=--externs <http://apacheroyaleci2.westus2.cloudapp.azure.com:8080/job/TourDeFlexMigration/650/artifact/examples/mxroyale/tourdeflexmodules/bin/js-debug/externs_report.js>
    [mxmlc] +playerglobal.version=11.7
    [mxmlc] +env.AIR_HOME=C:\adobe\air\4.0\AdobeAIRSDK
    [mxmlc] +env.PLAYERGLOBAL_HOME=C:\adobe\flash
    [mxmlc] -compiler.debug=false
    [mxmlc] +royalelib=C:\jenkins\workspace\royale-asjs/frameworks/
    [mxmlc] -load-config=C:\jenkins\workspace\royale-asjs/frameworks/flex-config.xml
    [mxmlc] -output=<http://apacheroyaleci2.westus2.cloudapp.azure.com:8080/job/TourDeFlexMigration/ws/examples/mxroyale/tourdeflexmodules/bin-debug/Welcome.swf>
    [mxmlc] --
    [mxmlc] <http://apacheroyaleci2.westus2.cloudapp.azure.com:8080/job/TourDeFlexMigration/ws/examples/mxroyale/tourdeflexmodules/src//Welcome.mxml>
    [mxmlc] Loading configuration: C:\jenkins\workspace\royale-asjs\frameworks\flex-config.xml
    [mxmlc] 
    [mxmlc] 43844 bytes written to C:\jenkins\workspace\TourDeFlexMigration\examples\mxroyale\tourdeflexmodules\bin-debug\Welcome.swf in 4.052 seconds
    [mxmlc] 13.2629467 seconds
    [mxmlc] Internal error: java.lang.IllegalArgumentException: Multiple entries with same value: clearCellList=UP and UP=UP com.google.common.collect.ImmutableMap.conflictException(ImmutableMap.java:215)com.google.common.collect.ImmutableMap.checkNoConflict(ImmutableMap.java:209)com.google.common.collect.RegularImmutableBiMap.checkNoConflictInValueBucket(RegularImmutableBiMap.java:131)com.google.common.collect.RegularImmutableBiMap.fromEntryArray(RegularImmutableBiMap.java:89)com.google.common.collect.RegularImmutableBiMap.fromEntries(RegularImmutableBiMap.java:58)com.google.common.collect.ImmutableBiMap.copyOf(ImmutableBiMap.java:368)com.google.common.collect.ImmutableBiMap.copyOf(ImmutableBiMap.java:340)com.google.javascript.jscomp.VariableMap.<init>(VariableMap.java:49)com.google.javascript.jscomp.VariableMap.fromMap(VariableMap.java:205)org.apache.royale.compiler.utils.JSClosureCompilerWrapper.compile(JSClosureCompilerWrapper.java:187)org.apache.royale.compiler.internal.codegen.mxml.royale.MXMLRoyalePublisher.publish(MXMLRoyalePublisher.java:574)org.apache.royale.compiler.clients.MXMLJSCRoyale.compile(MXMLJSCRoyale.java:446)org.apache.royale.compiler.clients.MXMLJSCRoyale._mainNoExit(MXMLJSCRoyale.java:267)org.apache.royale.compiler.clients.MXMLJSCRoyale.mainNoExit(MXMLJSCRoyale.java:224)org.apache.royale.compiler.clients.MXMLJSC._mainNoExit(MXMLJSC.java:371)org.apache.royale.compiler.clients.MXMLJSC.mainNoExit(MXMLJSC.java:306)org.apache.royale.compiler.clients.MXMLJSC.staticMainNoExit(MXMLJSC.java:264)org.apache.royale.compiler.clients.MXMLJSC.main(MXMLJSC.java:246)
    [mxmlc] 
    [mxmlc] 
    [mxmlc] Picked up JAVA_TOOL_OPTIONS: -Dfile.encoding=UTF-8 -Xms384m -Xmx2g

BUILD FAILED
<http://apacheroyaleci2.westus2.cloudapp.azure.com:8080/job/TourDeFlexMigration/ws/examples/mxroyale/tourdeflexmodules/build.xml>:166: The following error occurred while executing this line:
<http://apacheroyaleci2.westus2.cloudapp.azure.com:8080/job/TourDeFlexMigration/ws/examples/mxroyale/tourdeflexmodules/build.xml>:96: mxmlc task failed.

Total time: 2 minutes 10 seconds
Picked up JAVA_TOOL_OPTIONS: -Dfile.encoding=UTF-8 -Xms384m -Xmx2g
Build step 'Invoke Ant' marked build as failure
Skipped archiving because build is not successful

Build failed in Jenkins: TourDeFlexMigration #649

Posted by ap...@gmail.com.
See <http://apacheroyaleci2.westus2.cloudapp.azure.com:8080/job/TourDeFlexMigration/649/display/redirect?page=changes>

Changes:

[aharui] rename IItemRendererParent to IItemRendererOwnerView

[aharui] start to move selection/hover to a bead

[aharui] add bead to SWC

[aharui] rename IItemRendererParent to IItemRendererOwnerView because that's what

[aharui] rough pieces of the refactor.  Still need to add 'has' checks

[aharui] more refactoring, some has

[aharui] working towards a clean compile

[aharui] working towards a clean compile

[aharui] clean compile of Core, Basic, Charts, MDL, MXRoyale, SparkRoyale

[aharui] clean compile

[aharui] drop itemRendererOwner as a requirement for IItemRenderer and get

[aharui] get Jewel to use new 'has' pattern.  The non-selectable renderers no

[aharui] Jewel and Charts seem to be working

[aharui] restore properties in ADGIR

[aharui] menubar is working in MXRoyale

[aharui] MX ADG

[aharui] MDLExample

[aharui] Button and Label as dropin item renderers

[aharui] more fixes for has

[aharui] don't need this

[aharui] refactor IListPresentationModel to resolve some issues found in the

[aharui] we don't always get a collectionchange so set adg after list creation

[aharui] fix issues in tree node closing.  Should fix #673

[aharui] distinguish between clicking on open/close icon or label of Tree

[aharui] mxtests pass

[aharui] clean compile ASDoc

[aharui] ASDoc runs again

[aharui] refactor to propagate events so we don't have to send an event from the

[aharui] get examples to compile


------------------------------------------
Started by upstream project "royale-asjs" build number 749
originally caused by:
 Started by upstream project "royale-asjs_jsonly" build number 850
 originally caused by:
  Started by an SCM change
  Started by an SCM change
Running as SYSTEM
[EnvInject] - Loading node environment variables.
Building remotely on agent1 in workspace <http://apacheroyaleci2.westus2.cloudapp.azure.com:8080/job/TourDeFlexMigration/ws/>
No credentials specified
 > C:\Program Files\Git\cmd\git.exe rev-parse --is-inside-work-tree # timeout=10
Fetching changes from the remote Git repository
 > C:\Program Files\Git\cmd\git.exe config remote.origin.url https://github.com/apache/royale-asjs # timeout=10
Fetching upstream changes from https://github.com/apache/royale-asjs
 > C:\Program Files\Git\cmd\git.exe --version # timeout=10
 > C:\Program Files\Git\cmd\git.exe fetch --tags --force --progress -- https://github.com/apache/royale-asjs +refs/heads/*:refs/remotes/origin/*
 > C:\Program Files\Git\cmd\git.exe rev-parse "refs/remotes/origin/develop^{commit}" # timeout=10
 > C:\Program Files\Git\cmd\git.exe rev-parse "refs/remotes/origin/origin/develop^{commit}" # timeout=10
Checking out Revision b632cd95d755db31639eaf7940448f7e6a769f04 (refs/remotes/origin/develop)
 > C:\Program Files\Git\cmd\git.exe config core.sparsecheckout # timeout=10
 > C:\Program Files\Git\cmd\git.exe checkout -f b632cd95d755db31639eaf7940448f7e6a769f04
Commit message: "Merge branch 'develop' of https://github.com/apache/royale-asjs into develop"
 > C:\Program Files\Git\cmd\git.exe rev-list --no-walk 21ced853b17cf3f11d47460b27483cf1c1f40f5a # timeout=10
[tourdeflexmodules] $ cmd.exe /C "C:\apache\apache-ant-1.9.9\bin\ant.bat -file build.xml -Denv.FLASHPLAYER_DEBUGGER=C:\adobe\flash\11.7\flashplayerdebugger.exe -Denv.PLAYERGLOBAL_HOME=C:\adobe\flash -Denv.AIR_HOME=C:\adobe\air\4.0\AdobeAIRSDK -DROYALE_HOME=C:\jenkins\workspace\royale-asjs -Dbuild.noprompt=true -Dplayerglobal.version=11.7 clean compile && exit %%ERRORLEVEL%%"
Buildfile: <http://apacheroyaleci2.westus2.cloudapp.azure.com:8080/job/TourDeFlexMigration/ws/examples/mxroyale/tourdeflexmodules/build.xml>

clean:
   [delete] Deleting directory <http://apacheroyaleci2.westus2.cloudapp.azure.com:8080/job/TourDeFlexMigration/ws/examples/mxroyale/tourdeflexmodules/bin>

compile-shell:
    [mkdir] Created dir: <http://apacheroyaleci2.westus2.cloudapp.azure.com:8080/job/TourDeFlexMigration/649/artifact/examples/mxroyale/tourdeflexmodules/bin/js-debug>
    [mxmlc] MXMLJSC
    [mxmlc] -module-output=/
    [mxmlc] -js-compiler-option=--variable_map_output_file gcc_variablemap.txt
    [mxmlc] -js-compiler-option+=--property_map_output_file gcc_propertymap.txt
    [mxmlc] -externs-report=<http://apacheroyaleci2.westus2.cloudapp.azure.com:8080/job/TourDeFlexMigration/649/artifact/examples/mxroyale/tourdeflexmodules/bin/js-debug/externs_report.js>
    [mxmlc] -link-report=<http://apacheroyaleci2.westus2.cloudapp.azure.com:8080/job/TourDeFlexMigration/649/artifact/examples/mxroyale/tourdeflexmodules/bin/js-debug/link_report.xml>
    [mxmlc] +playerglobal.version=11.7
    [mxmlc] +env.AIR_HOME=C:\adobe\air\4.0\AdobeAIRSDK
    [mxmlc] +env.PLAYERGLOBAL_HOME=C:\adobe\flash
    [mxmlc] -compiler.debug=false
    [mxmlc] +royalelib=C:\jenkins\workspace\royale-asjs/frameworks/
    [mxmlc] -load-config=C:\jenkins\workspace\royale-asjs/frameworks/flex-config.xml
    [mxmlc] -output=<http://apacheroyaleci2.westus2.cloudapp.azure.com:8080/job/TourDeFlexMigration/ws/examples/mxroyale/tourdeflexmodules/bin-debug/explorer.swf>
    [mxmlc] --
    [mxmlc] <http://apacheroyaleci2.westus2.cloudapp.azure.com:8080/job/TourDeFlexMigration/ws/examples/mxroyale/tourdeflexmodules/src//explorer.mxml>
    [mxmlc] Loading configuration: C:\jenkins\workspace\royale-asjs\frameworks\flex-config.xml
    [mxmlc] 
    [mxmlc] 330153 bytes written to C:\jenkins\workspace\TourDeFlexMigration\examples\mxroyale\tourdeflexmodules\bin-debug\explorer.swf in 9.871 seconds
    [mxmlc] Feb 20, 2020 3:09:50 AM com.google.javascript.jscomp.LoggerErrorManager println
    [mxmlc] WARNING: c:/jenkins/workspace/TourDeFlexMigration/examples/mxroyale/tourdeflexmodules/bin/js-debug/SourceTab.js:124: WARNING - Invalid flags to RegExp constructor: STRING gs 124 [length: 4] [source_file: c:/jenkins/workspace/TourDeFlexMigration/examples/mxroyale/tourdeflexmodules/bin/js-debug/SourceTab.js] : string
    [mxmlc]   var /** @type {RegExp} */ r = new RegExp("\r\n", "gs");
    [mxmlc]                                                    ^^^^
    [mxmlc] 
    [mxmlc] Feb 20, 2020 3:09:50 AM com.google.javascript.jscomp.LoggerErrorManager println
    [mxmlc] WARNING: c:/jenkins/workspace/TourDeFlexMigration/examples/mxroyale/tourdeflexmodules/bin/js-debug/explorer.js:398: WARNING - Parse error. extra visibility tag
    [mxmlc]   * @private
    [mxmlc]     ^
    [mxmlc] 
    [mxmlc] Feb 20, 2020 3:09:50 AM com.google.javascript.jscomp.LoggerErrorManager println
    [mxmlc] WARNING: c:/jenkins/workspace/TourDeFlexMigration/examples/mxroyale/tourdeflexmodules/bin/js-debug/mx/containers/beads/DividedBoxLayout.js:60: WARNING - unreachable code
    [mxmlc]   this.mx_containers_beads_DividedBoxLayout_postLayoutAdjustment();
    [mxmlc]   ^^^^^^^^^^^^^^^^^^^^^^^^^^^^^^^^^^^^^^^^^^^^^^^^^^^^^^^^^^^^^^^^^
    [mxmlc] 
    [mxmlc] Feb 20, 2020 3:09:50 AM com.google.javascript.jscomp.LoggerErrorManager println
    [mxmlc] WARNING: c:/jenkins/workspace/TourDeFlexMigration/examples/mxroyale/tourdeflexmodules/bin/js-debug/mx/core/UIComponent.js:3204: WARNING - Suspicious code. This code lacks side-effects. Is there a bug?
    [mxmlc]   } else if ((this.mx_core_UIComponent__toolTip == null || this.mx_core_UIComponent__toolTip == "") && this.mx_core_UIComponent__toolTipBead != null) {
    [mxmlc]          ^^^^^^^^^^^^^^^^^^^^^^^^^^^^^^^^^^^^^^^^^^^^^^^^^^^^^^^^^^^^^^^^^^^^^^^^^^^^^^^^^^^^^^^^^^^^^^^^^^^^^^^^^^^^^^^^^^^^^^^^^^^^^^^^^^^^^^^^^^^^^^^
    [mxmlc] 
    [mxmlc] Feb 20, 2020 3:09:50 AM com.google.javascript.jscomp.LoggerErrorManager println
    [mxmlc] WARNING: c:/jenkins/workspace/TourDeFlexMigration/examples/mxroyale/tourdeflexmodules/bin/js-debug/mx/rpc/http/AbstractOperation.js:413: WARNING - unreachable code
    [mxmlc]         if (this.makeObjectsBindable && false) {
    [mxmlc]                                                ^^
    [mxmlc] 
    [mxmlc] Feb 20, 2020 3:09:50 AM com.google.javascript.jscomp.LoggerErrorManager printSummary
    [mxmlc] WARNING: 0 error(s), 5 warning(s), 98.4% typed
    [mxmlc] The project 'explorer' has been successfully compiled and optimized.
    [mxmlc] 106.3080159 seconds
    [mxmlc] Picked up JAVA_TOOL_OPTIONS: -Dfile.encoding=UTF-8 -Xms384m -Xmx2g
    [mxmlc] MXMLJSC
    [mxmlc] -module-output=/
    [mxmlc] -load-externs=<http://apacheroyaleci2.westus2.cloudapp.azure.com:8080/job/TourDeFlexMigration/649/artifact/examples/mxroyale/tourdeflexmodules/bin/js-debug/link_report-js.xml>
    [mxmlc] -js-compiler-option=--variable_map_input_file gcc_variablemap.txt
    [mxmlc] -js-compiler-option+=--property_map_input_file gcc_propertymap.txt
    [mxmlc] -js-compiler-option+=--externs <http://apacheroyaleci2.westus2.cloudapp.azure.com:8080/job/TourDeFlexMigration/649/artifact/examples/mxroyale/tourdeflexmodules/bin/js-debug/externs_report.js>
    [mxmlc] +playerglobal.version=11.7
    [mxmlc] +env.AIR_HOME=C:\adobe\air\4.0\AdobeAIRSDK
    [mxmlc] +env.PLAYERGLOBAL_HOME=C:\adobe\flash
    [mxmlc] -compiler.debug=false
    [mxmlc] +royalelib=C:\jenkins\workspace\royale-asjs/frameworks/
    [mxmlc] -load-config=C:\jenkins\workspace\royale-asjs/frameworks/flex-config.xml
    [mxmlc] -output=<http://apacheroyaleci2.westus2.cloudapp.azure.com:8080/job/TourDeFlexMigration/ws/examples/mxroyale/tourdeflexmodules/bin-debug/Welcome.swf>
    [mxmlc] --
    [mxmlc] <http://apacheroyaleci2.westus2.cloudapp.azure.com:8080/job/TourDeFlexMigration/ws/examples/mxroyale/tourdeflexmodules/src//Welcome.mxml>
    [mxmlc] Loading configuration: C:\jenkins\workspace\royale-asjs\frameworks\flex-config.xml
    [mxmlc] 
    [mxmlc] 43878 bytes written to C:\jenkins\workspace\TourDeFlexMigration\examples\mxroyale\tourdeflexmodules\bin-debug\Welcome.swf in 5.261 seconds
    [mxmlc] 15.0367248 seconds
    [mxmlc] Internal error: java.lang.IllegalArgumentException: Multiple entries with same value: clampToRange=UP and UP=UP com.google.common.collect.ImmutableMap.conflictException(ImmutableMap.java:215)com.google.common.collect.ImmutableMap.checkNoConflict(ImmutableMap.java:209)com.google.common.collect.RegularImmutableBiMap.checkNoConflictInValueBucket(RegularImmutableBiMap.java:131)com.google.common.collect.RegularImmutableBiMap.fromEntryArray(RegularImmutableBiMap.java:89)com.google.common.collect.RegularImmutableBiMap.fromEntries(RegularImmutableBiMap.java:58)com.google.common.collect.ImmutableBiMap.copyOf(ImmutableBiMap.java:368)com.google.common.collect.ImmutableBiMap.copyOf(ImmutableBiMap.java:340)com.google.javascript.jscomp.VariableMap.<init>(VariableMap.java:49)com.google.javascript.jscomp.VariableMap.fromMap(VariableMap.java:205)org.apache.royale.compiler.utils.JSClosureCompilerWrapper.compile(JSClosureCompilerWrapper.java:187)org.apache.royale.compiler.internal.codegen.mxml.royale.MXMLRoyalePublisher.publish(MXMLRoyalePublisher.java:574)org.apache.royale.compiler.clients.MXMLJSCRoyale.compile(MXMLJSCRoyale.java:446)org.apache.royale.compiler.clients.MXMLJSCRoyale._mainNoExit(MXMLJSCRoyale.java:267)org.apache.royale.compiler.clients.MXMLJSCRoyale.mainNoExit(MXMLJSCRoyale.java:224)org.apache.royale.compiler.clients.MXMLJSC._mainNoExit(MXMLJSC.java:371)org.apache.royale.compiler.clients.MXMLJSC.mainNoExit(MXMLJSC.java:306)org.apache.royale.compiler.clients.MXMLJSC.staticMainNoExit(MXMLJSC.java:264)org.apache.royale.compiler.clients.MXMLJSC.main(MXMLJSC.java:246)
    [mxmlc] 
    [mxmlc] 
    [mxmlc] Picked up JAVA_TOOL_OPTIONS: -Dfile.encoding=UTF-8 -Xms384m -Xmx2g

BUILD FAILED
<http://apacheroyaleci2.westus2.cloudapp.azure.com:8080/job/TourDeFlexMigration/ws/examples/mxroyale/tourdeflexmodules/build.xml>:166: The following error occurred while executing this line:
<http://apacheroyaleci2.westus2.cloudapp.azure.com:8080/job/TourDeFlexMigration/ws/examples/mxroyale/tourdeflexmodules/build.xml>:96: mxmlc task failed.

Total time: 2 minutes 5 seconds
Picked up JAVA_TOOL_OPTIONS: -Dfile.encoding=UTF-8 -Xms384m -Xmx2g
Build step 'Invoke Ant' marked build as failure
Skipped archiving because build is not successful

Build failed in Jenkins: TourDeFlexMigration #648

Posted by ap...@gmail.com.
See <http://apacheroyaleci2.westus2.cloudapp.azure.com:8080/job/TourDeFlexMigration/648/display/redirect?page=changes>

Changes:

[carlosrovira] jewel-themes: fix an issue that make all themes no compile

[carlosrovira] tour-de-jewel: make grids more dark grey

[carlosrovira] jewel-themes: upgrade all themes with latest changes


------------------------------------------
Started by upstream project "royale-asjs" build number 748
originally caused by:
 Started by upstream project "royale-asjs_jsonly" build number 849
 originally caused by:
  Started by an SCM change
Running as SYSTEM
[EnvInject] - Loading node environment variables.
Building remotely on agent1 in workspace <http://apacheroyaleci2.westus2.cloudapp.azure.com:8080/job/TourDeFlexMigration/ws/>
No credentials specified
 > C:\Program Files\Git\cmd\git.exe rev-parse --is-inside-work-tree # timeout=10
Fetching changes from the remote Git repository
 > C:\Program Files\Git\cmd\git.exe config remote.origin.url https://github.com/apache/royale-asjs # timeout=10
Fetching upstream changes from https://github.com/apache/royale-asjs
 > C:\Program Files\Git\cmd\git.exe --version # timeout=10
 > C:\Program Files\Git\cmd\git.exe fetch --tags --force --progress -- https://github.com/apache/royale-asjs +refs/heads/*:refs/remotes/origin/*
 > C:\Program Files\Git\cmd\git.exe rev-parse "refs/remotes/origin/develop^{commit}" # timeout=10
 > C:\Program Files\Git\cmd\git.exe rev-parse "refs/remotes/origin/origin/develop^{commit}" # timeout=10
Checking out Revision 21ced853b17cf3f11d47460b27483cf1c1f40f5a (refs/remotes/origin/develop)
 > C:\Program Files\Git\cmd\git.exe config core.sparsecheckout # timeout=10
 > C:\Program Files\Git\cmd\git.exe checkout -f 21ced853b17cf3f11d47460b27483cf1c1f40f5a
Commit message: "jewel-themes: upgrade all themes with latest changes"
 > C:\Program Files\Git\cmd\git.exe rev-list --no-walk 238dcd1d75115dc75aedd02273d0a84d97062d73 # timeout=10
[tourdeflexmodules] $ cmd.exe /C "C:\apache\apache-ant-1.9.9\bin\ant.bat -file build.xml -Denv.FLASHPLAYER_DEBUGGER=C:\adobe\flash\11.7\flashplayerdebugger.exe -Denv.PLAYERGLOBAL_HOME=C:\adobe\flash -Denv.AIR_HOME=C:\adobe\air\4.0\AdobeAIRSDK -DROYALE_HOME=C:\jenkins\workspace\royale-asjs -Dbuild.noprompt=true -Dplayerglobal.version=11.7 clean compile && exit %%ERRORLEVEL%%"
Buildfile: <http://apacheroyaleci2.westus2.cloudapp.azure.com:8080/job/TourDeFlexMigration/ws/examples/mxroyale/tourdeflexmodules/build.xml>

clean:
   [delete] Deleting directory <http://apacheroyaleci2.westus2.cloudapp.azure.com:8080/job/TourDeFlexMigration/ws/examples/mxroyale/tourdeflexmodules/bin>

compile-shell:
    [mkdir] Created dir: <http://apacheroyaleci2.westus2.cloudapp.azure.com:8080/job/TourDeFlexMigration/648/artifact/examples/mxroyale/tourdeflexmodules/bin/js-debug>
    [mxmlc] MXMLJSC
    [mxmlc] -module-output=/
    [mxmlc] -js-compiler-option=--variable_map_output_file gcc_variablemap.txt
    [mxmlc] -js-compiler-option+=--property_map_output_file gcc_propertymap.txt
    [mxmlc] -externs-report=<http://apacheroyaleci2.westus2.cloudapp.azure.com:8080/job/TourDeFlexMigration/648/artifact/examples/mxroyale/tourdeflexmodules/bin/js-debug/externs_report.js>
    [mxmlc] -link-report=<http://apacheroyaleci2.westus2.cloudapp.azure.com:8080/job/TourDeFlexMigration/648/artifact/examples/mxroyale/tourdeflexmodules/bin/js-debug/link_report.xml>
    [mxmlc] +playerglobal.version=11.7
    [mxmlc] +env.AIR_HOME=C:\adobe\air\4.0\AdobeAIRSDK
    [mxmlc] +env.PLAYERGLOBAL_HOME=C:\adobe\flash
    [mxmlc] -compiler.debug=false
    [mxmlc] +royalelib=C:\jenkins\workspace\royale-asjs/frameworks/
    [mxmlc] -load-config=C:\jenkins\workspace\royale-asjs/frameworks/flex-config.xml
    [mxmlc] -output=<http://apacheroyaleci2.westus2.cloudapp.azure.com:8080/job/TourDeFlexMigration/ws/examples/mxroyale/tourdeflexmodules/bin-debug/explorer.swf>
    [mxmlc] --
    [mxmlc] <http://apacheroyaleci2.westus2.cloudapp.azure.com:8080/job/TourDeFlexMigration/ws/examples/mxroyale/tourdeflexmodules/src//explorer.mxml>
    [mxmlc] Loading configuration: C:\jenkins\workspace\royale-asjs\frameworks\flex-config.xml
    [mxmlc] 
    [mxmlc] 330142 bytes written to C:\jenkins\workspace\TourDeFlexMigration\examples\mxroyale\tourdeflexmodules\bin-debug\explorer.swf in 11.828 seconds
    [mxmlc] Feb 20, 2020 1:24:16 AM com.google.javascript.jscomp.LoggerErrorManager println
    [mxmlc] WARNING: c:/jenkins/workspace/TourDeFlexMigration/examples/mxroyale/tourdeflexmodules/bin/js-debug/SourceTab.js:124: WARNING - Invalid flags to RegExp constructor: STRING gs 124 [length: 4] [source_file: c:/jenkins/workspace/TourDeFlexMigration/examples/mxroyale/tourdeflexmodules/bin/js-debug/SourceTab.js] : string
    [mxmlc]   var /** @type {RegExp} */ r = new RegExp("\r\n", "gs");
    [mxmlc]                                                    ^^^^
    [mxmlc] 
    [mxmlc] Feb 20, 2020 1:24:16 AM com.google.javascript.jscomp.LoggerErrorManager println
    [mxmlc] WARNING: c:/jenkins/workspace/TourDeFlexMigration/examples/mxroyale/tourdeflexmodules/bin/js-debug/explorer.js:398: WARNING - Parse error. extra visibility tag
    [mxmlc]   * @private
    [mxmlc]     ^
    [mxmlc] 
    [mxmlc] Feb 20, 2020 1:24:16 AM com.google.javascript.jscomp.LoggerErrorManager println
    [mxmlc] WARNING: c:/jenkins/workspace/TourDeFlexMigration/examples/mxroyale/tourdeflexmodules/bin/js-debug/mx/containers/beads/DividedBoxLayout.js:60: WARNING - unreachable code
    [mxmlc]   this.mx_containers_beads_DividedBoxLayout_postLayoutAdjustment();
    [mxmlc]   ^^^^^^^^^^^^^^^^^^^^^^^^^^^^^^^^^^^^^^^^^^^^^^^^^^^^^^^^^^^^^^^^^
    [mxmlc] 
    [mxmlc] Feb 20, 2020 1:24:16 AM com.google.javascript.jscomp.LoggerErrorManager println
    [mxmlc] WARNING: c:/jenkins/workspace/TourDeFlexMigration/examples/mxroyale/tourdeflexmodules/bin/js-debug/mx/core/UIComponent.js:3204: WARNING - Suspicious code. This code lacks side-effects. Is there a bug?
    [mxmlc]   } else if ((this.mx_core_UIComponent__toolTip == null || this.mx_core_UIComponent__toolTip == "") && this.mx_core_UIComponent__toolTipBead != null) {
    [mxmlc]          ^^^^^^^^^^^^^^^^^^^^^^^^^^^^^^^^^^^^^^^^^^^^^^^^^^^^^^^^^^^^^^^^^^^^^^^^^^^^^^^^^^^^^^^^^^^^^^^^^^^^^^^^^^^^^^^^^^^^^^^^^^^^^^^^^^^^^^^^^^^^^^^
    [mxmlc] 
    [mxmlc] Feb 20, 2020 1:24:16 AM com.google.javascript.jscomp.LoggerErrorManager println
    [mxmlc] WARNING: c:/jenkins/workspace/TourDeFlexMigration/examples/mxroyale/tourdeflexmodules/bin/js-debug/mx/rpc/http/AbstractOperation.js:413: WARNING - unreachable code
    [mxmlc]         if (this.makeObjectsBindable && false) {
    [mxmlc]                                                ^^
    [mxmlc] 
    [mxmlc] Feb 20, 2020 1:24:16 AM com.google.javascript.jscomp.LoggerErrorManager printSummary
    [mxmlc] WARNING: 0 error(s), 5 warning(s), 98.4% typed
    [mxmlc] Picked up JAVA_TOOL_OPTIONS: -Dfile.encoding=UTF-8 -Xms384m -Xmx2g
    [mxmlc] The project 'explorer' has been successfully compiled and optimized.
    [mxmlc] 101.7295106 seconds
    [mxmlc] MXMLJSC
    [mxmlc] -module-output=/
    [mxmlc] -load-externs=<http://apacheroyaleci2.westus2.cloudapp.azure.com:8080/job/TourDeFlexMigration/648/artifact/examples/mxroyale/tourdeflexmodules/bin/js-debug/link_report-js.xml>
    [mxmlc] -js-compiler-option=--variable_map_input_file gcc_variablemap.txt
    [mxmlc] -js-compiler-option+=--property_map_input_file gcc_propertymap.txt
    [mxmlc] -js-compiler-option+=--externs <http://apacheroyaleci2.westus2.cloudapp.azure.com:8080/job/TourDeFlexMigration/648/artifact/examples/mxroyale/tourdeflexmodules/bin/js-debug/externs_report.js>
    [mxmlc] +playerglobal.version=11.7
    [mxmlc] +env.AIR_HOME=C:\adobe\air\4.0\AdobeAIRSDK
    [mxmlc] +env.PLAYERGLOBAL_HOME=C:\adobe\flash
    [mxmlc] -compiler.debug=false
    [mxmlc] +royalelib=C:\jenkins\workspace\royale-asjs/frameworks/
    [mxmlc] -load-config=C:\jenkins\workspace\royale-asjs/frameworks/flex-config.xml
    [mxmlc] -output=<http://apacheroyaleci2.westus2.cloudapp.azure.com:8080/job/TourDeFlexMigration/ws/examples/mxroyale/tourdeflexmodules/bin-debug/Welcome.swf>
    [mxmlc] --
    [mxmlc] <http://apacheroyaleci2.westus2.cloudapp.azure.com:8080/job/TourDeFlexMigration/ws/examples/mxroyale/tourdeflexmodules/src//Welcome.mxml>
    [mxmlc] Loading configuration: C:\jenkins\workspace\royale-asjs\frameworks\flex-config.xml
    [mxmlc] 
    [mxmlc] 43878 bytes written to C:\jenkins\workspace\TourDeFlexMigration\examples\mxroyale\tourdeflexmodules\bin-debug\Welcome.swf in 4.912 seconds
    [mxmlc] Internal error: java.lang.IllegalArgumentException: Multiple entries with same value: clampToRange=UP and UP=UP com.google.common.collect.ImmutableMap.conflictException(ImmutableMap.java:215)com.google.common.collect.ImmutableMap.checkNoConflict(ImmutableMap.java:209)com.google.common.collect.RegularImmutableBiMap.checkNoConflictInValueBucket(RegularImmutableBiMap.java:131)com.google.common.collect.RegularImmutableBiMap.fromEntryArray(RegularImmutableBiMap.java:89)com.google.common.collect.RegularImmutableBiMap.fromEntries(RegularImmutableBiMap.java:58)com.google.common.collect.ImmutableBiMap.copyOf(ImmutableBiMap.java:368)com.google.common.collect.ImmutableBiMap.copyOf(ImmutableBiMap.java:340)com.google.javascript.jscomp.VariableMap.<init>(VariableMap.java:49)com.google.javascript.jscomp.VariableMap.fromMap(VariableMap.java:205)org.apache.royale.compiler.utils.JSClosureCompilerWrapper.compile(JSClosureCompilerWrapper.java:187)org.apache.royale.compiler.internal.codegen.mxml.royale.MXMLRoyalePublisher.publish(MXMLRoyalePublisher.java:574)org.apache.royale.compiler.clients.MXMLJSCRoyale.compile(MXMLJSCRoyale.java:446)org.apache.royale.compiler.clients.MXMLJSCRoyale._mainNoExit(MXMLJSCRoyale.java:267)org.apache.royale.compiler.clients.MXMLJSCRoyale.mainNoExit(MXMLJSCRoyale.java:224)org.apache.royale.compiler.clients.MXMLJSC._mainNoExit(MXMLJSC.java:371)org.apache.royale.compiler.clients.MXMLJSC.mainNoExit(MXMLJSC.java:306)org.apache.royale.compiler.clients.MXMLJSC.staticMainNoExit(MXMLJSC.java:264)org.apache.royale.compiler.clients.MXMLJSC.main(MXMLJSC.java:246)
    [mxmlc] 
    [mxmlc] 
    [mxmlc] Picked up JAVA_TOOL_OPTIONS: -Dfile.encoding=UTF-8 -Xms384m -Xmx2g
    [mxmlc] 16.2329688 seconds

BUILD FAILED
<http://apacheroyaleci2.westus2.cloudapp.azure.com:8080/job/TourDeFlexMigration/ws/examples/mxroyale/tourdeflexmodules/build.xml>:166: The following error occurred while executing this line:
<http://apacheroyaleci2.westus2.cloudapp.azure.com:8080/job/TourDeFlexMigration/ws/examples/mxroyale/tourdeflexmodules/build.xml>:96: mxmlc task failed.

Total time: 2 minutes 0 seconds
Picked up JAVA_TOOL_OPTIONS: -Dfile.encoding=UTF-8 -Xms384m -Xmx2g
Build step 'Invoke Ant' marked build as failure
Skipped archiving because build is not successful