You are viewing a plain text version of this content. The canonical link for it is here.
Posted to issues@ozone.apache.org by "Attila Doroszlai (Jira)" <ji...@apache.org> on 2023/04/11 15:05:00 UTC
[jira] [Updated] (HDDS-8407) Intermittent failure in TestOzoneFileSystem#testTrash
[ https://issues.apache.org/jira/browse/HDDS-8407?page=com.atlassian.jira.plugin.system.issuetabpanels:all-tabpanel ]
Attila Doroszlai updated HDDS-8407:
-----------------------------------
Description:
{code}
Tests run: 172, Failures: 1, Errors: 0, Skipped: 0, Time elapsed: 236.619 s <<< FAILURE! - in org.apache.hadoop.fs.ozone.TestOzoneFileSystem
TestOzoneFileSystem.testTrash Time elapsed: 2.029 s <<< FAILURE!
java.lang.AssertionError: expected:<1> but was:<2>
...
at org.apache.hadoop.fs.ozone.TestOzoneFileSystem.testTrash(TestOzoneFileSystem.java:1681)
{code}
* https://github.com/adoroszlai/ozone-build-results/blob/master/2023/02/16/20193/it-filesystem/hadoop-ozone/integration-test/org.apache.hadoop.fs.ozone.TestOzoneFileSystem.txt
* https://github.com/adoroszlai/ozone-build-results/blob/master/2023/03/28/21157/it-filesystem/hadoop-ozone/integration-test/org.apache.hadoop.fs.ozone.TestOzoneFileSystem.txt
* https://github.com/adoroszlai/ozone-build-results/blob/master/2023/04/11/21461/it-filesystem/hadoop-ozone/integration-test/org.apache.hadoop.fs.ozone.TestOzoneFileSystem.txt
With more verbose assertion:
{code}
org.opentest4j.AssertionFailedError: [FileStatus{path=o3fs://bucket32615.volume87324/.Trash/runner/230411125619; isDirectory=true; modification_time=1681217779506; access_time=1681217779506; owner=runner; group=runner; permission=rwxrwxrwx; isSymlink=false; hasAcl=false; isEncrypted=false; isErasureCoded=false}, FileStatus{path=o3fs://bucket32615.volume87324/.Trash/runner/230411125621; isDirectory=true; modification_time=1681217781510; access_time=1681217781510; owner=runner; group=runner; permission=rwxrwxrwx; isSymlink=false; hasAcl=false; isEncrypted=false; isErasureCoded=false}] ==> expected: <1> but was: <2>
{code}
was:
{code}
Tests run: 172, Failures: 1, Errors: 0, Skipped: 0, Time elapsed: 236.619 s <<< FAILURE! - in org.apache.hadoop.fs.ozone.TestOzoneFileSystem
TestOzoneFileSystem.testTrash Time elapsed: 2.029 s <<< FAILURE!
java.lang.AssertionError: expected:<1> but was:<2>
...
at org.apache.hadoop.fs.ozone.TestOzoneFileSystem.testTrash(TestOzoneFileSystem.java:1681)
{code}
* https://github.com/adoroszlai/ozone-build-results/blob/master/2023/02/16/20193/it-filesystem/hadoop-ozone/integration-test/org.apache.hadoop.fs.ozone.TestOzoneFileSystem.txt
* https://github.com/adoroszlai/ozone-build-results/blob/master/2023/03/28/21157/it-filesystem/hadoop-ozone/integration-test/org.apache.hadoop.fs.ozone.TestOzoneFileSystem.txt
* https://github.com/adoroszlai/ozone-build-results/blob/master/2023/04/11/21461/it-filesystem/hadoop-ozone/integration-test/org.apache.hadoop.fs.ozone.TestOzoneFileSystem.txt
> Intermittent failure in TestOzoneFileSystem#testTrash
> -----------------------------------------------------
>
> Key: HDDS-8407
> URL: https://issues.apache.org/jira/browse/HDDS-8407
> Project: Apache Ozone
> Issue Type: Sub-task
> Components: test
> Reporter: Attila Doroszlai
> Priority: Major
>
> {code}
> Tests run: 172, Failures: 1, Errors: 0, Skipped: 0, Time elapsed: 236.619 s <<< FAILURE! - in org.apache.hadoop.fs.ozone.TestOzoneFileSystem
> TestOzoneFileSystem.testTrash Time elapsed: 2.029 s <<< FAILURE!
> java.lang.AssertionError: expected:<1> but was:<2>
> ...
> at org.apache.hadoop.fs.ozone.TestOzoneFileSystem.testTrash(TestOzoneFileSystem.java:1681)
> {code}
> * https://github.com/adoroszlai/ozone-build-results/blob/master/2023/02/16/20193/it-filesystem/hadoop-ozone/integration-test/org.apache.hadoop.fs.ozone.TestOzoneFileSystem.txt
> * https://github.com/adoroszlai/ozone-build-results/blob/master/2023/03/28/21157/it-filesystem/hadoop-ozone/integration-test/org.apache.hadoop.fs.ozone.TestOzoneFileSystem.txt
> * https://github.com/adoroszlai/ozone-build-results/blob/master/2023/04/11/21461/it-filesystem/hadoop-ozone/integration-test/org.apache.hadoop.fs.ozone.TestOzoneFileSystem.txt
> With more verbose assertion:
> {code}
> org.opentest4j.AssertionFailedError: [FileStatus{path=o3fs://bucket32615.volume87324/.Trash/runner/230411125619; isDirectory=true; modification_time=1681217779506; access_time=1681217779506; owner=runner; group=runner; permission=rwxrwxrwx; isSymlink=false; hasAcl=false; isEncrypted=false; isErasureCoded=false}, FileStatus{path=o3fs://bucket32615.volume87324/.Trash/runner/230411125621; isDirectory=true; modification_time=1681217781510; access_time=1681217781510; owner=runner; group=runner; permission=rwxrwxrwx; isSymlink=false; hasAcl=false; isEncrypted=false; isErasureCoded=false}] ==> expected: <1> but was: <2>
> {code}
--
This message was sent by Atlassian Jira
(v8.20.10#820010)
---------------------------------------------------------------------
To unsubscribe, e-mail: issues-unsubscribe@ozone.apache.org
For additional commands, e-mail: issues-help@ozone.apache.org