You are viewing a plain text version of this content. The canonical link for it is here.
Posted to dev@poi.apache.org by Apache Jenkins Server <je...@builds.apache.org> on 2014/08/01 02:26:58 UTC
Build failed in Jenkins: POI #385
See <https://builds.apache.org/job/POI/385/changes>
Changes:
[nick] Prep for 3.11 beta 1
[nick] Prep for 3.11 beta 1
[nick] Prep for 3.11 beta 1
------------------------------------------
[...truncated 1872 lines...]
[junit] Tests run: 4, Failures: 0, Errors: 0, Skipped: 0, Time elapsed: 0.421 sec
[junit] Running org.apache.poi.xslf.usermodel.TestXSLFShape
[junit] Tests run: 2, Failures: 0, Errors: 0, Skipped: 0, Time elapsed: 0.163 sec
[junit] Running org.apache.poi.xslf.usermodel.TestXSLFShapeContainer
[junit] Tests run: 1, Failures: 0, Errors: 0, Skipped: 0, Time elapsed: 0.042 sec
[junit] Running org.apache.poi.xslf.usermodel.TestXSLFSheet
[junit] Tests run: 1, Failures: 0, Errors: 0, Skipped: 0, Time elapsed: 0.133 sec
[junit] Running org.apache.poi.xslf.usermodel.TestXSLFSimpleShape
[junit] Tests run: 5, Failures: 0, Errors: 0, Skipped: 0, Time elapsed: 0.305 sec
[junit] Running org.apache.poi.xslf.usermodel.TestXSLFSlide
[junit] Tests run: 4, Failures: 0, Errors: 0, Skipped: 0, Time elapsed: 2.459 sec
[junit] Running org.apache.poi.xslf.usermodel.TestXSLFSlideShow
[junit] Tests run: 5, Failures: 0, Errors: 0, Skipped: 0, Time elapsed: 0.295 sec
[junit] Running org.apache.poi.xslf.usermodel.TestXSLFTable
[junit] Tests run: 2, Failures: 0, Errors: 0, Skipped: 0, Time elapsed: 0.135 sec
[junit] Running org.apache.poi.xslf.usermodel.TestXSLFTableStyles
[junit] Tests run: 2, Failures: 0, Errors: 0, Skipped: 0, Time elapsed: 0.036 sec
[junit] Running org.apache.poi.xslf.usermodel.TestXSLFTextBox
[junit] Tests run: 2, Failures: 0, Errors: 0, Skipped: 0, Time elapsed: 0.054 sec
[junit] Running org.apache.poi.xslf.usermodel.TestXSLFTextParagraph
[junit] Tests run: 5, Failures: 0, Errors: 0, Skipped: 0, Time elapsed: 0.164 sec
[junit] Running org.apache.poi.xslf.usermodel.TestXSLFTextRun
[junit] Tests run: 1, Failures: 0, Errors: 0, Skipped: 0, Time elapsed: 0.043 sec
[junit] Running org.apache.poi.xslf.usermodel.TestXSLFTextShape
[junit] Tests run: 3, Failures: 0, Errors: 0, Skipped: 0, Time elapsed: 0.168 sec
[junit] Running org.apache.poi.xslf.usermodel.TestXSLFTheme
[junit] Tests run: 1, Failures: 0, Errors: 0, Skipped: 0, Time elapsed: 0.513 sec
[junit] Running org.apache.poi.xssf.TestSheetProtection
[junit] Tests run: 17, Failures: 0, Errors: 0, Skipped: 0, Time elapsed: 0.125 sec
[junit] Running org.apache.poi.xssf.TestWorkbookProtection
[junit] Tests run: 5, Failures: 0, Errors: 0, Skipped: 0, Time elapsed: 0.06 sec
[junit] Running org.apache.poi.xssf.eventusermodel.TestReadOnlySharedStringsTable
[junit] Tests run: 1, Failures: 0, Errors: 0, Skipped: 0, Time elapsed: 0.006 sec
[junit] Running org.apache.poi.xssf.eventusermodel.TestXSSFReader
[junit] Tests run: 8, Failures: 0, Errors: 0, Skipped: 0, Time elapsed: 0.099 sec
[junit] Running org.apache.poi.xssf.extractor.TestXSSFEventBasedExcelExtractor
[junit] Tests run: 8, Failures: 0, Errors: 0, Skipped: 0, Time elapsed: 0.452 sec
[junit] Running org.apache.poi.xssf.extractor.TestXSSFEventBasedExcelExtractorUsingFactory
[junit] Tests run: 8, Failures: 0, Errors: 0, Skipped: 0, Time elapsed: 0.289 sec
[junit] Running org.apache.poi.xssf.extractor.TestXSSFExcelExtractor
[junit] Tests run: 7, Failures: 0, Errors: 0, Skipped: 0, Time elapsed: 0.666 sec
[junit] Running org.apache.poi.xssf.extractor.TestXSSFExcelExtractorUsingFactory
[junit] Tests run: 7, Failures: 0, Errors: 0, Skipped: 0, Time elapsed: 0.558 sec
[junit] Running org.apache.poi.xssf.extractor.TestXSSFExportToXML
[junit] Tests run: 13, Failures: 0, Errors: 0, Skipped: 0, Time elapsed: 0.447 sec
[junit] Running org.apache.poi.xssf.extractor.TestXSSFImportFromXML
[junit] Tests run: 3, Failures: 0, Errors: 0, Skipped: 0, Time elapsed: 0.331 sec
[junit] Running org.apache.poi.xssf.io.TestLoadSaveXSSF
[junit] Tests run: 3, Failures: 0, Errors: 0, Skipped: 0, Time elapsed: 0.068 sec
[junit] Running org.apache.poi.xssf.model.TestCalculationChain
[junit] Tests run: 1, Failures: 0, Errors: 0, Skipped: 0, Time elapsed: 0.731 sec
[junit] Running org.apache.poi.xssf.model.TestCommentsTable
[junit] Tests run: 7, Failures: 0, Errors: 0, Skipped: 0, Time elapsed: 0.246 sec
[junit] Running org.apache.poi.xssf.model.TestExternalLinksTable
[junit] Tests run: 4, Failures: 0, Errors: 0, Skipped: 0, Time elapsed: 0.065 sec
[junit] Running org.apache.poi.xssf.model.TestMapInfo
[junit] Tests run: 1, Failures: 0, Errors: 0, Skipped: 0, Time elapsed: 0.012 sec
[junit] Running org.apache.poi.xssf.model.TestSharedStringsTable
[junit] Tests run: 3, Failures: 0, Errors: 0, Skipped: 0, Time elapsed: 0.115 sec
[junit] Running org.apache.poi.xssf.model.TestStylesTable
[junit] Tests run: 6, Failures: 0, Errors: 0, Skipped: 0, Time elapsed: 0.116 sec
[junit] Running org.apache.poi.xssf.streaming.TestOutlining
[junit] Tests run: 2, Failures: 0, Errors: 0, Skipped: 0, Time elapsed: 0.018 sec
[junit] Running org.apache.poi.xssf.streaming.TestSXSSFCell
[junit] Tests run: 21, Failures: 0, Errors: 0, Skipped: 0, Time elapsed: 0.779 sec
[junit] Running org.apache.poi.xssf.streaming.TestSXSSFHyperlink
[junit] Tests run: 1, Failures: 0, Errors: 0, Skipped: 0, Time elapsed: 0.021 sec
[junit] Running org.apache.poi.xssf.streaming.TestSXSSFRow
[junit] Tests run: 10, Failures: 0, Errors: 0, Skipped: 0, Time elapsed: 0.369 sec
[junit] Running org.apache.poi.xssf.streaming.TestSXSSFSheet
[junit] Tests run: 32, Failures: 0, Errors: 0, Skipped: 0, Time elapsed: 0.311 sec
[junit] Running org.apache.poi.xssf.streaming.TestSXSSFWorkbook
[junit] Tests run: 19, Failures: 0, Errors: 0, Skipped: 0, Time elapsed: 1.313 sec
[junit] Running org.apache.poi.xssf.usermodel.TestFormulaEvaluatorOnXSSF
[junit] Tests run: 2, Failures: 0, Errors: 0, Skipped: 0, Time elapsed: 0.665 sec
[junit] Running org.apache.poi.xssf.usermodel.TestMissingWorkbookOnXSSF
[junit] Tests run: 3, Failures: 0, Errors: 0, Skipped: 0, Time elapsed: 0.037 sec
[junit] Running org.apache.poi.xssf.usermodel.TestMultiSheetFormulaEvaluatorOnXSSF
[junit] Tests run: 1, Failures: 0, Errors: 0, Skipped: 0, Time elapsed: 0.017 sec
[junit] Running org.apache.poi.xssf.usermodel.TestSheetHiding
[junit] Tests run: 5, Failures: 0, Errors: 0, Skipped: 0, Time elapsed: 0.086 sec
[junit] Running org.apache.poi.xssf.usermodel.TestXSSFBugs
[junit] Tests run: 68, Failures: 0, Errors: 0, Skipped: 2, Time elapsed: 3.841 sec
[junit] Running org.apache.poi.xssf.usermodel.TestXSSFCell
[junit] Tests run: 28, Failures: 0, Errors: 0, Skipped: 0, Time elapsed: 0.434 sec
[junit] Running org.apache.poi.xssf.usermodel.TestXSSFCellStyle
[junit] Tests run: 37, Failures: 0, Errors: 0, Skipped: 0, Time elapsed: 0.236 sec
[junit] Running org.apache.poi.xssf.usermodel.TestXSSFChart
[junit] Tests run: 3, Failures: 0, Errors: 0, Skipped: 0, Time elapsed: 0.151 sec
[junit] Running org.apache.poi.xssf.usermodel.TestXSSFChartSheet
[junit] Tests run: 3, Failures: 0, Errors: 0, Skipped: 0, Time elapsed: 0.057 sec
[junit] Running org.apache.poi.xssf.usermodel.TestXSSFColGrouping
[junit] Tests run: 6, Failures: 0, Errors: 0, Skipped: 0, Time elapsed: 0.094 sec
[junit] Running org.apache.poi.xssf.usermodel.TestXSSFColor
[junit] Tests run: 3, Failures: 0, Errors: 0, Skipped: 0, Time elapsed: 0.052 sec
[junit] Running org.apache.poi.xssf.usermodel.TestXSSFComment
[junit] Tests run: 11, Failures: 0, Errors: 0, Skipped: 0, Time elapsed: 0.131 sec
[junit] Running org.apache.poi.xssf.usermodel.TestXSSFConditionalFormatting
[junit] Tests run: 13, Failures: 0, Errors: 0, Skipped: 0, Time elapsed: 0.07 sec
[junit] Running org.apache.poi.xssf.usermodel.TestXSSFDataFormat
[junit] Tests run: 2, Failures: 0, Errors: 0, Skipped: 0, Time elapsed: 0.01 sec
[junit] Running org.apache.poi.xssf.usermodel.TestXSSFDataValidation
[junit] Tests run: 3, Failures: 0, Errors: 0, Skipped: 0, Time elapsed: 0.264 sec
[junit] Running org.apache.poi.xssf.usermodel.TestXSSFDialogSheet
[junit] Tests run: 14, Failures: 0, Errors: 0, Skipped: 0, Time elapsed: 0.022 sec
[junit] Running org.apache.poi.xssf.usermodel.TestXSSFDrawing
[junit] Tests run: 17, Failures: 0, Errors: 0, Skipped: 0, Time elapsed: 0.437 sec
[junit] Running org.apache.poi.xssf.usermodel.TestXSSFExternalFunctions
[junit] Tests run: 2, Failures: 0, Errors: 0, Skipped: 0, Time elapsed: 0.009 sec
[junit] Running org.apache.poi.xssf.usermodel.TestXSSFFont
[junit] Tests run: 19, Failures: 0, Errors: 0, Skipped: 0, Time elapsed: 0.054 sec
[junit] Running org.apache.poi.xssf.usermodel.TestXSSFFormulaEvaluation
[junit] Tests run: 15, Failures: 0, Errors: 0, Skipped: 0, Time elapsed: 0.354 sec
[junit] Running org.apache.poi.xssf.usermodel.TestXSSFFormulaParser
[junit] Tests run: 6, Failures: 0, Errors: 0, Skipped: 0, Time elapsed: 0.037 sec
[junit] Running org.apache.poi.xssf.usermodel.TestXSSFHeaderFooter
[junit] Tests run: 2, Failures: 0, Errors: 0, Skipped: 0, Time elapsed: 0.002 sec
[junit] Running org.apache.poi.xssf.usermodel.TestXSSFHyperlink
[junit] Tests run: 8, Failures: 0, Errors: 0, Skipped: 0, Time elapsed: 0.166 sec
[junit] Running org.apache.poi.xssf.usermodel.TestXSSFName
[junit] Tests run: 20, Failures: 0, Errors: 0, Skipped: 0, Time elapsed: 0.064 sec
[junit] Running org.apache.poi.xssf.usermodel.TestXSSFPicture
[junit] Tests run: 4, Failures: 0, Errors: 0, Skipped: 0, Time elapsed: 0.048 sec
[junit] Running org.apache.poi.xssf.usermodel.TestXSSFPictureData
[junit] Tests run: 3, Failures: 0, Errors: 0, Skipped: 0, Time elapsed: 0.084 sec
[junit] Running org.apache.poi.xssf.usermodel.TestXSSFPivotTable
[junit] Tests run: 10, Failures: 0, Errors: 0, Skipped: 0, Time elapsed: 0.097 sec
[junit] Running org.apache.poi.xssf.usermodel.TestXSSFPrintSetup
[junit] Tests run: 16, Failures: 0, Errors: 0, Skipped: 0, Time elapsed: 0.016 sec
[junit] Running org.apache.poi.xssf.usermodel.TestXSSFRichTextString
[junit] Tests run: 9, Failures: 0, Errors: 0, Skipped: 0, Time elapsed: 0.007 sec
[junit] Running org.apache.poi.xssf.usermodel.TestXSSFRow
[junit] Tests run: 10, Failures: 0, Errors: 0, Skipped: 0, Time elapsed: 2.733 sec
[junit] Running org.apache.poi.xssf.usermodel.TestXSSFSheet
[junit] Tests run: 62, Failures: 0, Errors: 0, Skipped: 0, Time elapsed: 19.529 sec
[junit] Running org.apache.poi.xssf.usermodel.TestXSSFSheetAutosizeColumn
[junit] Tests run: 7, Failures: 0, Errors: 0, Skipped: 0, Time elapsed: 0.056 sec
[junit] Running org.apache.poi.xssf.usermodel.TestXSSFSheetRowGrouping
[junit] Tests run: 6, Failures: 0, Errors: 0, Skipped: 0, Time elapsed: 0.183 sec
[junit] Running org.apache.poi.xssf.usermodel.TestXSSFSheetShiftRows
[junit] Tests run: 13, Failures: 0, Errors: 0, Skipped: 0, Time elapsed: 0.353 sec
[junit] Running org.apache.poi.xssf.usermodel.TestXSSFSheetUpdateArrayFormulas
[junit] Tests run: 16, Failures: 0, Errors: 0, Skipped: 0, Time elapsed: 0.047 sec
[junit] Running org.apache.poi.xssf.usermodel.TestXSSFTable
[junit] Tests run: 1, Failures: 0, Errors: 0, Skipped: 0, Time elapsed: 0.06 sec
[junit] Running org.apache.poi.xssf.usermodel.TestXSSFVMLDrawing
[junit] Tests run: 3, Failures: 0, Errors: 0, Skipped: 0, Time elapsed: 0.01 sec
[junit] Running org.apache.poi.xssf.usermodel.TestXSSFWorkbook
[junit] Tests run: 37, Failures: 0, Errors: 0, Skipped: 0, Time elapsed: 0.65 sec
[junit] Running org.apache.poi.xssf.usermodel.charts.TestXSSFCategoryAxis
[junit] Tests run: 1, Failures: 0, Errors: 0, Skipped: 0, Time elapsed: 0.05 sec
[junit] Running org.apache.poi.xssf.usermodel.charts.TestXSSFChartAxis
[junit] Tests run: 7, Failures: 0, Errors: 0, Skipped: 0, Time elapsed: 0.01 sec
[junit] Running org.apache.poi.xssf.usermodel.charts.TestXSSFChartLegend
[junit] Tests run: 3, Failures: 0, Errors: 0, Skipped: 0, Time elapsed: 0.013 sec
[junit] Running org.apache.poi.xssf.usermodel.charts.TestXSSFLineChartData
[junit] Tests run: 1, Failures: 0, Errors: 0, Skipped: 0, Time elapsed: 0.039 sec
[junit] Running org.apache.poi.xssf.usermodel.charts.TestXSSFManualLayout
[junit] Tests run: 2, Failures: 0, Errors: 0, Skipped: 0, Time elapsed: 0.027 sec
[junit] Running org.apache.poi.xssf.usermodel.charts.TestXSSFScatterChartData
[junit] Tests run: 1, Failures: 0, Errors: 0, Skipped: 0, Time elapsed: 0.019 sec
[junit] Running org.apache.poi.xssf.usermodel.charts.TestXSSFValueAxis
[junit] Tests run: 1, Failures: 0, Errors: 0, Skipped: 0, Time elapsed: 0.004 sec
[junit] Running org.apache.poi.xssf.usermodel.extensions.TestXSSFBorder
[junit] Tests run: 1, Failures: 0, Errors: 0, Skipped: 0, Time elapsed: 0.003 sec
[junit] Running org.apache.poi.xssf.usermodel.extensions.TestXSSFCellFill
[junit] Tests run: 5, Failures: 0, Errors: 0, Skipped: 0, Time elapsed: 0.013 sec
[junit] Running org.apache.poi.xssf.usermodel.extensions.TestXSSFSheetComments
[junit] Tests run: 1, Failures: 0, Errors: 0, Skipped: 0, Time elapsed: 0.001 sec
[junit] Running org.apache.poi.xssf.usermodel.helpers.TestColumnHelper
[junit] Tests run: 8, Failures: 0, Errors: 0, Skipped: 0, Time elapsed: 0.032 sec
[junit] Running org.apache.poi.xssf.usermodel.helpers.TestHeaderFooterHelper
[junit] Tests run: 2, Failures: 0, Errors: 0, Skipped: 0, Time elapsed: 0.001 sec
[junit] Running org.apache.poi.xssf.util.TestCTColComparator
[junit] Tests run: 2, Failures: 0, Errors: 0, Skipped: 0, Time elapsed: 0.002 sec
[junit] Running org.apache.poi.xssf.util.TestEvilUnclosedBRFixingInputStream
[junit] Tests run: 3, Failures: 0, Errors: 0, Skipped: 0, Time elapsed: 0.004 sec
[junit] Running org.apache.poi.xssf.util.TestNumericRanges
[junit] Tests run: 2, Failures: 0, Errors: 0, Skipped: 0, Time elapsed: 0.002 sec
[junit] Running org.apache.poi.xwpf.TestAllExtendedProperties
[junit] Tests run: 1, Failures: 0, Errors: 0, Skipped: 0, Time elapsed: 0.049 sec
[junit] Running org.apache.poi.xwpf.TestDocumentProtection
[junit] Tests run: 10, Failures: 0, Errors: 0, Skipped: 0, Time elapsed: 1.67 sec
[junit] Running org.apache.poi.xwpf.TestPackageCorePropertiesGetKeywords
[junit] Tests run: 1, Failures: 0, Errors: 0, Skipped: 0, Time elapsed: 0.032 sec
[junit] Running org.apache.poi.xwpf.TestXWPFBugs
[junit] Tests run: 2, Failures: 0, Errors: 0, Skipped: 1, Time elapsed: 0.07 sec
[junit] Running org.apache.poi.xwpf.extractor.TestXWPFWordExtractor
[junit] Tests run: 17, Failures: 0, Errors: 0, Skipped: 0, Time elapsed: 0.712 sec
[junit] Running org.apache.poi.xwpf.model.TestXWPFDecorators
[junit] Tests run: 2, Failures: 0, Errors: 0, Skipped: 0, Time elapsed: 0.078 sec
[junit] Running org.apache.poi.xwpf.model.TestXWPFHeaderFooterPolicy
[junit] Tests run: 2, Failures: 0, Errors: 0, Skipped: 0, Time elapsed: 0.136 sec
[junit] Running org.apache.poi.xwpf.usermodel.TestChangeTracking
[junit] Tests run: 3, Failures: 0, Errors: 0, Skipped: 0, Time elapsed: 0.036 sec
[junit] Running org.apache.poi.xwpf.usermodel.TestXWPFBugs
[junit] Tests run: 1, Failures: 0, Errors: 0, Skipped: 0, Time elapsed: 0.017 sec
[junit] Running org.apache.poi.xwpf.usermodel.TestXWPFDocument
[junit] Tests run: 17, Failures: 0, Errors: 0, Skipped: 0, Time elapsed: 0.484 sec
[junit] Running org.apache.poi.xwpf.usermodel.TestXWPFFootnotes
[junit] Tests run: 2, Failures: 0, Errors: 0, Skipped: 0, Time elapsed: 0.034 sec
[junit] Running org.apache.poi.xwpf.usermodel.TestXWPFHeader
[junit] Tests run: 8, Failures: 0, Errors: 0, Skipped: 0, Time elapsed: 0.119 sec
[junit] Running org.apache.poi.xwpf.usermodel.TestXWPFHeadings
[junit] Tests run: 1, Failures: 0, Errors: 0, Skipped: 0, Time elapsed: 0.064 sec
[junit] Running org.apache.poi.xwpf.usermodel.TestXWPFNumbering
[junit] Tests run: 4, Failures: 0, Errors: 0, Skipped: 0, Time elapsed: 0.045 sec
[junit] Running org.apache.poi.xwpf.usermodel.TestXWPFParagraph
[junit] Tests run: 13, Failures: 0, Errors: 0, Skipped: 0, Time elapsed: 0.091 sec
[junit] Running org.apache.poi.xwpf.usermodel.TestXWPFPictureData
[junit] Tests run: 4, Failures: 0, Errors: 0, Skipped: 0, Time elapsed: 0.372 sec
[junit] Running org.apache.poi.xwpf.usermodel.TestXWPFRun
[junit] Tests run: 17, Failures: 0, Errors: 0, Skipped: 0, Time elapsed: 0.093 sec
[junit] Running org.apache.poi.xwpf.usermodel.TestXWPFSDT
[junit] Tests run: 4, Failures: 0, Errors: 0, Skipped: 0, Time elapsed: 0.124 sec
[junit] Running org.apache.poi.xwpf.usermodel.TestXWPFSmartTag
[junit] Tests run: 1, Failures: 0, Errors: 0, Skipped: 0, Time elapsed: 0.012 sec
[junit] Running org.apache.poi.xwpf.usermodel.TestXWPFStyles
[junit] Tests run: 6, Failures: 0, Errors: 0, Skipped: 0, Time elapsed: 0.093 sec
[junit] Running org.apache.poi.xwpf.usermodel.TestXWPFTable
[junit] Tests run: 11, Failures: 0, Errors: 0, Skipped: 0, Time elapsed: 0.055 sec
[junit] Running org.apache.poi.xwpf.usermodel.TestXWPFTableCell
[junit] Tests run: 3, Failures: 0, Errors: 0, Skipped: 0, Time elapsed: 0.028 sec
[junit] Running org.apache.poi.xwpf.usermodel.TestXWPFTableRow
[junit] Tests run: 3, Failures: 0, Errors: 0, Skipped: 0, Time elapsed: 0.005 sec
testcoveragereport:
[mkdir] Created dir: <https://builds.apache.org/job/POI/385/artifact/build/coverage>
[jacoco:report] Loading execution data file <https://builds.apache.org/job/POI/ws/build/jacoco-excelant.exec>
[jacoco:report] Loading execution data file <https://builds.apache.org/job/POI/ws/build/jacoco-main.exec>
[jacoco:report] Loading execution data file <https://builds.apache.org/job/POI/ws/build/jacoco-ooxml-lite.exec>
[jacoco:report] Loading execution data file <https://builds.apache.org/job/POI/ws/build/jacoco-ooxml.exec>
[jacoco:report] Loading execution data file <https://builds.apache.org/job/POI/ws/build/jacoco-scratchpad.exec>
[jacoco:report] Writing bundle 'Main' with 1205 classes
BUILD FAILED
<https://builds.apache.org/job/POI/ws/build.xml>:730: Error while creating report
Total time: 7 minutes 41 seconds
Build step 'Invoke Ant' marked build as failure
[WARNINGS] Skipping publisher since build result is FAILURE
Archiving artifacts
Sending artifact delta relative to POI #384
Archived 2174 artifacts
Archive block size is 32768
Received 22 blocks and 23917508 bytes
Compression is 2.9%
Took 21 sec
Recording test results
---------------------------------------------------------------------
To unsubscribe, e-mail: dev-unsubscribe@poi.apache.org
For additional commands, e-mail: dev-help@poi.apache.org
Jenkins build is back to normal : POI #388
Posted by Apache Jenkins Server <je...@builds.apache.org>.
See <https://builds.apache.org/job/POI/388/>
---------------------------------------------------------------------
To unsubscribe, e-mail: dev-unsubscribe@poi.apache.org
For additional commands, e-mail: dev-help@poi.apache.org
Build failed in Jenkins: POI #387
Posted by Apache Jenkins Server <je...@builds.apache.org>.
See <https://builds.apache.org/job/POI/387/changes>
Changes:
[kiwiwings] Another test for NPOIFS in-place writing support - probably the deletion of an entry causes the problem
------------------------------------------
[...truncated 6228 lines...]
[echo] AL f:/hudson/hudson-slave/workspace/POI/src/testcases/org/apache/poi/ss/formula/atp/TestNetworkdaysFunction.java
[echo] AL f:/hudson/hudson-slave/workspace/POI/src/testcases/org/apache/poi/ss/formula/atp/TestPercentile.java
[echo] AL f:/hudson/hudson-slave/workspace/POI/src/testcases/org/apache/poi/ss/formula/atp/TestRandBetween.java
[echo] AL f:/hudson/hudson-slave/workspace/POI/src/testcases/org/apache/poi/ss/formula/atp/TestWorkdayCalculator.java
[echo] AL f:/hudson/hudson-slave/workspace/POI/src/testcases/org/apache/poi/ss/formula/atp/TestWorkdayFunction.java
[echo] AL f:/hudson/hudson-slave/workspace/POI/src/testcases/org/apache/poi/ss/formula/atp/TestYearFracCalculator.java
[echo] AL f:/hudson/hudson-slave/workspace/POI/src/testcases/org/apache/poi/ss/formula/atp/TestYearFracCalculatorFromSpreadsheet.java
[echo] AL f:/hudson/hudson-slave/workspace/POI/src/testcases/org/apache/poi/ss/formula/constant/TestConstantValueParser.java
[echo] AL f:/hudson/hudson-slave/workspace/POI/src/testcases/org/apache/poi/ss/formula/eval/AllFormulaEvalTests.java
[echo] AL f:/hudson/hudson-slave/workspace/POI/src/testcases/org/apache/poi/ss/formula/eval/EvalInstances.java
[echo] AL f:/hudson/hudson-slave/workspace/POI/src/testcases/org/apache/poi/ss/formula/eval/TestAreaEval.java
[echo] AL f:/hudson/hudson-slave/workspace/POI/src/testcases/org/apache/poi/ss/formula/eval/TestCircularReferences.java
[echo] AL f:/hudson/hudson-slave/workspace/POI/src/testcases/org/apache/poi/ss/formula/eval/TestDivideEval.java
[echo] AL f:/hudson/hudson-slave/workspace/POI/src/testcases/org/apache/poi/ss/formula/eval/TestEqualEval.java
[echo] AL f:/hudson/hudson-slave/workspace/POI/src/testcases/org/apache/poi/ss/formula/eval/TestExternalFunction.java
[echo] AL f:/hudson/hudson-slave/workspace/POI/src/testcases/org/apache/poi/ss/formula/eval/TestFormulaBugs.java
[echo] AL f:/hudson/hudson-slave/workspace/POI/src/testcases/org/apache/poi/ss/formula/eval/TestFormulasFromSpreadsheet.java
[echo] AL f:/hudson/hudson-slave/workspace/POI/src/testcases/org/apache/poi/ss/formula/eval/TestMinusZeroResult.java
[echo] AL f:/hudson/hudson-slave/workspace/POI/src/testcases/org/apache/poi/ss/formula/eval/TestMissingArgEval.java
[echo] AL f:/hudson/hudson-slave/workspace/POI/src/testcases/org/apache/poi/ss/formula/eval/TestMultiSheetEval.java
[echo] AL f:/hudson/hudson-slave/workspace/POI/src/testcases/org/apache/poi/ss/formula/eval/TestOperandResolver.java
[echo] AL f:/hudson/hudson-slave/workspace/POI/src/testcases/org/apache/poi/ss/formula/eval/TestPercentEval.java
[echo] AL f:/hudson/hudson-slave/workspace/POI/src/testcases/org/apache/poi/ss/formula/eval/TestRangeEval.java
[echo] AL f:/hudson/hudson-slave/workspace/POI/src/testcases/org/apache/poi/ss/formula/eval/TestUnaryPlusEval.java
[echo] AL f:/hudson/hudson-slave/workspace/POI/src/testcases/org/apache/poi/ss/formula/eval/forked/TestForkedEvaluator.java
[echo] AL f:/hudson/hudson-slave/workspace/POI/src/testcases/org/apache/poi/ss/formula/function/AllFormulaFunctionTests.java
[echo] AL f:/hudson/hudson-slave/workspace/POI/src/testcases/org/apache/poi/ss/formula/function/ExcelFileFormatDocFunctionExtractor.java
[echo] AL f:/hudson/hudson-slave/workspace/POI/src/testcases/org/apache/poi/ss/formula/function/TestFunctionMetadataRegistry.java
[echo] AL f:/hudson/hudson-slave/workspace/POI/src/testcases/org/apache/poi/ss/formula/function/TestParseMissingBuiltInFuncs.java
[echo] AL f:/hudson/hudson-slave/workspace/POI/src/testcases/org/apache/poi/ss/formula/function/TestReadMissingBuiltInFuncs.java
[echo] AL f:/hudson/hudson-slave/workspace/POI/src/testcases/org/apache/poi/ss/formula/functions/AbstractNumericTestCase.java
[echo] AL f:/hudson/hudson-slave/workspace/POI/src/testcases/org/apache/poi/ss/formula/functions/AllIndividualFunctionEvaluationTests.java
[echo] AL f:/hudson/hudson-slave/workspace/POI/src/testcases/org/apache/poi/ss/formula/functions/BaseTestFunctionsFromSpreadsheet.java
[echo] AL f:/hudson/hudson-slave/workspace/POI/src/testcases/org/apache/poi/ss/formula/functions/CountifsTests.java
[echo] AL f:/hudson/hudson-slave/workspace/POI/src/testcases/org/apache/poi/ss/formula/functions/EvalFactory.java
[echo] AL f:/hudson/hudson-slave/workspace/POI/src/testcases/org/apache/poi/ss/formula/functions/NumericFunctionInvoker.java
[echo] AL f:/hudson/hudson-slave/workspace/POI/src/testcases/org/apache/poi/ss/formula/functions/TestAddress.java
[echo] AL f:/hudson/hudson-slave/workspace/POI/src/testcases/org/apache/poi/ss/formula/functions/TestAverage.java
[echo] AL f:/hudson/hudson-slave/workspace/POI/src/testcases/org/apache/poi/ss/formula/functions/TestCalendarFieldFunction.java
[echo] AL f:/hudson/hudson-slave/workspace/POI/src/testcases/org/apache/poi/ss/formula/functions/TestClean.java
[echo] AL f:/hudson/hudson-slave/workspace/POI/src/testcases/org/apache/poi/ss/formula/functions/TestCode.java
[echo] AL f:/hudson/hudson-slave/workspace/POI/src/testcases/org/apache/poi/ss/formula/functions/TestCodeFunctionsFromSpreadsheet.java
[echo] AL f:/hudson/hudson-slave/workspace/POI/src/testcases/org/apache/poi/ss/formula/functions/TestComplex.java
[echo] AL f:/hudson/hudson-slave/workspace/POI/src/testcases/org/apache/poi/ss/formula/functions/TestComplexFunctionsFromSpreadsheet.java
[echo] AL f:/hudson/hudson-slave/workspace/POI/src/testcases/org/apache/poi/ss/formula/functions/TestCountFuncs.java
[echo] AL f:/hudson/hudson-slave/workspace/POI/src/testcases/org/apache/poi/ss/formula/functions/TestDate.java
[echo] AL f:/hudson/hudson-slave/workspace/POI/src/testcases/org/apache/poi/ss/formula/functions/TestDays360.java
[echo] AL f:/hudson/hudson-slave/workspace/POI/src/testcases/org/apache/poi/ss/formula/functions/TestDec2Hex.java
[echo] AL f:/hudson/hudson-slave/workspace/POI/src/testcases/org/apache/poi/ss/formula/functions/TestDelta.java
[echo] AL f:/hudson/hudson-slave/workspace/POI/src/testcases/org/apache/poi/ss/formula/functions/TestDeltaFunctionsFromSpreadsheet.java
[echo] AL f:/hudson/hudson-slave/workspace/POI/src/testcases/org/apache/poi/ss/formula/functions/TestEDate.java
[echo] AL f:/hudson/hudson-slave/workspace/POI/src/testcases/org/apache/poi/ss/formula/functions/TestFactDoubleFunctionsFromSpreadsheet.java
[echo] AL f:/hudson/hudson-slave/workspace/POI/src/testcases/org/apache/poi/ss/formula/functions/TestFinanceLib.java
[echo] AL f:/hudson/hudson-slave/workspace/POI/src/testcases/org/apache/poi/ss/formula/functions/TestFind.java
[echo] AL f:/hudson/hudson-slave/workspace/POI/src/testcases/org/apache/poi/ss/formula/functions/TestHex2Dec.java
[echo] AL f:/hudson/hudson-slave/workspace/POI/src/testcases/org/apache/poi/ss/formula/functions/TestIPMT.java
[echo] AL f:/hudson/hudson-slave/workspace/POI/src/testcases/org/apache/poi/ss/formula/functions/TestImRealFunctionsFromSpreadsheet.java
[echo] AL f:/hudson/hudson-slave/workspace/POI/src/testcases/org/apache/poi/ss/formula/functions/TestImaginaryFunctionsFromSpreadsheet.java
[echo] AL f:/hudson/hudson-slave/workspace/POI/src/testcases/org/apache/poi/ss/formula/functions/TestIndex.java
[echo] AL f:/hudson/hudson-slave/workspace/POI/src/testcases/org/apache/poi/ss/formula/functions/TestIndexFunctionFromSpreadsheet.java
[echo] AL f:/hudson/hudson-slave/workspace/POI/src/testcases/org/apache/poi/ss/formula/functions/TestIndirect.java
[echo] AL f:/hudson/hudson-slave/workspace/POI/src/testcases/org/apache/poi/ss/formula/functions/TestIndirectFunctionFromSpreadsheet.java
[echo] AL f:/hudson/hudson-slave/workspace/POI/src/testcases/org/apache/poi/ss/formula/functions/TestIntercept.java
[echo] AL f:/hudson/hudson-slave/workspace/POI/src/testcases/org/apache/poi/ss/formula/functions/TestIrr.java
[echo] AL f:/hudson/hudson-slave/workspace/POI/src/testcases/org/apache/poi/ss/formula/functions/TestIsBlank.java
[echo] AL f:/hudson/hudson-slave/workspace/POI/src/testcases/org/apache/poi/ss/formula/functions/TestLeftRight.java
[echo] AL f:/hudson/hudson-slave/workspace/POI/src/testcases/org/apache/poi/ss/formula/functions/TestLen.java
[echo] AL f:/hudson/hudson-slave/workspace/POI/src/testcases/org/apache/poi/ss/formula/functions/TestLookupFunctionsFromSpreadsheet.java
[echo] AL f:/hudson/hudson-slave/workspace/POI/src/testcases/org/apache/poi/ss/formula/functions/TestMatch.java
[echo] AL f:/hudson/hudson-slave/workspace/POI/src/testcases/org/apache/poi/ss/formula/functions/TestMatchFunctionsFromSpreadsheet.java
[echo] AL f:/hudson/hudson-slave/workspace/POI/src/testcases/org/apache/poi/ss/formula/functions/TestMathX.java
[echo] AL f:/hudson/hudson-slave/workspace/POI/src/testcases/org/apache/poi/ss/formula/functions/TestMid.java
[echo] AL f:/hudson/hudson-slave/workspace/POI/src/testcases/org/apache/poi/ss/formula/functions/TestMirr.java
[echo] AL f:/hudson/hudson-slave/workspace/POI/src/testcases/org/apache/poi/ss/formula/functions/TestNper.java
[echo] AL f:/hudson/hudson-slave/workspace/POI/src/testcases/org/apache/poi/ss/formula/functions/TestNpv.java
[echo] AL f:/hudson/hudson-slave/workspace/POI/src/testcases/org/apache/poi/ss/formula/functions/TestOct2Dec.java
[echo] AL f:/hudson/hudson-slave/workspace/POI/src/testcases/org/apache/poi/ss/formula/functions/TestOffset.java
[echo] AL f:/hudson/hudson-slave/workspace/POI/src/testcases/org/apache/poi/ss/formula/functions/TestPPMT.java
[echo] AL f:/hudson/hudson-slave/workspace/POI/src/testcases/org/apache/poi/ss/formula/functions/TestPmt.java
[echo] AL f:/hudson/hudson-slave/workspace/POI/src/testcases/org/apache/poi/ss/formula/functions/TestPoisson.java
[echo] AL f:/hudson/hudson-slave/workspace/POI/src/testcases/org/apache/poi/ss/formula/functions/TestQuotient.java
[echo] AL f:/hudson/hudson-slave/workspace/POI/src/testcases/org/apache/poi/ss/formula/functions/TestQuotientFunctionsFromSpreadsheet.java
[echo] AL f:/hudson/hudson-slave/workspace/POI/src/testcases/org/apache/poi/ss/formula/functions/TestRank.java
[echo] AL f:/hudson/hudson-slave/workspace/POI/src/testcases/org/apache/poi/ss/formula/functions/TestReptFunctionsFromSpreadsheet.java
[echo] AL f:/hudson/hudson-slave/workspace/POI/src/testcases/org/apache/poi/ss/formula/functions/TestRomanFunctionsFromSpreadsheet.java
[echo] AL f:/hudson/hudson-slave/workspace/POI/src/testcases/org/apache/poi/ss/formula/functions/TestRoundFuncs.java
[echo] AL f:/hudson/hudson-slave/workspace/POI/src/testcases/org/apache/poi/ss/formula/functions/TestRowCol.java
[echo] AL f:/hudson/hudson-slave/workspace/POI/src/testcases/org/apache/poi/ss/formula/functions/TestSlope.java
[echo] AL f:/hudson/hudson-slave/workspace/POI/src/testcases/org/apache/poi/ss/formula/functions/TestStatsLib.java
[echo] AL f:/hudson/hudson-slave/workspace/POI/src/testcases/org/apache/poi/ss/formula/functions/TestSubtotal.java
[echo] AL f:/hudson/hudson-slave/workspace/POI/src/testcases/org/apache/poi/ss/formula/functions/TestSumif.java
[echo] AL f:/hudson/hudson-slave/workspace/POI/src/testcases/org/apache/poi/ss/formula/functions/TestSumifs.java
[echo] AL f:/hudson/hudson-slave/workspace/POI/src/testcases/org/apache/poi/ss/formula/functions/TestSumproduct.java
[echo] AL f:/hudson/hudson-slave/workspace/POI/src/testcases/org/apache/poi/ss/formula/functions/TestTFunc.java
[echo] AL f:/hudson/hudson-slave/workspace/POI/src/testcases/org/apache/poi/ss/formula/functions/TestText.java
[echo] AL f:/hudson/hudson-slave/workspace/POI/src/testcases/org/apache/poi/ss/formula/functions/TestTime.java
[echo] AL f:/hudson/hudson-slave/workspace/POI/src/testcases/org/apache/poi/ss/formula/functions/TestTrim.java
[echo] AL f:/hudson/hudson-slave/workspace/POI/src/testcases/org/apache/poi/ss/formula/functions/TestTrunc.java
[echo] AL f:/hudson/hudson-slave/workspace/POI/src/testcases/org/apache/poi/ss/formula/functions/TestValue.java
[echo] AL f:/hudson/hudson-slave/workspace/POI/src/testcases/org/apache/poi/ss/formula/functions/TestWeekNumFunctionsFromSpreadsheet.java
[echo] AL f:/hudson/hudson-slave/workspace/POI/src/testcases/org/apache/poi/ss/formula/functions/TestWeekNumFunctionsFromSpreadsheet2013.java
[echo] AL f:/hudson/hudson-slave/workspace/POI/src/testcases/org/apache/poi/ss/formula/functions/TestXYNumericFunction.java
[echo] AL f:/hudson/hudson-slave/workspace/POI/src/testcases/org/apache/poi/ss/formula/ptg/AbstractPtgTestCase.java
[echo] AL f:/hudson/hudson-slave/workspace/POI/src/testcases/org/apache/poi/ss/formula/ptg/AllFormulaTests.java
[echo] AL f:/hudson/hudson-slave/workspace/POI/src/testcases/org/apache/poi/ss/formula/ptg/TestArea3DPtg.java
[echo] AL f:/hudson/hudson-slave/workspace/POI/src/testcases/org/apache/poi/ss/formula/ptg/TestAreaErrPtg.java
[echo] AL f:/hudson/hudson-slave/workspace/POI/src/testcases/org/apache/poi/ss/formula/ptg/TestAreaPtg.java
[echo] AL f:/hudson/hudson-slave/workspace/POI/src/testcases/org/apache/poi/ss/formula/ptg/TestArrayPtg.java
[echo] AL f:/hudson/hudson-slave/workspace/POI/src/testcases/org/apache/poi/ss/formula/ptg/TestAttrPtg.java
[echo] AL f:/hudson/hudson-slave/workspace/POI/src/testcases/org/apache/poi/ss/formula/ptg/TestErrPtg.java
[echo] AL f:/hudson/hudson-slave/workspace/POI/src/testcases/org/apache/poi/ss/formula/ptg/TestExternalFunctionFormulas.java
[echo] AL f:/hudson/hudson-slave/workspace/POI/src/testcases/org/apache/poi/ss/formula/ptg/TestExternalNameReference.java
[echo] AL f:/hudson/hudson-slave/workspace/POI/src/testcases/org/apache/poi/ss/formula/ptg/TestFuncPtg.java
[echo] AL f:/hudson/hudson-slave/workspace/POI/src/testcases/org/apache/poi/ss/formula/ptg/TestFuncVarPtg.java
[echo] AL f:/hudson/hudson-slave/workspace/POI/src/testcases/org/apache/poi/ss/formula/ptg/TestIntersectionPtg.java
[echo] AL f:/hudson/hudson-slave/workspace/POI/src/testcases/org/apache/poi/ss/formula/ptg/TestPercentPtg.java
[echo] AL f:/hudson/hudson-slave/workspace/POI/src/testcases/org/apache/poi/ss/formula/ptg/TestRangePtg.java
[echo] AL f:/hudson/hudson-slave/workspace/POI/src/testcases/org/apache/poi/ss/formula/ptg/TestRef3DPtg.java
[echo] AL f:/hudson/hudson-slave/workspace/POI/src/testcases/org/apache/poi/ss/formula/ptg/TestReferencePtg.java
[echo] AL f:/hudson/hudson-slave/workspace/POI/src/testcases/org/apache/poi/ss/formula/ptg/TestUnionPtg.java
[echo] AL f:/hudson/hudson-slave/workspace/POI/src/testcases/org/apache/poi/ss/usermodel/BaseTestBugzillaIssues.java
[echo] AL f:/hudson/hudson-slave/workspace/POI/src/testcases/org/apache/poi/ss/usermodel/BaseTestCell.java
[echo] AL f:/hudson/hudson-slave/workspace/POI/src/testcases/org/apache/poi/ss/usermodel/BaseTestCellComment.java
[echo] AL f:/hudson/hudson-slave/workspace/POI/src/testcases/org/apache/poi/ss/usermodel/BaseTestConditionalFormatting.java
[echo] AL f:/hudson/hudson-slave/workspace/POI/src/testcases/org/apache/poi/ss/usermodel/BaseTestDataFormat.java
[echo] AL f:/hudson/hudson-slave/workspace/POI/src/testcases/org/apache/poi/ss/usermodel/BaseTestDataValidation.java
[echo] AL f:/hudson/hudson-slave/workspace/POI/src/testcases/org/apache/poi/ss/usermodel/BaseTestFont.java
[echo] AL f:/hudson/hudson-slave/workspace/POI/src/testcases/org/apache/poi/ss/usermodel/BaseTestFormulaEvaluator.java
[echo] AL f:/hudson/hudson-slave/workspace/POI/src/testcases/org/apache/poi/ss/usermodel/BaseTestHyperlink.java
[echo] AL f:/hudson/hudson-slave/workspace/POI/src/testcases/org/apache/poi/ss/usermodel/BaseTestNamedRange.java
[echo] AL f:/hudson/hudson-slave/workspace/POI/src/testcases/org/apache/poi/ss/usermodel/BaseTestPicture.java
[echo] AL f:/hudson/hudson-slave/workspace/POI/src/testcases/org/apache/poi/ss/usermodel/BaseTestRow.java
[echo] AL f:/hudson/hudson-slave/workspace/POI/src/testcases/org/apache/poi/ss/usermodel/BaseTestSheet.java
[echo] AL f:/hudson/hudson-slave/workspace/POI/src/testcases/org/apache/poi/ss/usermodel/BaseTestSheetAutosizeColumn.java
[echo] AL f:/hudson/hudson-slave/workspace/POI/src/testcases/org/apache/poi/ss/usermodel/BaseTestSheetHiding.java
[echo] AL f:/hudson/hudson-slave/workspace/POI/src/testcases/org/apache/poi/ss/usermodel/BaseTestSheetShiftRows.java
[echo] AL f:/hudson/hudson-slave/workspace/POI/src/testcases/org/apache/poi/ss/usermodel/BaseTestSheetUpdateArrayFormulas.java
[echo] AL f:/hudson/hudson-slave/workspace/POI/src/testcases/org/apache/poi/ss/usermodel/BaseTestWorkbook.java
[echo] AL f:/hudson/hudson-slave/workspace/POI/src/testcases/org/apache/poi/ss/usermodel/TestDataFormatter.java
[echo] AL f:/hudson/hudson-slave/workspace/POI/src/testcases/org/apache/poi/ss/usermodel/TestFractionFormat.java
[echo] AL f:/hudson/hudson-slave/workspace/POI/src/testcases/org/apache/poi/ss/usermodel/charts/TestDataSources.java
[echo] AL f:/hudson/hudson-slave/workspace/POI/src/testcases/org/apache/poi/ss/util/AllSSUtilTests.java
[echo] AL f:/hudson/hudson-slave/workspace/POI/src/testcases/org/apache/poi/ss/util/NumberComparingSpreadsheetGenerator.java
[echo] AL f:/hudson/hudson-slave/workspace/POI/src/testcases/org/apache/poi/ss/util/NumberComparisonExamples.java
[echo] AL f:/hudson/hudson-slave/workspace/POI/src/testcases/org/apache/poi/ss/util/NumberRenderingSpreadsheetGenerator.java
[echo] AL f:/hudson/hudson-slave/workspace/POI/src/testcases/org/apache/poi/ss/util/NumberToTextConversionExamples.java
[echo] AL f:/hudson/hudson-slave/workspace/POI/src/testcases/org/apache/poi/ss/util/TestCellRangeAddress.java
[echo] AL f:/hudson/hudson-slave/workspace/POI/src/testcases/org/apache/poi/ss/util/TestCellReference.java
[echo] AL f:/hudson/hudson-slave/workspace/POI/src/testcases/org/apache/poi/ss/util/TestDateFormatConverter.java
[echo] AL f:/hudson/hudson-slave/workspace/POI/src/testcases/org/apache/poi/ss/util/TestExpandedDouble.java
[echo] AL f:/hudson/hudson-slave/workspace/POI/src/testcases/org/apache/poi/ss/util/TestNumberComparer.java
[echo] AL f:/hudson/hudson-slave/workspace/POI/src/testcases/org/apache/poi/ss/util/TestNumberToTextConverter.java
[echo] AL f:/hudson/hudson-slave/workspace/POI/src/testcases/org/apache/poi/ss/util/TestRegion.java
[echo] AL f:/hudson/hudson-slave/workspace/POI/src/testcases/org/apache/poi/ss/util/TestSheetBuilder.java
[echo] AL f:/hudson/hudson-slave/workspace/POI/src/testcases/org/apache/poi/ss/util/TestWorkbookUtil.java
[echo] AL f:/hudson/hudson-slave/workspace/POI/src/testcases/org/apache/poi/ss/util/cellwalk/TestCellWalk.java
[echo] AL f:/hudson/hudson-slave/workspace/POI/src/testcases/org/apache/poi/util/AllPOIUtilTests.java
[echo] AL f:/hudson/hudson-slave/workspace/POI/src/testcases/org/apache/poi/util/DummyPOILogger.java
[echo] AL f:/hudson/hudson-slave/workspace/POI/src/testcases/org/apache/poi/util/LocalTestNode.java
[echo] AL f:/hudson/hudson-slave/workspace/POI/src/testcases/org/apache/poi/util/TestArrayUtil.java
[echo] AL f:/hudson/hudson-slave/workspace/POI/src/testcases/org/apache/poi/util/TestBinaryTree.java
[echo] AL f:/hudson/hudson-slave/workspace/POI/src/testcases/org/apache/poi/util/TestBitField.java
[echo] AL f:/hudson/hudson-slave/workspace/POI/src/testcases/org/apache/poi/util/TestByteField.java
[echo] AL f:/hudson/hudson-slave/workspace/POI/src/testcases/org/apache/poi/util/TestHexDump.java
[echo] AL f:/hudson/hudson-slave/workspace/POI/src/testcases/org/apache/poi/util/TestIntList.java
[echo] AL f:/hudson/hudson-slave/workspace/POI/src/testcases/org/apache/poi/util/TestIntegerField.java
[echo] AL f:/hudson/hudson-slave/workspace/POI/src/testcases/org/apache/poi/util/TestLittleEndian.java
[echo] AL f:/hudson/hudson-slave/workspace/POI/src/testcases/org/apache/poi/util/TestLittleEndianStreams.java
[echo] AL f:/hudson/hudson-slave/workspace/POI/src/testcases/org/apache/poi/util/TestLongField.java
[echo] AL f:/hudson/hudson-slave/workspace/POI/src/testcases/org/apache/poi/util/TestPOILogFactory.java
[echo] AL f:/hudson/hudson-slave/workspace/POI/src/testcases/org/apache/poi/util/TestPOILogger.java
[echo] AL f:/hudson/hudson-slave/workspace/POI/src/testcases/org/apache/poi/util/TestShortField.java
[echo] AL f:/hudson/hudson-slave/workspace/POI/src/testcases/org/apache/poi/util/TestShortList.java
[echo] AL f:/hudson/hudson-slave/workspace/POI/src/testcases/org/apache/poi/util/TestStringUtil.java
[echo] AL f:/hudson/hudson-slave/workspace/POI/src/testcases/org/apache/poi/util/TestTempFile.java
[echo] AL f:/hudson/hudson-slave/workspace/POI/src/testcases/org/apache/poi/util/data/test_properties1
[echo] AL f:/hudson/hudson-slave/workspace/POI/src/testcases/org/apache/poi/util/data/test_properties2
[echo] AL f:/hudson/hudson-slave/workspace/POI/src/testcases/org/apache/poi/util/data/test_properties3
[echo] AL f:/hudson/hudson-slave/workspace/POI/src/types/definitions/FFData_type.xml
[echo] AL f:/hudson/hudson-slave/workspace/POI/src/types/definitions/FibBase_type.xml
[echo] AL f:/hudson/hudson-slave/workspace/POI/src/types/definitions/FibRgLw95_type.xml
[echo] AL f:/hudson/hudson-slave/workspace/POI/src/types/definitions/FibRgLw97_type.xml
[echo] AL f:/hudson/hudson-slave/workspace/POI/src/types/definitions/FibRgW97_type.xml
[echo] AL f:/hudson/hudson-slave/workspace/POI/src/types/definitions/LFOLVLBase_type.xml
[echo] AL f:/hudson/hudson-slave/workspace/POI/src/types/definitions/StdfBase_type.xml
[echo] AL f:/hudson/hudson-slave/workspace/POI/src/types/definitions/StdfPost2000_type.xml
[echo] AL f:/hudson/hudson-slave/workspace/POI/src/types/definitions/Stshif_type.xml
[echo] AL f:/hudson/hudson-slave/workspace/POI/src/types/definitions/bkf_type.xml
[echo] AL f:/hudson/hudson-slave/workspace/POI/src/types/definitions/chp_type.xml
[echo] AL f:/hudson/hudson-slave/workspace/POI/src/types/definitions/dop_type.xml
[echo] AL f:/hudson/hudson-slave/workspace/POI/src/types/definitions/fld_type.xml
[echo] AL f:/hudson/hudson-slave/workspace/POI/src/types/definitions/frd_type.xml
[echo] AL f:/hudson/hudson-slave/workspace/POI/src/types/definitions/fspa_type.xml
[echo] AL f:/hudson/hudson-slave/workspace/POI/src/types/definitions/grfhic_type.xml
[echo] AL f:/hudson/hudson-slave/workspace/POI/src/types/definitions/hresi_type.xml
[echo] AL f:/hudson/hudson-slave/workspace/POI/src/types/definitions/lfo_type.xml
[echo] AL f:/hudson/hudson-slave/workspace/POI/src/types/definitions/lstf_type.xml
[echo] AL f:/hudson/hudson-slave/workspace/POI/src/types/definitions/lvlf_type.xml
[echo] AL f:/hudson/hudson-slave/workspace/POI/src/types/definitions/pap_type.xml
[echo] AL f:/hudson/hudson-slave/workspace/POI/src/types/definitions/picf_type.xml
[echo] AL f:/hudson/hudson-slave/workspace/POI/src/types/definitions/sep_type.xml
[echo] AL f:/hudson/hudson-slave/workspace/POI/src/types/definitions/shd80_type.xml
[echo] AL f:/hudson/hudson-slave/workspace/POI/src/types/definitions/shd_type.xml
[echo] AL f:/hudson/hudson-slave/workspace/POI/src/types/definitions/tap_type.xml
[echo] AL f:/hudson/hudson-slave/workspace/POI/src/types/definitions/tbd_type.xml
[echo] AL f:/hudson/hudson-slave/workspace/POI/src/types/definitions/tc_type.xml
[echo] AL f:/hudson/hudson-slave/workspace/POI/src/types/definitions/tlp_type.xml
[echo] AL f:/hudson/hudson-slave/workspace/POI/src/types/styles/hdftype.xsl
[echo] AL f:/hudson/hudson-slave/workspace/POI/src/types/styles/hdftype_document.xsl
[echo] AL f:/hudson/hudson-slave/workspace/POI/src/types/styles/hdftype_test.xsl
[echo]
[echo] *****************************************************
[echo] Printing headers for files without AL header...
[echo]
[echo]
jenkins:
BUILD SUCCESSFUL
Total time: 32 minutes 32 seconds
[WARNINGS] Parsing warnings in console log with parser Java Compiler (javac)
[WARNINGS] Parsing warnings in console log with parser JavaDoc Tool
Archiving artifacts
Sending artifact delta relative to POI #384
Archived 4132 artifacts
Archive block size is 32768
Received 392 blocks and 108711699 bytes
Compression is 10.6%
Took 2 min 26 sec
Recording test results
ERROR: Publisher hudson.tasks.junit.JUnitResultArchiver aborted due to exception
java.lang.InterruptedException
at java.lang.Object.wait(Native Method)
at hudson.remoting.Request.call(Request.java:146)
at hudson.remoting.Channel.call(Channel.java:722)
at hudson.FilePath.act(FilePath.java:903)
at hudson.FilePath.act(FilePath.java:887)
at hudson.tasks.junit.JUnitParser.parse(JUnitParser.java:87)
at hudson.tasks.junit.JUnitResultArchiver.parse(JUnitResultArchiver.java:121)
at hudson.tasks.junit.JUnitResultArchiver.perform(JUnitResultArchiver.java:133)
at hudson.tasks.BuildStepMonitor$1.perform(BuildStepMonitor.java:20)
at hudson.model.AbstractBuild$AbstractBuildExecution.perform(AbstractBuild.java:804)
at hudson.model.AbstractBuild$AbstractBuildExecution.performAllBuildSteps(AbstractBuild.java:776)
at hudson.model.Build$BuildExecution.post2(Build.java:183)
at hudson.model.AbstractBuild$AbstractBuildExecution.post(AbstractBuild.java:725)
at hudson.model.Run.execute(Run.java:1701)
at hudson.model.FreeStyleBuild.run(FreeStyleBuild.java:43)
at hudson.model.ResourceController.execute(ResourceController.java:88)
at hudson.model.Executor.run(Executor.java:231)
---------------------------------------------------------------------
To unsubscribe, e-mail: dev-unsubscribe@poi.apache.org
For additional commands, e-mail: dev-help@poi.apache.org
Build failed in Jenkins: POI #386
Posted by Apache Jenkins Server <je...@builds.apache.org>.
See <https://builds.apache.org/job/POI/386/changes>
Changes:
[nick] Changelog and javadoc update
[nick] Fix bug #56800 - Provide a helpful exception, XLSBUnsupportedException, if XSSFWorkbook is passed a .xlsb file
[nick] Update the limitations document
------------------------------------------
[...truncated 1952 lines...]
[junit] Tests run: 4, Failures: 0, Errors: 0, Skipped: 0, Time elapsed: 0.387 sec
[junit] Running org.apache.poi.xslf.usermodel.TestXSLFShape
[junit] Tests run: 2, Failures: 0, Errors: 0, Skipped: 0, Time elapsed: 0.079 sec
[junit] Running org.apache.poi.xslf.usermodel.TestXSLFShapeContainer
[junit] Tests run: 1, Failures: 0, Errors: 0, Skipped: 0, Time elapsed: 0.034 sec
[junit] Running org.apache.poi.xslf.usermodel.TestXSLFSheet
[junit] Tests run: 1, Failures: 0, Errors: 0, Skipped: 0, Time elapsed: 0.086 sec
[junit] Running org.apache.poi.xslf.usermodel.TestXSLFSimpleShape
[junit] Tests run: 5, Failures: 0, Errors: 0, Skipped: 0, Time elapsed: 0.182 sec
[junit] Running org.apache.poi.xslf.usermodel.TestXSLFSlide
[junit] Tests run: 4, Failures: 0, Errors: 0, Skipped: 0, Time elapsed: 1.66 sec
[junit] Running org.apache.poi.xslf.usermodel.TestXSLFSlideShow
[junit] Tests run: 5, Failures: 0, Errors: 0, Skipped: 0, Time elapsed: 0.24 sec
[junit] Running org.apache.poi.xslf.usermodel.TestXSLFTable
[junit] Tests run: 2, Failures: 0, Errors: 0, Skipped: 0, Time elapsed: 0.092 sec
[junit] Running org.apache.poi.xslf.usermodel.TestXSLFTableStyles
[junit] Tests run: 2, Failures: 0, Errors: 0, Skipped: 0, Time elapsed: 0.034 sec
[junit] Running org.apache.poi.xslf.usermodel.TestXSLFTextBox
[junit] Tests run: 2, Failures: 0, Errors: 0, Skipped: 0, Time elapsed: 0.055 sec
[junit] Running org.apache.poi.xslf.usermodel.TestXSLFTextParagraph
[junit] Tests run: 5, Failures: 0, Errors: 0, Skipped: 0, Time elapsed: 0.155 sec
[junit] Running org.apache.poi.xslf.usermodel.TestXSLFTextRun
[junit] Tests run: 1, Failures: 0, Errors: 0, Skipped: 0, Time elapsed: 0.029 sec
[junit] Running org.apache.poi.xslf.usermodel.TestXSLFTextShape
[junit] Tests run: 3, Failures: 0, Errors: 0, Skipped: 0, Time elapsed: 0.141 sec
[junit] Running org.apache.poi.xslf.usermodel.TestXSLFTheme
[junit] Tests run: 1, Failures: 0, Errors: 0, Skipped: 0, Time elapsed: 0.374 sec
[junit] Running org.apache.poi.xssf.TestSheetProtection
[junit] Tests run: 17, Failures: 0, Errors: 0, Skipped: 0, Time elapsed: 0.129 sec
[junit] Running org.apache.poi.xssf.TestWorkbookProtection
[junit] Tests run: 5, Failures: 0, Errors: 0, Skipped: 0, Time elapsed: 0.062 sec
[junit] Running org.apache.poi.xssf.eventusermodel.TestReadOnlySharedStringsTable
[junit] Tests run: 1, Failures: 0, Errors: 0, Skipped: 0, Time elapsed: 0.006 sec
[junit] Running org.apache.poi.xssf.eventusermodel.TestXSSFReader
[junit] Tests run: 8, Failures: 0, Errors: 0, Skipped: 0, Time elapsed: 0.086 sec
[junit] Running org.apache.poi.xssf.extractor.TestXSSFEventBasedExcelExtractor
[junit] Tests run: 8, Failures: 0, Errors: 0, Skipped: 0, Time elapsed: 0.353 sec
[junit] Running org.apache.poi.xssf.extractor.TestXSSFEventBasedExcelExtractorUsingFactory
[junit] Tests run: 8, Failures: 0, Errors: 0, Skipped: 0, Time elapsed: 0.218 sec
[junit] Running org.apache.poi.xssf.extractor.TestXSSFExcelExtractor
[junit] Tests run: 7, Failures: 0, Errors: 0, Skipped: 0, Time elapsed: 0.51 sec
[junit] Running org.apache.poi.xssf.extractor.TestXSSFExcelExtractorUsingFactory
[junit] Tests run: 7, Failures: 0, Errors: 0, Skipped: 0, Time elapsed: 0.431 sec
[junit] Running org.apache.poi.xssf.extractor.TestXSSFExportToXML
[junit] Tests run: 13, Failures: 0, Errors: 0, Skipped: 0, Time elapsed: 0.354 sec
[junit] Running org.apache.poi.xssf.extractor.TestXSSFImportFromXML
[junit] Tests run: 3, Failures: 0, Errors: 0, Skipped: 0, Time elapsed: 0.224 sec
[junit] Running org.apache.poi.xssf.io.TestLoadSaveXSSF
[junit] Tests run: 3, Failures: 0, Errors: 0, Skipped: 0, Time elapsed: 0.043 sec
[junit] Running org.apache.poi.xssf.model.TestCalculationChain
[junit] Tests run: 1, Failures: 0, Errors: 0, Skipped: 0, Time elapsed: 0.439 sec
[junit] Running org.apache.poi.xssf.model.TestCommentsTable
[junit] Tests run: 7, Failures: 0, Errors: 0, Skipped: 0, Time elapsed: 0.167 sec
[junit] Running org.apache.poi.xssf.model.TestExternalLinksTable
[junit] Tests run: 4, Failures: 0, Errors: 0, Skipped: 0, Time elapsed: 0.066 sec
[junit] Running org.apache.poi.xssf.model.TestMapInfo
[junit] Tests run: 1, Failures: 0, Errors: 0, Skipped: 0, Time elapsed: 0.013 sec
[junit] Running org.apache.poi.xssf.model.TestSharedStringsTable
[junit] Tests run: 3, Failures: 0, Errors: 0, Skipped: 0, Time elapsed: 0.101 sec
[junit] Running org.apache.poi.xssf.model.TestStylesTable
[junit] Tests run: 6, Failures: 0, Errors: 0, Skipped: 0, Time elapsed: 0.117 sec
[junit] Running org.apache.poi.xssf.streaming.TestOutlining
[junit] Tests run: 2, Failures: 0, Errors: 0, Skipped: 0, Time elapsed: 0.022 sec
[junit] Running org.apache.poi.xssf.streaming.TestSXSSFCell
[junit] Tests run: 21, Failures: 0, Errors: 0, Skipped: 0, Time elapsed: 0.65 sec
[junit] Running org.apache.poi.xssf.streaming.TestSXSSFHyperlink
[junit] Tests run: 1, Failures: 0, Errors: 0, Skipped: 0, Time elapsed: 0.02 sec
[junit] Running org.apache.poi.xssf.streaming.TestSXSSFRow
[junit] Tests run: 10, Failures: 0, Errors: 0, Skipped: 0, Time elapsed: 0.262 sec
[junit] Running org.apache.poi.xssf.streaming.TestSXSSFSheet
[junit] Tests run: 32, Failures: 0, Errors: 0, Skipped: 0, Time elapsed: 0.192 sec
[junit] Running org.apache.poi.xssf.streaming.TestSXSSFWorkbook
[junit] Tests run: 19, Failures: 0, Errors: 0, Skipped: 0, Time elapsed: 0.861 sec
[junit] Running org.apache.poi.xssf.usermodel.TestFormulaEvaluatorOnXSSF
[junit] Tests run: 2, Failures: 0, Errors: 0, Skipped: 0, Time elapsed: 0.585 sec
[junit] Running org.apache.poi.xssf.usermodel.TestMissingWorkbookOnXSSF
[junit] Tests run: 3, Failures: 0, Errors: 0, Skipped: 0, Time elapsed: 0.034 sec
[junit] Running org.apache.poi.xssf.usermodel.TestMultiSheetFormulaEvaluatorOnXSSF
[junit] Tests run: 1, Failures: 0, Errors: 0, Skipped: 0, Time elapsed: 0.012 sec
[junit] Running org.apache.poi.xssf.usermodel.TestSheetHiding
[junit] Tests run: 5, Failures: 0, Errors: 0, Skipped: 0, Time elapsed: 0.086 sec
[junit] Running org.apache.poi.xssf.usermodel.TestXSSFBugs
[junit] Tests run: 69, Failures: 0, Errors: 0, Skipped: 2, Time elapsed: 3.407 sec
[junit] Running org.apache.poi.xssf.usermodel.TestXSSFCell
[junit] Tests run: 28, Failures: 0, Errors: 0, Skipped: 0, Time elapsed: 0.433 sec
[junit] Running org.apache.poi.xssf.usermodel.TestXSSFCellStyle
[junit] Tests run: 37, Failures: 0, Errors: 0, Skipped: 0, Time elapsed: 0.171 sec
[junit] Running org.apache.poi.xssf.usermodel.TestXSSFChart
[junit] Tests run: 3, Failures: 0, Errors: 0, Skipped: 0, Time elapsed: 0.134 sec
[junit] Running org.apache.poi.xssf.usermodel.TestXSSFChartSheet
[junit] Tests run: 3, Failures: 0, Errors: 0, Skipped: 0, Time elapsed: 0.035 sec
[junit] Running org.apache.poi.xssf.usermodel.TestXSSFColGrouping
[junit] Tests run: 6, Failures: 0, Errors: 0, Skipped: 0, Time elapsed: 0.065 sec
[junit] Running org.apache.poi.xssf.usermodel.TestXSSFColor
[junit] Tests run: 3, Failures: 0, Errors: 0, Skipped: 0, Time elapsed: 0.049 sec
[junit] Running org.apache.poi.xssf.usermodel.TestXSSFComment
[junit] Tests run: 11, Failures: 0, Errors: 0, Skipped: 0, Time elapsed: 0.111 sec
[junit] Running org.apache.poi.xssf.usermodel.TestXSSFConditionalFormatting
[junit] Tests run: 13, Failures: 0, Errors: 0, Skipped: 0, Time elapsed: 0.062 sec
[junit] Running org.apache.poi.xssf.usermodel.TestXSSFDataFormat
[junit] Tests run: 2, Failures: 0, Errors: 0, Skipped: 0, Time elapsed: 0.008 sec
[junit] Running org.apache.poi.xssf.usermodel.TestXSSFDataValidation
[junit] Tests run: 3, Failures: 0, Errors: 0, Skipped: 0, Time elapsed: 0.26 sec
[junit] Running org.apache.poi.xssf.usermodel.TestXSSFDialogSheet
[junit] Tests run: 14, Failures: 0, Errors: 0, Skipped: 0, Time elapsed: 0.024 sec
[junit] Running org.apache.poi.xssf.usermodel.TestXSSFDrawing
[junit] Tests run: 17, Failures: 0, Errors: 0, Skipped: 0, Time elapsed: 0.404 sec
[junit] Running org.apache.poi.xssf.usermodel.TestXSSFExternalFunctions
[junit] Tests run: 2, Failures: 0, Errors: 0, Skipped: 0, Time elapsed: 0.011 sec
[junit] Running org.apache.poi.xssf.usermodel.TestXSSFFont
[junit] Tests run: 19, Failures: 0, Errors: 0, Skipped: 0, Time elapsed: 0.049 sec
[junit] Running org.apache.poi.xssf.usermodel.TestXSSFFormulaEvaluation
[junit] Tests run: 15, Failures: 0, Errors: 0, Skipped: 0, Time elapsed: 0.274 sec
[junit] Running org.apache.poi.xssf.usermodel.TestXSSFFormulaParser
[junit] Tests run: 6, Failures: 0, Errors: 0, Skipped: 0, Time elapsed: 0.038 sec
[junit] Running org.apache.poi.xssf.usermodel.TestXSSFHeaderFooter
[junit] Tests run: 2, Failures: 0, Errors: 0, Skipped: 0, Time elapsed: 0.003 sec
[junit] Running org.apache.poi.xssf.usermodel.TestXSSFHyperlink
[junit] Tests run: 8, Failures: 0, Errors: 0, Skipped: 0, Time elapsed: 0.201 sec
[junit] Running org.apache.poi.xssf.usermodel.TestXSSFName
[junit] Tests run: 20, Failures: 0, Errors: 0, Skipped: 0, Time elapsed: 0.064 sec
[junit] Running org.apache.poi.xssf.usermodel.TestXSSFPicture
[junit] Tests run: 4, Failures: 0, Errors: 0, Skipped: 0, Time elapsed: 0.04 sec
[junit] Running org.apache.poi.xssf.usermodel.TestXSSFPictureData
[junit] Tests run: 3, Failures: 0, Errors: 0, Skipped: 0, Time elapsed: 0.085 sec
[junit] Running org.apache.poi.xssf.usermodel.TestXSSFPivotTable
[junit] Tests run: 10, Failures: 0, Errors: 0, Skipped: 0, Time elapsed: 0.101 sec
[junit] Running org.apache.poi.xssf.usermodel.TestXSSFPrintSetup
[junit] Tests run: 16, Failures: 0, Errors: 0, Skipped: 0, Time elapsed: 0.017 sec
[junit] Running org.apache.poi.xssf.usermodel.TestXSSFRichTextString
[junit] Tests run: 9, Failures: 0, Errors: 0, Skipped: 0, Time elapsed: 0.007 sec
[junit] Running org.apache.poi.xssf.usermodel.TestXSSFRow
[junit] Tests run: 10, Failures: 0, Errors: 0, Skipped: 0, Time elapsed: 2.522 sec
[junit] Running org.apache.poi.xssf.usermodel.TestXSSFSheet
[junit] Tests run: 62, Failures: 0, Errors: 0, Skipped: 0, Time elapsed: 19.54 sec
[junit] Running org.apache.poi.xssf.usermodel.TestXSSFSheetAutosizeColumn
[junit] Tests run: 7, Failures: 0, Errors: 0, Skipped: 0, Time elapsed: 0.048 sec
[junit] Running org.apache.poi.xssf.usermodel.TestXSSFSheetRowGrouping
[junit] Tests run: 6, Failures: 0, Errors: 0, Skipped: 0, Time elapsed: 0.198 sec
[junit] Running org.apache.poi.xssf.usermodel.TestXSSFSheetShiftRows
[junit] Tests run: 13, Failures: 0, Errors: 0, Skipped: 0, Time elapsed: 0.223 sec
[junit] Running org.apache.poi.xssf.usermodel.TestXSSFSheetUpdateArrayFormulas
[junit] Tests run: 16, Failures: 0, Errors: 0, Skipped: 0, Time elapsed: 0.03 sec
[junit] Running org.apache.poi.xssf.usermodel.TestXSSFTable
[junit] Tests run: 1, Failures: 0, Errors: 0, Skipped: 0, Time elapsed: 0.038 sec
[junit] Running org.apache.poi.xssf.usermodel.TestXSSFVMLDrawing
[junit] Tests run: 3, Failures: 0, Errors: 0, Skipped: 0, Time elapsed: 0.008 sec
[junit] Running org.apache.poi.xssf.usermodel.TestXSSFWorkbook
[junit] Tests run: 37, Failures: 0, Errors: 0, Skipped: 0, Time elapsed: 0.527 sec
[junit] Running org.apache.poi.xssf.usermodel.charts.TestXSSFCategoryAxis
[junit] Tests run: 1, Failures: 0, Errors: 0, Skipped: 0, Time elapsed: 0.042 sec
[junit] Running org.apache.poi.xssf.usermodel.charts.TestXSSFChartAxis
[junit] Tests run: 7, Failures: 0, Errors: 0, Skipped: 0, Time elapsed: 0.009 sec
[junit] Running org.apache.poi.xssf.usermodel.charts.TestXSSFChartLegend
[junit] Tests run: 3, Failures: 0, Errors: 0, Skipped: 0, Time elapsed: 0.009 sec
[junit] Running org.apache.poi.xssf.usermodel.charts.TestXSSFLineChartData
[junit] Tests run: 1, Failures: 0, Errors: 0, Skipped: 0, Time elapsed: 0.028 sec
[junit] Running org.apache.poi.xssf.usermodel.charts.TestXSSFManualLayout
[junit] Tests run: 2, Failures: 0, Errors: 0, Skipped: 0, Time elapsed: 0.018 sec
[junit] Running org.apache.poi.xssf.usermodel.charts.TestXSSFScatterChartData
[junit] Tests run: 1, Failures: 0, Errors: 0, Skipped: 0, Time elapsed: 0.017 sec
[junit] Running org.apache.poi.xssf.usermodel.charts.TestXSSFValueAxis
[junit] Tests run: 1, Failures: 0, Errors: 0, Skipped: 0, Time elapsed: 0.003 sec
[junit] Running org.apache.poi.xssf.usermodel.extensions.TestXSSFBorder
[junit] Tests run: 1, Failures: 0, Errors: 0, Skipped: 0, Time elapsed: 0.002 sec
[junit] Running org.apache.poi.xssf.usermodel.extensions.TestXSSFCellFill
[junit] Tests run: 5, Failures: 0, Errors: 0, Skipped: 0, Time elapsed: 0.009 sec
[junit] Running org.apache.poi.xssf.usermodel.extensions.TestXSSFSheetComments
[junit] Tests run: 1, Failures: 0, Errors: 0, Skipped: 0, Time elapsed: 0.001 sec
[junit] Running org.apache.poi.xssf.usermodel.helpers.TestColumnHelper
[junit] Tests run: 8, Failures: 0, Errors: 0, Skipped: 0, Time elapsed: 0.027 sec
[junit] Running org.apache.poi.xssf.usermodel.helpers.TestHeaderFooterHelper
[junit] Tests run: 2, Failures: 0, Errors: 0, Skipped: 0, Time elapsed: 0.001 sec
[junit] Running org.apache.poi.xssf.util.TestCTColComparator
[junit] Tests run: 2, Failures: 0, Errors: 0, Skipped: 0, Time elapsed: 0.001 sec
[junit] Running org.apache.poi.xssf.util.TestEvilUnclosedBRFixingInputStream
[junit] Tests run: 3, Failures: 0, Errors: 0, Skipped: 0, Time elapsed: 0.004 sec
[junit] Running org.apache.poi.xssf.util.TestNumericRanges
[junit] Tests run: 2, Failures: 0, Errors: 0, Skipped: 0, Time elapsed: 0.002 sec
[junit] Running org.apache.poi.xwpf.TestAllExtendedProperties
[junit] Tests run: 1, Failures: 0, Errors: 0, Skipped: 0, Time elapsed: 0.038 sec
[junit] Running org.apache.poi.xwpf.TestDocumentProtection
[junit] Tests run: 10, Failures: 0, Errors: 0, Skipped: 0, Time elapsed: 1.192 sec
[junit] Running org.apache.poi.xwpf.TestPackageCorePropertiesGetKeywords
[junit] Tests run: 1, Failures: 0, Errors: 0, Skipped: 0, Time elapsed: 0.02 sec
[junit] Running org.apache.poi.xwpf.TestXWPFBugs
[junit] Tests run: 2, Failures: 0, Errors: 0, Skipped: 1, Time elapsed: 0.041 sec
[junit] Running org.apache.poi.xwpf.extractor.TestXWPFWordExtractor
[junit] Tests run: 17, Failures: 0, Errors: 0, Skipped: 0, Time elapsed: 0.652 sec
[junit] Running org.apache.poi.xwpf.model.TestXWPFDecorators
[junit] Tests run: 2, Failures: 0, Errors: 0, Skipped: 0, Time elapsed: 0.098 sec
[junit] Running org.apache.poi.xwpf.model.TestXWPFHeaderFooterPolicy
[junit] Tests run: 2, Failures: 0, Errors: 0, Skipped: 0, Time elapsed: 0.113 sec
[junit] Running org.apache.poi.xwpf.usermodel.TestChangeTracking
[junit] Tests run: 3, Failures: 0, Errors: 0, Skipped: 0, Time elapsed: 0.024 sec
[junit] Running org.apache.poi.xwpf.usermodel.TestXWPFBugs
[junit] Tests run: 1, Failures: 0, Errors: 0, Skipped: 0, Time elapsed: 0.011 sec
[junit] Running org.apache.poi.xwpf.usermodel.TestXWPFDocument
[junit] Tests run: 17, Failures: 0, Errors: 0, Skipped: 0, Time elapsed: 0.287 sec
[junit] Running org.apache.poi.xwpf.usermodel.TestXWPFFootnotes
[junit] Tests run: 2, Failures: 0, Errors: 0, Skipped: 0, Time elapsed: 0.027 sec
[junit] Running org.apache.poi.xwpf.usermodel.TestXWPFHeader
[junit] Tests run: 8, Failures: 0, Errors: 0, Skipped: 0, Time elapsed: 0.09 sec
[junit] Running org.apache.poi.xwpf.usermodel.TestXWPFHeadings
[junit] Tests run: 1, Failures: 0, Errors: 0, Skipped: 0, Time elapsed: 0.046 sec
[junit] Running org.apache.poi.xwpf.usermodel.TestXWPFNumbering
[junit] Tests run: 4, Failures: 0, Errors: 0, Skipped: 0, Time elapsed: 0.04 sec
[junit] Running org.apache.poi.xwpf.usermodel.TestXWPFParagraph
[junit] Tests run: 13, Failures: 0, Errors: 0, Skipped: 0, Time elapsed: 0.075 sec
[junit] Running org.apache.poi.xwpf.usermodel.TestXWPFPictureData
[junit] Tests run: 4, Failures: 0, Errors: 0, Skipped: 0, Time elapsed: 0.264 sec
[junit] Running org.apache.poi.xwpf.usermodel.TestXWPFRun
[junit] Tests run: 17, Failures: 0, Errors: 0, Skipped: 0, Time elapsed: 0.078 sec
[junit] Running org.apache.poi.xwpf.usermodel.TestXWPFSDT
[junit] Tests run: 4, Failures: 0, Errors: 0, Skipped: 0, Time elapsed: 0.078 sec
[junit] Running org.apache.poi.xwpf.usermodel.TestXWPFSmartTag
[junit] Tests run: 1, Failures: 0, Errors: 0, Skipped: 0, Time elapsed: 0.007 sec
[junit] Running org.apache.poi.xwpf.usermodel.TestXWPFStyles
[junit] Tests run: 6, Failures: 0, Errors: 0, Skipped: 0, Time elapsed: 0.062 sec
[junit] Running org.apache.poi.xwpf.usermodel.TestXWPFTable
[junit] Tests run: 11, Failures: 0, Errors: 0, Skipped: 0, Time elapsed: 0.04 sec
[junit] Running org.apache.poi.xwpf.usermodel.TestXWPFTableCell
[junit] Tests run: 3, Failures: 0, Errors: 0, Skipped: 0, Time elapsed: 0.021 sec
[junit] Running org.apache.poi.xwpf.usermodel.TestXWPFTableRow
[junit] Tests run: 3, Failures: 0, Errors: 0, Skipped: 0, Time elapsed: 0.004 sec
testcoveragereport:
[mkdir] Created dir: <https://builds.apache.org/job/POI/386/artifact/build/coverage>
[jacoco:report] Loading execution data file <https://builds.apache.org/job/POI/ws/build/jacoco-excelant.exec>
[jacoco:report] Loading execution data file <https://builds.apache.org/job/POI/ws/build/jacoco-main.exec>
[jacoco:report] Loading execution data file <https://builds.apache.org/job/POI/ws/build/jacoco-ooxml-lite.exec>
[jacoco:report] Loading execution data file <https://builds.apache.org/job/POI/ws/build/jacoco-ooxml.exec>
[jacoco:report] Loading execution data file <https://builds.apache.org/job/POI/ws/build/jacoco-scratchpad.exec>
[jacoco:report] Writing bundle 'Main' with 1206 classes
BUILD FAILED
<https://builds.apache.org/job/POI/ws/build.xml>:730: Error while creating report
Total time: 6 minutes 29 seconds
Build step 'Invoke Ant' marked build as failure
[WARNINGS] Skipping publisher since build result is FAILURE
Archiving artifacts
Sending artifact delta relative to POI #384
Archived 2176 artifacts
Archive block size is 32768
Received 22 blocks and 23924508 bytes
Compression is 2.9%
Took 27 sec
Recording test results
---------------------------------------------------------------------
To unsubscribe, e-mail: dev-unsubscribe@poi.apache.org
For additional commands, e-mail: dev-help@poi.apache.org