You are viewing a plain text version of this content. The canonical link for it is here.
Posted to builds@beam.apache.org by Apache Jenkins Server <je...@builds.apache.org> on 2023/04/07 11:11:14 UTC
Build failed in Jenkins: beam_PostCommit_Python38 #3947
See <https://ci-beam.apache.org/job/beam_PostCommit_Python38/3947/display/redirect>
Changes:
------------------------------------------
[...truncated 1012.31 KB...]
../../build/gradleenv/-1734967051/lib/python3.8/site-packages/google/rpc/__init__.py:20
../../build/gradleenv/-1734967051/lib/python3.8/site-packages/google/rpc/__init__.py:20
<https://ci-beam.apache.org/job/beam_PostCommit_Python38/ws/src/build/gradleenv/-1734967051/lib/python3.8/site-packages/google/rpc/__init__.py>:20: DeprecationWarning: Deprecated call to `pkg_resources.declare_namespace('google.rpc')`.
Implementing implicit namespace packages (as specified in PEP 420) is preferred to `pkg_resources.declare_namespace`. See https://setuptools.pypa.io/en/latest/references/keywords.html#keyword-namespace-packages
pkg_resources.declare_namespace(__name__)
apache_beam/typehints/pandas_type_compatibility_test.py:67
apache_beam/typehints/pandas_type_compatibility_test.py:67
apache_beam/typehints/pandas_type_compatibility_test.py:67
apache_beam/typehints/pandas_type_compatibility_test.py:67
apache_beam/typehints/pandas_type_compatibility_test.py:67
apache_beam/typehints/pandas_type_compatibility_test.py:67
apache_beam/typehints/pandas_type_compatibility_test.py:67
apache_beam/typehints/pandas_type_compatibility_test.py:67
<https://ci-beam.apache.org/job/beam_PostCommit_Python38/ws/src/sdks/python/apache_beam/typehints/pandas_type_compatibility_test.py>:67: FutureWarning: pandas.Int64Index is deprecated and will be removed from pandas in a future version. Use pandas.Index with the appropriate dtype instead.
}).set_index(pd.Int64Index(range(123, 223), name='an_index')),
apache_beam/typehints/pandas_type_compatibility_test.py:90
apache_beam/typehints/pandas_type_compatibility_test.py:90
apache_beam/typehints/pandas_type_compatibility_test.py:90
apache_beam/typehints/pandas_type_compatibility_test.py:90
apache_beam/typehints/pandas_type_compatibility_test.py:90
apache_beam/typehints/pandas_type_compatibility_test.py:90
apache_beam/typehints/pandas_type_compatibility_test.py:90
apache_beam/typehints/pandas_type_compatibility_test.py:90
<https://ci-beam.apache.org/job/beam_PostCommit_Python38/ws/src/sdks/python/apache_beam/typehints/pandas_type_compatibility_test.py>:90: FutureWarning: pandas.Int64Index is deprecated and will be removed from pandas in a future version. Use pandas.Index with the appropriate dtype instead.
pd.Int64Index(range(123, 223), name='an_index'),
apache_beam/typehints/pandas_type_compatibility_test.py:91
apache_beam/typehints/pandas_type_compatibility_test.py:91
apache_beam/typehints/pandas_type_compatibility_test.py:91
apache_beam/typehints/pandas_type_compatibility_test.py:91
apache_beam/typehints/pandas_type_compatibility_test.py:91
apache_beam/typehints/pandas_type_compatibility_test.py:91
apache_beam/typehints/pandas_type_compatibility_test.py:91
apache_beam/typehints/pandas_type_compatibility_test.py:91
<https://ci-beam.apache.org/job/beam_PostCommit_Python38/ws/src/sdks/python/apache_beam/typehints/pandas_type_compatibility_test.py>:91: FutureWarning: pandas.Int64Index is deprecated and will be removed from pandas in a future version. Use pandas.Index with the appropriate dtype instead.
pd.Int64Index(range(475, 575), name='another_index'),
apache_beam/dataframe/io_it_test.py: 3 warnings
apache_beam/examples/cookbook/bigquery_tornadoes_it_test.py: 1 warning
apache_beam/examples/dataframe/flight_delays_it_test.py: 1 warning
apache_beam/io/gcp/bigquery_io_read_it_test.py: 2 warnings
apache_beam/io/gcp/big_query_query_to_table_it_test.py: 4 warnings
apache_beam/io/gcp/bigquery_read_it_test.py: 7 warnings
apache_beam/io/gcp/bigquery_json_it_test.py: 3 warnings
<https://ci-beam.apache.org/job/beam_PostCommit_Python38/ws/src/sdks/python/apache_beam/io/gcp/bigquery.py>:2665: BeamDeprecationWarning: options is deprecated since First stable release. References to <pipeline>.options will not be supported
temp_location = pcoll.pipeline.options.view_as(
apache_beam/dataframe/io_it_test.py: 3 warnings
apache_beam/examples/cookbook/bigquery_tornadoes_it_test.py: 1 warning
apache_beam/examples/dataframe/flight_delays_it_test.py: 1 warning
apache_beam/io/gcp/bigquery_io_read_it_test.py: 2 warnings
apache_beam/io/gcp/big_query_query_to_table_it_test.py: 4 warnings
apache_beam/io/gcp/bigquery_read_it_test.py: 7 warnings
apache_beam/io/gcp/bigquery_json_it_test.py: 3 warnings
<https://ci-beam.apache.org/job/beam_PostCommit_Python38/ws/src/sdks/python/apache_beam/io/gcp/bigquery.py>:2667: BeamDeprecationWarning: options is deprecated since First stable release. References to <pipeline>.options will not be supported
job_name = pcoll.pipeline.options.view_as(GoogleCloudOptions).job_name
apache_beam/dataframe/io_it_test.py: 3 warnings
apache_beam/examples/cookbook/bigquery_tornadoes_it_test.py: 1 warning
apache_beam/examples/dataframe/flight_delays_it_test.py: 1 warning
apache_beam/io/gcp/bigquery_io_read_it_test.py: 2 warnings
apache_beam/io/gcp/big_query_query_to_table_it_test.py: 4 warnings
apache_beam/io/gcp/bigquery_read_it_test.py: 7 warnings
apache_beam/io/gcp/bigquery_json_it_test.py: 3 warnings
<https://ci-beam.apache.org/job/beam_PostCommit_Python38/ws/src/sdks/python/apache_beam/io/gcp/bigquery.py>:2691: BeamDeprecationWarning: options is deprecated since First stable release. References to <pipeline>.options will not be supported
pipeline_options=pcoll.pipeline.options,
apache_beam/dataframe/io_it_test.py: 2 warnings
apache_beam/io/gcp/bigquery_json_it_test.py: 1 warning
apache_beam/io/gcp/bigquery_read_it_test.py: 9 warnings
<https://ci-beam.apache.org/job/beam_PostCommit_Python38/ws/src/sdks/python/apache_beam/io/gcp/bigquery.py>:2709: BeamDeprecationWarning: options is deprecated since First stable release. References to <pipeline>.options will not be supported
project_id = pcoll.pipeline.options.view_as(GoogleCloudOptions).project
apache_beam/dataframe/io_it_test.py: 2 warnings
apache_beam/io/gcp/bigquery_json_it_test.py: 1 warning
apache_beam/io/gcp/bigquery_read_it_test.py: 9 warnings
<https://ci-beam.apache.org/job/beam_PostCommit_Python38/ws/src/sdks/python/apache_beam/io/gcp/bigquery.py>:2730: BeamDeprecationWarning: options is deprecated since First stable release. References to <pipeline>.options will not be supported
pipeline_options=pcoll.pipeline.options,
apache_beam/examples/cookbook/bigquery_tornadoes_it_test.py: 1 warning
apache_beam/io/gcp/big_query_query_to_table_it_test.py: 4 warnings
apache_beam/io/gcp/bigquery_write_it_test.py: 4 warnings
apache_beam/io/gcp/bigquery_test.py: 2 warnings
<https://ci-beam.apache.org/job/beam_PostCommit_Python38/ws/src/sdks/python/apache_beam/io/gcp/bigquery.py>:2026: BeamDeprecationWarning: options is deprecated since First stable release. References to <pipeline>.options will not be supported
self.table_reference.projectId = pcoll.pipeline.options.view_as(
apache_beam/examples/cookbook/bigquery_tornadoes_it_test.py: 1 warning
apache_beam/examples/complete/game/game_stats_it_test.py: 2 warnings
apache_beam/examples/complete/game/hourly_team_score_it_test.py: 1 warning
apache_beam/examples/complete/game/leader_board_it_test.py: 2 warnings
apache_beam/io/gcp/big_query_query_to_table_it_test.py: 4 warnings
apache_beam/io/gcp/bigquery_test.py: 6 warnings
apache_beam/io/gcp/bigquery_json_it_test.py: 2 warnings
apache_beam/io/gcp/bigquery_file_loads_test.py: 3 warnings
apache_beam/io/gcp/bigquery_write_it_test.py: 4 warnings
<https://ci-beam.apache.org/job/beam_PostCommit_Python38/ws/src/sdks/python/apache_beam/io/gcp/bigquery.py>:2030: BeamDeprecationWarning: options is deprecated since First stable release. References to <pipeline>.options will not be supported
is_streaming_pipeline = p.options.view_as(StandardOptions).streaming
apache_beam/examples/cookbook/bigquery_tornadoes_it_test.py: 1 warning
apache_beam/examples/complete/game/game_stats_it_test.py: 2 warnings
apache_beam/examples/complete/game/hourly_team_score_it_test.py: 1 warning
apache_beam/examples/complete/game/leader_board_it_test.py: 2 warnings
apache_beam/io/gcp/big_query_query_to_table_it_test.py: 4 warnings
apache_beam/io/gcp/bigquery_test.py: 6 warnings
apache_beam/io/gcp/bigquery_json_it_test.py: 2 warnings
apache_beam/io/gcp/bigquery_file_loads_test.py: 3 warnings
apache_beam/io/gcp/bigquery_write_it_test.py: 4 warnings
<https://ci-beam.apache.org/job/beam_PostCommit_Python38/ws/src/sdks/python/apache_beam/io/gcp/bigquery.py>:2036: BeamDeprecationWarning: options is deprecated since First stable release. References to <pipeline>.options will not be supported
experiments = p.options.view_as(DebugOptions).experiments or []
apache_beam/examples/cookbook/bigquery_tornadoes_it_test.py: 1 warning
apache_beam/io/gcp/big_query_query_to_table_it_test.py: 4 warnings
apache_beam/io/gcp/bigquery_file_loads_test.py: 3 warnings
apache_beam/io/gcp/bigquery_test.py: 3 warnings
apache_beam/io/gcp/bigquery_write_it_test.py: 3 warnings
<https://ci-beam.apache.org/job/beam_PostCommit_Python38/ws/src/sdks/python/apache_beam/io/gcp/bigquery_file_loads.py>:1166: BeamDeprecationWarning: options is deprecated since First stable release. References to <pipeline>.options will not be supported
self.project = self.project or p.options.view_as(GoogleCloudOptions).project
apache_beam/examples/cookbook/bigquery_tornadoes_it_test.py: 1 warning
apache_beam/examples/complete/game/hourly_team_score_it_test.py: 1 warning
apache_beam/io/gcp/big_query_query_to_table_it_test.py: 4 warnings
apache_beam/io/gcp/bigquery_file_loads_test.py: 3 warnings
apache_beam/io/gcp/bigquery_test.py: 3 warnings
apache_beam/io/gcp/bigquery_write_it_test.py: 3 warnings
<https://ci-beam.apache.org/job/beam_PostCommit_Python38/ws/src/sdks/python/apache_beam/io/gcp/bigquery_file_loads.py>:1173: BeamDeprecationWarning: options is deprecated since First stable release. References to <pipeline>.options will not be supported
temp_location = p.options.view_as(GoogleCloudOptions).temp_location
apache_beam/examples/cookbook/bigquery_tornadoes_it_test.py: 1 warning
apache_beam/examples/complete/game/hourly_team_score_it_test.py: 1 warning
apache_beam/io/gcp/big_query_query_to_table_it_test.py: 4 warnings
apache_beam/io/gcp/bigquery_file_loads_test.py: 3 warnings
apache_beam/io/gcp/bigquery_test.py: 3 warnings
apache_beam/io/gcp/bigquery_write_it_test.py: 3 warnings
<https://ci-beam.apache.org/job/beam_PostCommit_Python38/ws/src/sdks/python/apache_beam/io/gcp/bigquery_file_loads.py>:1175: BeamDeprecationWarning: options is deprecated since First stable release. References to <pipeline>.options will not be supported
p.options.view_as(GoogleCloudOptions).job_name or 'AUTOMATIC_JOB_NAME')
apache_beam/examples/cookbook/bigquery_tornadoes_it_test.py::BigqueryTornadoesIT::test_bigquery_tornadoes_it
<https://ci-beam.apache.org/job/beam_PostCommit_Python38/ws/src/sdks/python/apache_beam/io/gcp/tests/utils.py>:100: PendingDeprecationWarning: Client.dataset is deprecated and will be removed in a future version. Use a string like 'my_project.my_dataset' or a cloud.google.bigquery.DatasetReference object, instead.
table_ref = client.dataset(dataset_id).table(table_id)
apache_beam/examples/complete/game/game_stats_it_test.py::GameStatsIT::test_game_stats_it
apache_beam/examples/complete/game/hourly_team_score_it_test.py::HourlyTeamScoreIT::test_hourly_team_score_it
apache_beam/examples/complete/game/leader_board_it_test.py::LeaderBoardIT::test_leader_board_it
apache_beam/io/gcp/bigquery_test.py::PubSubBigQueryIT::test_file_loads
apache_beam/io/gcp/bigquery_test.py::PubSubBigQueryIT::test_streaming_inserts
<https://ci-beam.apache.org/job/beam_PostCommit_Python38/ws/src/sdks/python/apache_beam/io/gcp/tests/utils.py>:63: PendingDeprecationWarning: Client.dataset is deprecated and will be removed in a future version. Use a string like 'my_project.my_dataset' or a cloud.google.bigquery.DatasetReference object, instead.
dataset_ref = client.dataset(unique_dataset_name, project=project)
apache_beam/examples/dataframe/flight_delays_it_test.py::FlightDelaysTest::test_flight_delays
<https://ci-beam.apache.org/job/beam_PostCommit_Python38/ws/src/sdks/python/apache_beam/examples/dataframe/flight_delays.py>:47: FutureWarning: The default value of numeric_only in DataFrame.mean is deprecated. In a future version, it will default to False. In addition, specifying 'numeric_only=None' is deprecated. Select only valid columns or specify the value of numeric_only to silence this warning.
return airline_df[at_top_airports].mean()
apache_beam/examples/dataframe/flight_delays_it_test.py::FlightDelaysTest::test_flight_delays
apache_beam/examples/dataframe/taxiride_it_test.py::TaxirideIT::test_aggregation
apache_beam/examples/dataframe/taxiride_it_test.py::TaxirideIT::test_enrich
<https://ci-beam.apache.org/job/beam_PostCommit_Python38/ws/src/sdks/python/apache_beam/dataframe/io.py>:659: FutureWarning: WriteToFiles is experimental.
return pcoll | fileio.WriteToFiles(
apache_beam/examples/dataframe/flight_delays_it_test.py::FlightDelaysTest::test_flight_delays
apache_beam/examples/dataframe/taxiride_it_test.py::TaxirideIT::test_aggregation
apache_beam/examples/dataframe/taxiride_it_test.py::TaxirideIT::test_enrich
<https://ci-beam.apache.org/job/beam_PostCommit_Python38/ws/src/sdks/python/apache_beam/io/fileio.py>:596: BeamDeprecationWarning: options is deprecated since First stable release. References to <pipeline>.options will not be supported
p.options.view_as(GoogleCloudOptions).temp_location or
apache_beam/io/gcp/bigquery_test.py::BigQueryStreamingInsertTransformIntegrationTests::test_multiple_destinations_transform
<https://ci-beam.apache.org/job/beam_PostCommit_Python38/ws/src/sdks/python/apache_beam/io/gcp/bigquery_test.py>:1694: BeamDeprecationWarning: options is deprecated since First stable release. References to <pipeline>.options will not be supported
streaming = self.test_pipeline.options.view_as(StandardOptions).streaming
apache_beam/io/gcp/bigquery_read_it_test.py::ReadTests::test_native_source
<https://ci-beam.apache.org/job/beam_PostCommit_Python38/ws/src/sdks/python/apache_beam/io/gcp/bigquery_read_it_test.py>:170: BeamDeprecationWarning: BigQuerySource is deprecated since 2.25.0. Use ReadFromBigQuery instead.
beam.io.BigQuerySource(query=self.query, use_standard_sql=True)))
apache_beam/ml/gcp/cloud_dlp_it_test.py::CloudDLPIT::test_deidentification
<https://ci-beam.apache.org/job/beam_PostCommit_Python38/ws/src/sdks/python/apache_beam/ml/gcp/cloud_dlp_it_test.py>:74: FutureWarning: MaskDetectedDetails is experimental.
| MaskDetectedDetails(
apache_beam/ml/gcp/cloud_dlp_it_test.py::CloudDLPIT::test_inspection
<https://ci-beam.apache.org/job/beam_PostCommit_Python38/ws/src/sdks/python/apache_beam/ml/gcp/cloud_dlp_it_test.py>:85: FutureWarning: InspectForDetails is experimental.
| InspectForDetails(
apache_beam/ml/inference/sklearn_inference_it_test.py::SklearnInference::test_sklearn_regression
<https://ci-beam.apache.org/job/beam_PostCommit_Python38/ws/src/sdks/python/apache_beam/examples/inference/sklearn_japanese_housing_regression.py>:129: FutureWarning: SklearnModelHandlerPandas is experimental. No backwards-compatibility guarantees.
model_loader = SklearnModelHandlerPandas(
apache_beam/ml/inference/sklearn_inference_it_test.py::SklearnInference::test_sklearn_regression
<https://ci-beam.apache.org/job/beam_PostCommit_Python38/ws/src/build/gradleenv/-1734967051/lib/python3.8/site-packages/dill/_dill.py>:472: FutureWarning: SklearnModelHandlerPandas is experimental. No backwards-compatibility guarantees.
obj = StockUnpickler.load(self)
apache_beam/io/gcp/bigquery_read_it_test.py::ReadNewTypesTests::test_native_source
<https://ci-beam.apache.org/job/beam_PostCommit_Python38/ws/src/sdks/python/apache_beam/io/gcp/bigquery_read_it_test.py>:693: BeamDeprecationWarning: BigQuerySource is deprecated since 2.25.0. Use ReadFromBigQuery instead.
beam.io.BigQuerySource(query=self.query, use_standard_sql=True)))
apache_beam/io/gcp/bigquery_read_it_test.py::ReadAllBQTests::test_read_queries
<https://ci-beam.apache.org/job/beam_PostCommit_Python38/ws/src/sdks/python/apache_beam/io/gcp/bigquery_read_it_test.py>:808: FutureWarning: ReadAllFromBigQuery is experimental.
| beam.io.ReadAllFromBigQuery())
apache_beam/io/gcp/bigquery_read_it_test.py::ReadAllBQTests::test_read_queries
<https://ci-beam.apache.org/job/beam_PostCommit_Python38/ws/src/sdks/python/apache_beam/io/gcp/bigquery.py>:2838: BeamDeprecationWarning: options is deprecated since First stable release. References to <pipeline>.options will not be supported
job_name = pcoll.pipeline.options.view_as(GoogleCloudOptions).job_name
apache_beam/io/gcp/bigquery_read_it_test.py::ReadAllBQTests::test_read_queries
<https://ci-beam.apache.org/job/beam_PostCommit_Python38/ws/src/sdks/python/apache_beam/io/gcp/bigquery.py>:2839: BeamDeprecationWarning: options is deprecated since First stable release. References to <pipeline>.options will not be supported
project = pcoll.pipeline.options.view_as(GoogleCloudOptions).project
apache_beam/io/gcp/bigquery_read_it_test.py::ReadAllBQTests::test_read_queries
<https://ci-beam.apache.org/job/beam_PostCommit_Python38/ws/src/sdks/python/apache_beam/io/gcp/bigquery.py>:2852: BeamDeprecationWarning: options is deprecated since First stable release. References to <pipeline>.options will not be supported
options=pcoll.pipeline.options,
-- Docs: https://docs.pytest.org/en/stable/how-to/capture-warnings.html
- generated xml file: <https://ci-beam.apache.org/job/beam_PostCommit_Python38/ws/src/sdks/python/pytest_postCommitIT-df-py38.xml> -
[33m========== [32m83 passed[0m, [33m[1m39 skipped[0m, [33m[1m600 warnings[0m[33m in 8622.75s (2:23:42)[0m[33m ===========[0m
FAILURE: Build failed with an exception.
* What went wrong:
Execution failed for task ':sdks:java:container:generateLicenseReport'.
> Could not resolve all dependencies for configuration ':sdks:java:harness:testCompileClasspath'.
> Could not resolve junit:junit-dep:[4.9,).
Required by:
project :sdks:java:harness > project :sdks:java:fn-execution > com.github.stefanbirkner:system-rules:1.19.0
> Failed to list versions for junit:junit-dep.
> Unable to load Maven meta-data from https://oss.sonatype.org/content/repositories/staging/junit/junit-dep/maven-metadata.xml.
> Could not HEAD 'https://oss.sonatype.org/content/repositories/staging/junit/junit-dep/maven-metadata.xml'. Received status code 504 from server: Gateway Time-out
* Try:
> Run with --stacktrace option to get the stack trace.
> Run with --info or --debug option to get more log output.
* Get more help at https://help.gradle.org
Deprecated Gradle features were used in this build, making it incompatible with Gradle 8.0.
You can use '--warning-mode all' to show the individual deprecation warnings and determine if they come from your own scripts or plugins.
See https://docs.gradle.org/7.5.1/userguide/command_line_interface.html#sec:command_line_warnings
Execution optimizations have been disabled for 1 invalid unit(s) of work during this build to ensure correctness.
Please consult deprecation warnings for more details.
BUILD FAILED in 2h 55m 43s
209 actionable tasks: 144 executed, 59 from cache, 6 up-to-date
Publishing build scan...
https://gradle.com/s/yjw363yxwxhke
Build step 'Invoke Gradle script' changed build result to FAILURE
Build step 'Invoke Gradle script' marked build as failure
---------------------------------------------------------------------
To unsubscribe, e-mail: builds-unsubscribe@beam.apache.org
For additional commands, e-mail: builds-help@beam.apache.org
Jenkins build is back to normal : beam_PostCommit_Python38 #3949
Posted by Apache Jenkins Server <je...@builds.apache.org>.
See <https://ci-beam.apache.org/job/beam_PostCommit_Python38/3949/display/redirect>
---------------------------------------------------------------------
To unsubscribe, e-mail: builds-unsubscribe@beam.apache.org
For additional commands, e-mail: builds-help@beam.apache.org
Build failed in Jenkins: beam_PostCommit_Python38 #3948
Posted by Apache Jenkins Server <je...@builds.apache.org>.
See <https://ci-beam.apache.org/job/beam_PostCommit_Python38/3948/display/redirect?page=changes>
Changes:
[noreply] Auto model updates notebook (#26048)
------------------------------------------
Started by timer
Running as SYSTEM
[EnvInject] - Loading node environment variables.
Building remotely on apache-beam-jenkins-9 (beam) in workspace <https://ci-beam.apache.org/job/beam_PostCommit_Python38/ws/>
The recommended git tool is: NONE
No credentials specified
Wiping out workspace first.
Cloning the remote Git repository
Using shallow clone with depth 1
Avoid fetching tags
Cloning repository https://github.com/apache/beam.git
> git init <https://ci-beam.apache.org/job/beam_PostCommit_Python38/ws/src> # timeout=10
Fetching upstream changes from https://github.com/apache/beam.git
> git --version # timeout=10
> git --version # 'git version 2.25.1'
> git fetch --no-tags --force --progress --depth=1 -- https://github.com/apache/beam.git +refs/heads/*:refs/remotes/origin/* # timeout=10
> git config remote.origin.url https://github.com/apache/beam.git # timeout=10
> git config --add remote.origin.fetch +refs/heads/*:refs/remotes/origin/* # timeout=10
> git config remote.origin.url https://github.com/apache/beam.git # timeout=10
Using shallow fetch with depth 1
Fetching upstream changes from https://github.com/apache/beam.git
> git fetch --no-tags --force --progress --depth=1 -- https://github.com/apache/beam.git +refs/heads/*:refs/remotes/origin/* +refs/pull/${ghprbPullId}/*:refs/remotes/origin/pr/${ghprbPullId}/* # timeout=10
> git rev-parse origin/master^{commit} # timeout=10
Checking out Revision 1a52deb9b9c0ac38aae1ebe8f085359149ac42c3 (origin/master)
> git config core.sparsecheckout # timeout=10
> git checkout -f 1a52deb9b9c0ac38aae1ebe8f085359149ac42c3 # timeout=10
Commit message: "Auto model updates notebook (#26048)"
> git rev-list --no-walk 77b7b4ef82416683377bfa8bd09239ce002d7246 # timeout=10
No emails were triggered.
[EnvInject] - Executing scripts and injecting environment variables after the SCM step.
[EnvInject] - Injecting as environment variables the properties content
SETUPTOOLS_USE_DISTUTILS=stdlib
SPARK_LOCAL_IP=127.0.0.1
[EnvInject] - Variables injected successfully.
[Gradle] - Launching build.
[src] $ <https://ci-beam.apache.org/job/beam_PostCommit_Python38/ws/src/gradlew> --continue --max-workers=8 -Dorg.gradle.jvmargs=-Xms2g -Dorg.gradle.jvmargs=-Xmx6g -Dorg.gradle.vfs.watch=false -Pdocker-pull-licenses -PuseWheelDistribution :python38PostCommit
To honour the JVM settings for this build a single-use Daemon process will be forked. See https://docs.gradle.org/7.5.1/userguide/gradle_daemon.html#sec:disabling_the_daemon.
FAILURE: Build failed with an exception.
* What went wrong:
Unable to start the daemon process.
This problem might be caused by incorrect configuration of the daemon.
For example, an unrecognized jvm option is used.
Please refer to the User Manual chapter on the daemon at https://docs.gradle.org/7.5.1/userguide/gradle_daemon.html
Process command line: /usr/lib/jvm/java-8-openjdk-amd64/bin/java -Xmx6g -Dfile.encoding=UTF-8 -Duser.country=US -Duser.language=en -Duser.variant -cp /home/jenkins/.gradle/wrapper/dists/gradle-7.5.1-bin/7jzzequgds1hbszbhq3npc5ng/gradle-7.5.1/lib/gradle-launcher-7.5.1.jar org.gradle.launcher.daemon.bootstrap.GradleDaemon 7.5.1
Please read the following process output to find out more:
-----------------------
FAILURE: Build failed with an exception.
* What went wrong:
Timeout waiting to lock daemon addresses registry. It is currently in use by another Gradle instance.
Owner PID: 1065572
Our PID: 1476287
Owner Operation:
Our operation:
Lock file: /home/jenkins/.gradle/daemon/7.5.1/registry.bin.lock
* Try:
> Run with --info or --debug option to get more log output.
> Run with --scan to get full insights.
* Exception is:
org.gradle.cache.LockTimeoutException: Timeout waiting to lock daemon addresses registry. It is currently in use by another Gradle instance.
Owner PID: 1065572
Our PID: 1476287
Owner Operation:
Our operation:
Lock file: /home/jenkins/.gradle/daemon/7.5.1/registry.bin.lock
at org.gradle.cache.internal.DefaultFileLockManager$DefaultFileLock.timeoutException(DefaultFileLockManager.java:344)
at org.gradle.cache.internal.DefaultFileLockManager$DefaultFileLock.lock(DefaultFileLockManager.java:305)
at org.gradle.cache.internal.DefaultFileLockManager$DefaultFileLock.<init>(DefaultFileLockManager.java:164)
at org.gradle.cache.internal.DefaultFileLockManager.lock(DefaultFileLockManager.java:110)
at org.gradle.cache.internal.DefaultFileLockManager.lock(DefaultFileLockManager.java:96)
at org.gradle.cache.internal.DefaultFileLockManager.lock(DefaultFileLockManager.java:91)
at org.gradle.cache.internal.OnDemandFileAccess.updateFile(OnDemandFileAccess.java:51)
at org.gradle.cache.internal.SimpleStateCache.update(SimpleStateCache.java:87)
at org.gradle.cache.internal.FileIntegrityViolationSuppressingPersistentStateCacheDecorator$1.create(FileIntegrityViolationSuppressingPersistentStateCacheDecorator.java:50)
at org.gradle.cache.internal.FileIntegrityViolationSuppressingPersistentStateCacheDecorator.doUpdate(FileIntegrityViolationSuppressingPersistentStateCacheDecorator.java:67)
at org.gradle.cache.internal.FileIntegrityViolationSuppressingPersistentStateCacheDecorator.update(FileIntegrityViolationSuppressingPersistentStateCacheDecorator.java:47)
at org.gradle.launcher.daemon.registry.PersistentDaemonRegistry.store(PersistentDaemonRegistry.java:232)
at org.gradle.launcher.daemon.server.DaemonRegistryUpdater.onStart(DaemonRegistryUpdater.java:80)
at org.gradle.launcher.daemon.server.Daemon.start(Daemon.java:171)
at org.gradle.launcher.daemon.bootstrap.DaemonMain.doAction(DaemonMain.java:125)
at org.gradle.launcher.bootstrap.EntryPoint.run(EntryPoint.java:50)
at sun.reflect.NativeMethodAccessorImpl.invoke0(Native Method)
at sun.reflect.NativeMethodAccessorImpl.invoke(NativeMethodAccessorImpl.java:62)
at sun.reflect.DelegatingMethodAccessorImpl.invoke(DelegatingMethodAccessorImpl.java:43)
at java.lang.reflect.Method.invoke(Method.java:498)
at org.gradle.launcher.bootstrap.ProcessBootstrap.runNoExit(ProcessBootstrap.java:60)
at org.gradle.launcher.bootstrap.ProcessBootstrap.run(ProcessBootstrap.java:37)
at org.gradle.launcher.daemon.bootstrap.GradleDaemon.main(GradleDaemon.java:22)
* Get more help at https://help.gradle.org
* Try:
> Run with --stacktrace option to get the stack trace.
> Run with --info or --debug option to get more log output.
> Run with --scan to get full insights.
* Get more help at https://help.gradle.org
Build step 'Invoke Gradle script' changed build result to FAILURE
Build step 'Invoke Gradle script' marked build as failure
---------------------------------------------------------------------
To unsubscribe, e-mail: builds-unsubscribe@beam.apache.org
For additional commands, e-mail: builds-help@beam.apache.org