You are viewing a plain text version of this content. The canonical link for it is here.
Posted to notifications@maven.apache.org by Hudson <Hu...@sonatype.org> on 2009/04/14 18:17:52 UTC
Build failed in Hudson: surefire-trunk » 1.5,ubuntu #1
See http://grid.sonatype.org/ci/job/surefire-trunk/./jdk=1.5,label=ubuntu/1/
------------------------------------------
[...truncated 2231 lines...]
at org.codehaus.classworlds.Launcher.mainWithExitCode(Launcher.java:430)
at org.codehaus.classworlds.Launcher.main(Launcher.java:375)
Caused by: org.apache.maven.plugin.MojoFailureException: There are test failures.
Please refer to /home/hudson/workspace/surefire-trunk/jdk/1.5/label/ubuntu/trunk/surefire-integration-tests/target/test-classes/system-properties/target/surefire-reports for the individual test results.
at org.apache.maven.plugin.surefire.SurefirePlugin.execute(SurefirePlugin.java:600)
at org.apache.maven.plugin.DefaultPluginManager.executeMojo(DefaultPluginManager.java:483)
at org.apache.maven.lifecycle.DefaultLifecycleExecutor.executeGoals(DefaultLifecycleExecutor.java:678)
... 16 more
[INFO] ------------------------------------------------------------------------
[INFO] Total time: 3 seconds
[INFO] Finished at: Tue Apr 14 10:11:21 GMT-06:00 2009
[INFO] Final Memory: 9M/57M
[INFO] ------------------------------------------------------------------------
at org.apache.maven.it.Verifier.executeGoals(Verifier.java:918)
at org.apache.maven.it.Verifier.executeGoals(Verifier.java:786)
at org.apache.maven.surefire.its.SystemPropertiesTest.testSystemProperties(SystemPropertiesTest.java:31)
at org.apache.maven.surefire.its.SystemPropertiesTest.testSystemProperties(SystemPropertiesTest.java:31)
at sun.reflect.NativeMethodAccessorImpl.invoke0(Native Method)
at sun.reflect.NativeMethodAccessorImpl.invoke(NativeMethodAccessorImpl.java:39)
at sun.reflect.DelegatingMethodAccessorImpl.invoke(DelegatingMethodAccessorImpl.java:25)
at java.lang.reflect.Method.invoke(Method.java:585)
at junit.framework.TestCase.runTest(TestCase.java:154)
at junit.framework.TestCase.runBare(TestCase.java:127)
at junit.framework.TestResult$1.protect(TestResult.java:106)
at junit.framework.TestResult.runProtected(TestResult.java:124)
at junit.framework.TestResult.run(TestResult.java:109)
at junit.framework.TestCase.run(TestCase.java:118)
at junit.framework.TestSuite.runTest(TestSuite.java:208)
at junit.framework.TestSuite.run(TestSuite.java:203)
at sun.reflect.NativeMethodAccessorImpl.invoke0(Native Method)
at sun.reflect.NativeMethodAccessorImpl.invoke(NativeMethodAccessorImpl.java:39)
at sun.reflect.DelegatingMethodAccessorImpl.invoke(DelegatingMethodAccessorImpl.java:25)
at java.lang.reflect.Method.invoke(Method.java:585)
at org.apache.maven.surefire.junit.JUnitTestSet.execute(JUnitTestSet.java:213)
at org.apache.maven.surefire.suite.AbstractDirectoryTestSuite.executeTestSet(AbstractDirectoryTestSuite.java:138)
at org.apache.maven.surefire.suite.AbstractDirectoryTestSuite.execute(AbstractDirectoryTestSuite.java:125)
at org.apache.maven.surefire.Surefire.run(Surefire.java:132)
at sun.reflect.NativeMethodAccessorImpl.invoke0(Native Method)
at sun.reflect.NativeMethodAccessorImpl.invoke(NativeMethodAccessorImpl.java:39)
at sun.reflect.DelegatingMethodAccessorImpl.invoke(DelegatingMethodAccessorImpl.java:25)
at java.lang.reflect.Method.invoke(Method.java:585)
at org.apache.maven.surefire.booter.SurefireBooter.runSuitesInProcess(SurefireBooter.java:308)
at org.apache.maven.surefire.booter.SurefireBooter.main(SurefireBooter.java:879)
testSystemPropertiesNoFork(org.apache.maven.surefire.its.SystemPropertiesTest) Time elapsed: 4.2 sec <<< ERROR!
org.apache.maven.it.VerificationException: Exit code was non-zero: 1; log =
+ Error stacktraces are turned on.
[INFO] Scanning for projects...
[INFO] snapshot org.apache.maven.plugins:maven-surefire-plugin:2.5-SNAPSHOT: checking for updates from central
[INFO] snapshot org.apache.maven.plugins:maven-surefire-plugin:2.5-SNAPSHOT: checking for updates from central
[INFO] snapshot org.apache.maven.surefire:surefire:2.5-SNAPSHOT: checking for updates from central
[INFO] snapshot org.apache.maven.surefire:surefire:2.5-SNAPSHOT: checking for updates from central
[INFO] Searching repository for plugin with prefix: 'clean'.
[INFO] org.apache.maven.plugins: checking for updates from central
[INFO] org.codehaus.mojo: checking for updates from central
[INFO] ------------------------------------------------------------------------
[INFO] Building Test for systemProperties
[INFO] task-segment: [clean:clean, test]
[INFO] ------------------------------------------------------------------------
[INFO] [clean:clean]
[INFO] Deleting directory /home/hudson/workspace/surefire-trunk/jdk/1.5/label/ubuntu/trunk/surefire-integration-tests/target/test-classes/system-properties/target
[INFO] [build-helper:reserve-network-port {execution: default}]
[INFO] Reserved port 58426 for reservedPort1
[INFO] Reserved port 38405 for reservedPort2
[INFO] Reserved port 45219 for reservedPort3
[INFO] [resources:resources]
[WARNING] Using platform encoding (UTF-8 actually) to copy filtered resources, i.e. build is platform dependent!
[INFO] skip non existing resourceDirectory /home/hudson/workspace/surefire-trunk/jdk/1.5/label/ubuntu/trunk/surefire-integration-tests/target/test-classes/system-properties/src/main/resources
[INFO] [compiler:compile]
[INFO] No sources to compile
[INFO] [resources:testResources]
[WARNING] Using platform encoding (UTF-8 actually) to copy filtered resources, i.e. build is platform dependent!
[INFO] skip non existing resourceDirectory /home/hudson/workspace/surefire-trunk/jdk/1.5/label/ubuntu/trunk/surefire-integration-tests/target/test-classes/system-properties/src/test/resources
[INFO] [compiler:testCompile]
[INFO] Compiling 1 source file to /home/hudson/workspace/surefire-trunk/jdk/1.5/label/ubuntu/trunk/surefire-integration-tests/target/test-classes/system-properties/target/test-classes
[INFO] snapshot org.apache.maven.surefire:surefire-booter:2.5-SNAPSHOT: checking for updates from central
[INFO] snapshot org.apache.maven.surefire:surefire-booter:2.5-SNAPSHOT: checking for updates from central
[INFO] snapshot org.apache.maven.surefire:surefire-api:2.5-SNAPSHOT: checking for updates from central
[INFO] snapshot org.apache.maven.surefire:surefire-api:2.5-SNAPSHOT: checking for updates from central
[WARNING] DEPRECATED [systemProperties]: use systemPropertyVariables instead
[INFO] [surefire:test]
[INFO] snapshot org.apache.maven.surefire:surefire-junit:2.5-SNAPSHOT: checking for updates from central
[INFO] snapshot org.apache.maven.surefire:surefire-providers:2.5-SNAPSHOT: checking for updates from central
[INFO] Surefire report directory: /home/hudson/workspace/surefire-trunk/jdk/1.5/label/ubuntu/trunk/surefire-integration-tests/target/test-classes/system-properties/target/surefire-reports
-------------------------------------------------------
T E S T S
-------------------------------------------------------
Running systemProperties.BasicTest
reservedPort1: 58426
reservedPort2: 38405
reservedPort3: 45219
Tests run: 6, Failures: 1, Errors: 0, Skipped: 0, Time elapsed: 0.016 sec <<< FAILURE!
testSystemPropertyGenerateByOtherPlugin(systemProperties.BasicTest) Time elapsed: 0.002 sec <<< FAILURE!
junit.framework.AssertionFailedError: expected:<1> but was:<45219>
at junit.framework.Assert.fail(Assert.java:47)
at junit.framework.Assert.failNotEquals(Assert.java:282)
at junit.framework.Assert.assertEquals(Assert.java:64)
at junit.framework.Assert.assertEquals(Assert.java:201)
at junit.framework.Assert.assertEquals(Assert.java:207)
at systemProperties.BasicTest.testSystemPropertyGenerateByOtherPlugin(BasicTest.java:46)
Results :
Failed tests:
testSystemPropertyGenerateByOtherPlugin(systemProperties.BasicTest)
Tests run: 6, Failures: 1, Errors: 0, Skipped: 0
[INFO] ------------------------------------------------------------------------
[ERROR] BUILD FAILURE
[INFO] ------------------------------------------------------------------------
[INFO] There are test failures.
Please refer to /home/hudson/workspace/surefire-trunk/jdk/1.5/label/ubuntu/trunk/surefire-integration-tests/target/test-classes/system-properties/target/surefire-reports for the individual test results.
[INFO] ------------------------------------------------------------------------
[INFO] Trace
org.apache.maven.BuildFailureException: There are test failures.
Please refer to /home/hudson/workspace/surefire-trunk/jdk/1.5/label/ubuntu/trunk/surefire-integration-tests/target/test-classes/system-properties/target/surefire-reports for the individual test results.
at org.apache.maven.lifecycle.DefaultLifecycleExecutor.executeGoals(DefaultLifecycleExecutor.java:699)
at org.apache.maven.lifecycle.DefaultLifecycleExecutor.executeGoalWithLifecycle(DefaultLifecycleExecutor.java:540)
at org.apache.maven.lifecycle.DefaultLifecycleExecutor.executeGoal(DefaultLifecycleExecutor.java:519)
at org.apache.maven.lifecycle.DefaultLifecycleExecutor.executeGoalAndHandleFailures(DefaultLifecycleExecutor.java:371)
at org.apache.maven.lifecycle.DefaultLifecycleExecutor.executeTaskSegments(DefaultLifecycleExecutor.java:332)
at org.apache.maven.lifecycle.DefaultLifecycleExecutor.execute(DefaultLifecycleExecutor.java:181)
at org.apache.maven.DefaultMaven.doExecute(DefaultMaven.java:356)
at org.apache.maven.DefaultMaven.execute(DefaultMaven.java:137)
at org.apache.maven.cli.MavenCli.main(MavenCli.java:356)
at sun.reflect.NativeMethodAccessorImpl.invoke0(Native Method)
at sun.reflect.NativeMethodAccessorImpl.invoke(NativeMethodAccessorImpl.java:39)
at sun.reflect.DelegatingMethodAccessorImpl.invoke(DelegatingMethodAccessorImpl.java:25)
at java.lang.reflect.Method.invoke(Method.java:585)
at org.codehaus.classworlds.Launcher.launchEnhanced(Launcher.java:315)
at org.codehaus.classworlds.Launcher.launch(Launcher.java:255)
at org.codehaus.classworlds.Launcher.mainWithExitCode(Launcher.java:430)
at org.codehaus.classworlds.Launcher.main(Launcher.java:375)
Caused by: org.apache.maven.plugin.MojoFailureException: There are test failures.
Please refer to /home/hudson/workspace/surefire-trunk/jdk/1.5/label/ubuntu/trunk/surefire-integration-tests/target/test-classes/system-properties/target/surefire-reports for the individual test results.
at org.apache.maven.plugin.surefire.SurefirePlugin.execute(SurefirePlugin.java:600)
at org.apache.maven.plugin.DefaultPluginManager.executeMojo(DefaultPluginManager.java:483)
at org.apache.maven.lifecycle.DefaultLifecycleExecutor.executeGoals(DefaultLifecycleExecutor.java:678)
... 16 more
[INFO] ------------------------------------------------------------------------
[INFO] Total time: 3 seconds
[INFO] Finished at: Tue Apr 14 10:11:25 GMT-06:00 2009
[INFO] Final Memory: 9M/55M
[INFO] ------------------------------------------------------------------------
at org.apache.maven.it.Verifier.executeGoals(Verifier.java:918)
at org.apache.maven.it.Verifier.executeGoals(Verifier.java:786)
at org.apache.maven.surefire.its.SystemPropertiesTest.testSystemPropertiesNoFork(SystemPropertiesTest.java:52)
at org.apache.maven.surefire.its.SystemPropertiesTest.testSystemPropertiesNoFork(SystemPropertiesTest.java:52)
at sun.reflect.NativeMethodAccessorImpl.invoke0(Native Method)
at sun.reflect.NativeMethodAccessorImpl.invoke(NativeMethodAccessorImpl.java:39)
at sun.reflect.DelegatingMethodAccessorImpl.invoke(DelegatingMethodAccessorImpl.java:25)
at java.lang.reflect.Method.invoke(Method.java:585)
at junit.framework.TestCase.runTest(TestCase.java:154)
at junit.framework.TestCase.runBare(TestCase.java:127)
at junit.framework.TestResult$1.protect(TestResult.java:106)
at junit.framework.TestResult.runProtected(TestResult.java:124)
at junit.framework.TestResult.run(TestResult.java:109)
at junit.framework.TestCase.run(TestCase.java:118)
at junit.framework.TestSuite.runTest(TestSuite.java:208)
at junit.framework.TestSuite.run(TestSuite.java:203)
at sun.reflect.NativeMethodAccessorImpl.invoke0(Native Method)
at sun.reflect.NativeMethodAccessorImpl.invoke(NativeMethodAccessorImpl.java:39)
at sun.reflect.DelegatingMethodAccessorImpl.invoke(DelegatingMethodAccessorImpl.java:25)
at java.lang.reflect.Method.invoke(Method.java:585)
at org.apache.maven.surefire.junit.JUnitTestSet.execute(JUnitTestSet.java:213)
at org.apache.maven.surefire.suite.AbstractDirectoryTestSuite.executeTestSet(AbstractDirectoryTestSuite.java:138)
at org.apache.maven.surefire.suite.AbstractDirectoryTestSuite.execute(AbstractDirectoryTestSuite.java:125)
at org.apache.maven.surefire.Surefire.run(Surefire.java:132)
at sun.reflect.NativeMethodAccessorImpl.invoke0(Native Method)
at sun.reflect.NativeMethodAccessorImpl.invoke(NativeMethodAccessorImpl.java:39)
at sun.reflect.DelegatingMethodAccessorImpl.invoke(DelegatingMethodAccessorImpl.java:25)
at java.lang.reflect.Method.invoke(Method.java:585)
at org.apache.maven.surefire.booter.SurefireBooter.runSuitesInProcess(SurefireBooter.java:308)
at org.apache.maven.surefire.booter.SurefireBooter.main(SurefireBooter.java:879)
Running org.apache.maven.surefire.its.PlexusConflictTest
Tests run: 2, Failures: 0, Errors: 0, Skipped: 0, Time elapsed: 10.143 sec
Running org.apache.maven.surefire.its.AggregateReportTest
Tests run: 1, Failures: 0, Errors: 0, Skipped: 0, Time elapsed: 14.201 sec
Running org.apache.maven.surefire.its.TestNgPathWithSpaces
Tests run: 1, Failures: 0, Errors: 0, Skipped: 0, Time elapsed: 6.523 sec
Running org.apache.maven.surefire.its.TestSingleTest
Tests run: 4, Failures: 0, Errors: 0, Skipped: 0, Time elapsed: 25.085 sec
Running org.apache.maven.surefire.its.TestFailIfNoTests
Tests run: 2, Failures: 0, Errors: 0, Skipped: 0, Time elapsed: 10.444 sec
Running org.apache.maven.surefire.its.Surefire44InnerClassTest
Tests run: 1, Failures: 0, Errors: 0, Skipped: 0, Time elapsed: 5.707 sec
Running org.apache.maven.surefire.its.TestNgVersionsTest
Tests run: 6, Failures: 0, Errors: 0, Skipped: 0, Time elapsed: 53.74 sec
Running org.apache.maven.surefire.its.TestFailIfNoTestsForkMode
Tests run: 6, Failures: 0, Errors: 0, Skipped: 0, Time elapsed: 35.559 sec
Running org.apache.maven.surefire.its.TimeoutForkedTest
Tests run: 1, Failures: 0, Errors: 0, Skipped: 0, Time elapsed: 9.229 sec
Running org.apache.maven.surefire.its.TestPlainOldJavaClasspath
Tests run: 1, Failures: 0, Errors: 0, Skipped: 0, Time elapsed: 5.624 sec
Running org.apache.maven.surefire.its.EnvironmentVariableTest
Tests run: 1, Failures: 0, Errors: 0, Skipped: 0, Time elapsed: 5.861 sec
Running org.apache.maven.surefire.its.TestNgSuiteXmlTest
Tests run: 2, Failures: 0, Errors: 0, Skipped: 0, Time elapsed: 13.238 sec
Running org.apache.maven.surefire.its.TestNgSuiteXmlSingleTest
Tests run: 1, Failures: 0, Errors: 0, Skipped: 0, Time elapsed: 8.17 sec
Running org.apache.maven.surefire.its.TestJUnit44Hamcrest
Tests run: 1, Failures: 0, Errors: 0, Skipped: 0, Time elapsed: 6.791 sec
Running org.apache.maven.surefire.its.WorkingDirectoryTest
Tests run: 4, Failures: 0, Errors: 0, Skipped: 0, Time elapsed: 23.331 sec
Running org.apache.maven.surefire.its.SiblingAggregatorTest
Tests run: 1, Failures: 0, Errors: 0, Skipped: 0, Time elapsed: 6.398 sec
Running org.apache.maven.surefire.its.TestUseIsolatedClassLoader
Tests run: 1, Failures: 0, Errors: 0, Skipped: 0, Time elapsed: 5.976 sec
Running org.apache.maven.surefire.its.Surefire162CharsetProviderTest
Tests run: 1, Failures: 0, Errors: 0, Skipped: 0, Time elapsed: 6.033 sec
Running org.apache.maven.surefire.its.TestNgListenerReporter
Tests run: 1, Failures: 0, Errors: 0, Skipped: 0, Time elapsed: 6.232 sec
Running org.apache.maven.surefire.its.TestNgJdk14Test
Tests run: 1, Failures: 0, Errors: 0, Skipped: 0, Time elapsed: 6.627 sec
Running org.apache.maven.surefire.its.TwoTestCasesTest
Tests run: 4, Failures: 0, Errors: 0, Skipped: 0, Time elapsed: 24.403 sec
Running org.apache.maven.surefire.its.Surefire224WellFormedXmlFailuresTest
Tests run: 1, Failures: 0, Errors: 0, Skipped: 0, Time elapsed: 6.724 sec
Running org.apache.maven.surefire.its.ForkModeTest
Tests run: 5, Failures: 0, Errors: 0, Skipped: 0, Time elapsed: 34.455 sec
Running org.apache.maven.surefire.its.Junit4VersionsTest
Tests run: 6, Failures: 0, Errors: 0, Skipped: 0, Time elapsed: 41.526 sec
Running org.apache.maven.surefire.its.TestNgBeforeMethod
Tests run: 1, Failures: 0, Errors: 0, Skipped: 0, Time elapsed: 7.196 sec
Running org.apache.maven.surefire.its.TestNgGroupThreadParallel
Tests run: 1, Failures: 0, Errors: 0, Skipped: 0, Time elapsed: 6.824 sec
Results :
Failed tests:
testExecuteError(org.apache.maven.surefire.its.TestNgExecuteErrorTest)
Tests in error:
testSystemProperties(org.apache.maven.surefire.its.SystemPropertiesTest)
testSystemPropertiesNoFork(org.apache.maven.surefire.its.SystemPropertiesTest)
Tests run: 73, Failures: 1, Errors: 2, Skipped: 0
[INFO] ------------------------------------------------------------------------
[ERROR] BUILD FAILURE
[INFO] ------------------------------------------------------------------------
[INFO] There are test failures.
Please refer to /home/hudson/workspace/surefire-trunk/jdk/1.5/label/ubuntu/trunk/surefire-integration-tests/target/surefire-reports for the individual test results.
[INFO] ------------------------------------------------------------------------
[INFO] For more information, run Maven with the -e switch
[INFO] ------------------------------------------------------------------------
[INFO] Total time: 9 minutes 41 seconds
[INFO] Finished at: Tue Apr 14 10:17:52 GMT-06:00 2009
[INFO] Final Memory: 26M/89M
[INFO] ------------------------------------------------------------------------
Hudson build is back to normal: surefire-trunk » 1.5,ubuntu #5
Posted by Hudson <Hu...@sonatype.org>.
See http://grid.sonatype.org/ci/job/surefire-trunk/./jdk=1.5,label=ubuntu/5/changes
Build failed in Hudson: surefire-trunk » 1.5,ubuntu #4
Posted by Hudson <Hu...@sonatype.org>.
See http://grid.sonatype.org/ci/job/surefire-trunk/./jdk=1.5,label=ubuntu/4/changes
Changes:
[Olivier Lamy] [SUREFIRE-551] On Linux (Ubuntu) it fails to escape all special characters when forking commands.
upgrade to p-u 1.5.9
------------------------------------------
[...truncated 610 lines...]
at org.codehaus.classworlds.Launcher.mainWithExitCode(Launcher.java:430)
at org.codehaus.classworlds.Launcher.main(Launcher.java:375)
Caused by: org.apache.maven.plugin.MojoFailureException: There are test failures.
Please refer to /home/hudson/workspace/surefire-trunk/jdk/1.5/label/ubuntu/trunk/surefire-integration-tests/target/test-classes/system-properties/target/surefire-reports for the individual test results.
at org.apache.maven.plugin.surefire.SurefirePlugin.execute(SurefirePlugin.java:600)
at org.apache.maven.plugin.DefaultPluginManager.executeMojo(DefaultPluginManager.java:483)
at org.apache.maven.lifecycle.DefaultLifecycleExecutor.executeGoals(DefaultLifecycleExecutor.java:678)
... 16 more
[INFO] ------------------------------------------------------------------------
[INFO] Total time: 3 seconds
[INFO] Finished at: Mon Jun 15 17:02:15 GMT-06:00 2009
[INFO] Final Memory: 9M/56M
[INFO] ------------------------------------------------------------------------
at org.apache.maven.it.Verifier.executeGoals(Verifier.java:918)
at org.apache.maven.it.Verifier.executeGoals(Verifier.java:786)
at org.apache.maven.surefire.its.SystemPropertiesTest.testSystemProperties(SystemPropertiesTest.java:31)
at org.apache.maven.surefire.its.SystemPropertiesTest.testSystemProperties(SystemPropertiesTest.java:31)
at sun.reflect.NativeMethodAccessorImpl.invoke0(Native Method)
at sun.reflect.NativeMethodAccessorImpl.invoke(NativeMethodAccessorImpl.java:39)
at sun.reflect.DelegatingMethodAccessorImpl.invoke(DelegatingMethodAccessorImpl.java:25)
at java.lang.reflect.Method.invoke(Method.java:585)
at junit.framework.TestCase.runTest(TestCase.java:154)
at junit.framework.TestCase.runBare(TestCase.java:127)
at junit.framework.TestResult$1.protect(TestResult.java:106)
at junit.framework.TestResult.runProtected(TestResult.java:124)
at junit.framework.TestResult.run(TestResult.java:109)
at junit.framework.TestCase.run(TestCase.java:118)
at junit.framework.TestSuite.runTest(TestSuite.java:208)
at junit.framework.TestSuite.run(TestSuite.java:203)
at sun.reflect.NativeMethodAccessorImpl.invoke0(Native Method)
at sun.reflect.NativeMethodAccessorImpl.invoke(NativeMethodAccessorImpl.java:39)
at sun.reflect.DelegatingMethodAccessorImpl.invoke(DelegatingMethodAccessorImpl.java:25)
at java.lang.reflect.Method.invoke(Method.java:585)
at org.apache.maven.surefire.junit.JUnitTestSet.execute(JUnitTestSet.java:213)
at org.apache.maven.surefire.suite.AbstractDirectoryTestSuite.executeTestSet(AbstractDirectoryTestSuite.java:138)
at org.apache.maven.surefire.suite.AbstractDirectoryTestSuite.execute(AbstractDirectoryTestSuite.java:125)
at org.apache.maven.surefire.Surefire.run(Surefire.java:132)
at sun.reflect.NativeMethodAccessorImpl.invoke0(Native Method)
at sun.reflect.NativeMethodAccessorImpl.invoke(NativeMethodAccessorImpl.java:39)
at sun.reflect.DelegatingMethodAccessorImpl.invoke(DelegatingMethodAccessorImpl.java:25)
at java.lang.reflect.Method.invoke(Method.java:585)
at org.apache.maven.surefire.booter.SurefireBooter.runSuitesInProcess(SurefireBooter.java:308)
at org.apache.maven.surefire.booter.SurefireBooter.main(SurefireBooter.java:879)
testSystemPropertiesNoFork(org.apache.maven.surefire.its.SystemPropertiesTest) Time elapsed: 4.366 sec <<< ERROR!
org.apache.maven.it.VerificationException: Exit code was non-zero: 1; log =
+ Error stacktraces are turned on.
[INFO] Scanning for projects...
[INFO] snapshot org.apache.maven.plugins:maven-surefire-plugin:2.5-SNAPSHOT: checking for updates from central
[INFO] snapshot org.apache.maven.plugins:maven-surefire-plugin:2.5-SNAPSHOT: checking for updates from central
[INFO] snapshot org.apache.maven.surefire:surefire:2.5-SNAPSHOT: checking for updates from central
[INFO] snapshot org.apache.maven.surefire:surefire:2.5-SNAPSHOT: checking for updates from central
[INFO] Searching repository for plugin with prefix: 'clean'.
[INFO] org.apache.maven.plugins: checking for updates from central
[INFO] org.codehaus.mojo: checking for updates from central
[INFO] ------------------------------------------------------------------------
[INFO] Building Test for systemProperties
[INFO] task-segment: [clean:clean, test]
[INFO] ------------------------------------------------------------------------
[INFO] [clean:clean]
[INFO] Deleting directory /home/hudson/workspace/surefire-trunk/jdk/1.5/label/ubuntu/trunk/surefire-integration-tests/target/test-classes/system-properties/target
[INFO] [build-helper:reserve-network-port {execution: default}]
[INFO] Reserved port 56873 for reservedPort1
[INFO] Reserved port 57660 for reservedPort2
[INFO] Reserved port 41916 for reservedPort3
[INFO] [resources:resources]
[WARNING] Using platform encoding (UTF-8 actually) to copy filtered resources, i.e. build is platform dependent!
[INFO] skip non existing resourceDirectory /home/hudson/workspace/surefire-trunk/jdk/1.5/label/ubuntu/trunk/surefire-integration-tests/target/test-classes/system-properties/src/main/resources
[INFO] [compiler:compile]
[INFO] No sources to compile
[INFO] [resources:testResources]
[WARNING] Using platform encoding (UTF-8 actually) to copy filtered resources, i.e. build is platform dependent!
[INFO] skip non existing resourceDirectory /home/hudson/workspace/surefire-trunk/jdk/1.5/label/ubuntu/trunk/surefire-integration-tests/target/test-classes/system-properties/src/test/resources
[INFO] [compiler:testCompile]
[INFO] Compiling 1 source file to /home/hudson/workspace/surefire-trunk/jdk/1.5/label/ubuntu/trunk/surefire-integration-tests/target/test-classes/system-properties/target/test-classes
[INFO] snapshot org.apache.maven.surefire:surefire-booter:2.5-SNAPSHOT: checking for updates from central
[INFO] snapshot org.apache.maven.surefire:surefire-booter:2.5-SNAPSHOT: checking for updates from central
[INFO] snapshot org.apache.maven.surefire:surefire-api:2.5-SNAPSHOT: checking for updates from central
[INFO] snapshot org.apache.maven.surefire:surefire-api:2.5-SNAPSHOT: checking for updates from central
[WARNING] DEPRECATED [systemProperties]: use systemPropertyVariables instead
[INFO] [surefire:test]
[INFO] snapshot org.apache.maven.surefire:surefire-junit:2.5-SNAPSHOT: checking for updates from central
[INFO] snapshot org.apache.maven.surefire:surefire-providers:2.5-SNAPSHOT: checking for updates from central
[INFO] Surefire report directory: /home/hudson/workspace/surefire-trunk/jdk/1.5/label/ubuntu/trunk/surefire-integration-tests/target/test-classes/system-properties/target/surefire-reports
-------------------------------------------------------
T E S T S
-------------------------------------------------------
Running systemProperties.BasicTest
reservedPort1: 56873
reservedPort2: 57660
reservedPort3: 41916
Tests run: 6, Failures: 1, Errors: 0, Skipped: 0, Time elapsed: 0.017 sec <<< FAILURE!
testSystemPropertyGenerateByOtherPlugin(systemProperties.BasicTest) Time elapsed: 0.001 sec <<< FAILURE!
junit.framework.AssertionFailedError: expected:<1> but was:<41916>
at junit.framework.Assert.fail(Assert.java:47)
at junit.framework.Assert.failNotEquals(Assert.java:282)
at junit.framework.Assert.assertEquals(Assert.java:64)
at junit.framework.Assert.assertEquals(Assert.java:201)
at junit.framework.Assert.assertEquals(Assert.java:207)
at systemProperties.BasicTest.testSystemPropertyGenerateByOtherPlugin(BasicTest.java:46)
Results :
Failed tests:
testSystemPropertyGenerateByOtherPlugin(systemProperties.BasicTest)
Tests run: 6, Failures: 1, Errors: 0, Skipped: 0
[INFO] ------------------------------------------------------------------------
[ERROR] BUILD FAILURE
[INFO] ------------------------------------------------------------------------
[INFO] There are test failures.
Please refer to /home/hudson/workspace/surefire-trunk/jdk/1.5/label/ubuntu/trunk/surefire-integration-tests/target/test-classes/system-properties/target/surefire-reports for the individual test results.
[INFO] ------------------------------------------------------------------------
[INFO] Trace
org.apache.maven.BuildFailureException: There are test failures.
Please refer to /home/hudson/workspace/surefire-trunk/jdk/1.5/label/ubuntu/trunk/surefire-integration-tests/target/test-classes/system-properties/target/surefire-reports for the individual test results.
at org.apache.maven.lifecycle.DefaultLifecycleExecutor.executeGoals(DefaultLifecycleExecutor.java:699)
at org.apache.maven.lifecycle.DefaultLifecycleExecutor.executeGoalWithLifecycle(DefaultLifecycleExecutor.java:540)
at org.apache.maven.lifecycle.DefaultLifecycleExecutor.executeGoal(DefaultLifecycleExecutor.java:519)
at org.apache.maven.lifecycle.DefaultLifecycleExecutor.executeGoalAndHandleFailures(DefaultLifecycleExecutor.java:371)
at org.apache.maven.lifecycle.DefaultLifecycleExecutor.executeTaskSegments(DefaultLifecycleExecutor.java:332)
at org.apache.maven.lifecycle.DefaultLifecycleExecutor.execute(DefaultLifecycleExecutor.java:181)
at org.apache.maven.DefaultMaven.doExecute(DefaultMaven.java:356)
at org.apache.maven.DefaultMaven.execute(DefaultMaven.java:137)
at org.apache.maven.cli.MavenCli.main(MavenCli.java:356)
at sun.reflect.NativeMethodAccessorImpl.invoke0(Native Method)
at sun.reflect.NativeMethodAccessorImpl.invoke(NativeMethodAccessorImpl.java:39)
at sun.reflect.DelegatingMethodAccessorImpl.invoke(DelegatingMethodAccessorImpl.java:25)
at java.lang.reflect.Method.invoke(Method.java:585)
at org.codehaus.classworlds.Launcher.launchEnhanced(Launcher.java:315)
at org.codehaus.classworlds.Launcher.launch(Launcher.java:255)
at org.codehaus.classworlds.Launcher.mainWithExitCode(Launcher.java:430)
at org.codehaus.classworlds.Launcher.main(Launcher.java:375)
Caused by: org.apache.maven.plugin.MojoFailureException: There are test failures.
Please refer to /home/hudson/workspace/surefire-trunk/jdk/1.5/label/ubuntu/trunk/surefire-integration-tests/target/test-classes/system-properties/target/surefire-reports for the individual test results.
at org.apache.maven.plugin.surefire.SurefirePlugin.execute(SurefirePlugin.java:600)
at org.apache.maven.plugin.DefaultPluginManager.executeMojo(DefaultPluginManager.java:483)
at org.apache.maven.lifecycle.DefaultLifecycleExecutor.executeGoals(DefaultLifecycleExecutor.java:678)
... 16 more
[INFO] ------------------------------------------------------------------------
[INFO] Total time: 3 seconds
[INFO] Finished at: Mon Jun 15 17:02:20 GMT-06:00 2009
[INFO] Final Memory: 9M/51M
[INFO] ------------------------------------------------------------------------
at org.apache.maven.it.Verifier.executeGoals(Verifier.java:918)
at org.apache.maven.it.Verifier.executeGoals(Verifier.java:786)
at org.apache.maven.surefire.its.SystemPropertiesTest.testSystemPropertiesNoFork(SystemPropertiesTest.java:52)
at org.apache.maven.surefire.its.SystemPropertiesTest.testSystemPropertiesNoFork(SystemPropertiesTest.java:52)
at sun.reflect.NativeMethodAccessorImpl.invoke0(Native Method)
at sun.reflect.NativeMethodAccessorImpl.invoke(NativeMethodAccessorImpl.java:39)
at sun.reflect.DelegatingMethodAccessorImpl.invoke(DelegatingMethodAccessorImpl.java:25)
at java.lang.reflect.Method.invoke(Method.java:585)
at junit.framework.TestCase.runTest(TestCase.java:154)
at junit.framework.TestCase.runBare(TestCase.java:127)
at junit.framework.TestResult$1.protect(TestResult.java:106)
at junit.framework.TestResult.runProtected(TestResult.java:124)
at junit.framework.TestResult.run(TestResult.java:109)
at junit.framework.TestCase.run(TestCase.java:118)
at junit.framework.TestSuite.runTest(TestSuite.java:208)
at junit.framework.TestSuite.run(TestSuite.java:203)
at sun.reflect.NativeMethodAccessorImpl.invoke0(Native Method)
at sun.reflect.NativeMethodAccessorImpl.invoke(NativeMethodAccessorImpl.java:39)
at sun.reflect.DelegatingMethodAccessorImpl.invoke(DelegatingMethodAccessorImpl.java:25)
at java.lang.reflect.Method.invoke(Method.java:585)
at org.apache.maven.surefire.junit.JUnitTestSet.execute(JUnitTestSet.java:213)
at org.apache.maven.surefire.suite.AbstractDirectoryTestSuite.executeTestSet(AbstractDirectoryTestSuite.java:138)
at org.apache.maven.surefire.suite.AbstractDirectoryTestSuite.execute(AbstractDirectoryTestSuite.java:125)
at org.apache.maven.surefire.Surefire.run(Surefire.java:132)
at sun.reflect.NativeMethodAccessorImpl.invoke0(Native Method)
at sun.reflect.NativeMethodAccessorImpl.invoke(NativeMethodAccessorImpl.java:39)
at sun.reflect.DelegatingMethodAccessorImpl.invoke(DelegatingMethodAccessorImpl.java:25)
at java.lang.reflect.Method.invoke(Method.java:585)
at org.apache.maven.surefire.booter.SurefireBooter.runSuitesInProcess(SurefireBooter.java:308)
at org.apache.maven.surefire.booter.SurefireBooter.main(SurefireBooter.java:879)
Running org.apache.maven.surefire.its.PlexusConflictTest
Tests run: 2, Failures: 0, Errors: 0, Skipped: 0, Time elapsed: 10.294 sec
Running org.apache.maven.surefire.its.AggregateReportTest
Tests run: 1, Failures: 0, Errors: 0, Skipped: 0, Time elapsed: 6.762 sec
Running org.apache.maven.surefire.its.TestNgPathWithSpaces
Tests run: 1, Failures: 0, Errors: 0, Skipped: 0, Time elapsed: 5.554 sec
Running org.apache.maven.surefire.its.TestSingleTest
Tests run: 4, Failures: 0, Errors: 0, Skipped: 0, Time elapsed: 19.879 sec
Running org.apache.maven.surefire.its.TestFailIfNoTests
Tests run: 2, Failures: 0, Errors: 0, Skipped: 0, Time elapsed: 7.343 sec
Running org.apache.maven.surefire.its.Surefire44InnerClassTest
Tests run: 1, Failures: 0, Errors: 0, Skipped: 0, Time elapsed: 4.356 sec
Running org.apache.maven.surefire.its.TestNgVersionsTest
Tests run: 6, Failures: 0, Errors: 0, Skipped: 0, Time elapsed: 30.336 sec
Running org.apache.maven.surefire.its.TestFailIfNoTestsForkMode
Tests run: 6, Failures: 0, Errors: 0, Skipped: 0, Time elapsed: 29.536 sec
Running org.apache.maven.surefire.its.TimeoutForkedTest
Tests run: 1, Failures: 0, Errors: 0, Skipped: 0, Time elapsed: 8.284 sec
Running org.apache.maven.surefire.its.TestPlainOldJavaClasspath
Tests run: 1, Failures: 0, Errors: 0, Skipped: 0, Time elapsed: 4.749 sec
Running org.apache.maven.surefire.its.EnvironmentVariableTest
Tests run: 1, Failures: 0, Errors: 0, Skipped: 0, Time elapsed: 4.086 sec
Running org.apache.maven.surefire.its.TestNgSuiteXmlTest
Tests run: 2, Failures: 0, Errors: 0, Skipped: 0, Time elapsed: 9.742 sec
Running org.apache.maven.surefire.its.TestNgSuiteXmlSingleTest
Tests run: 1, Failures: 0, Errors: 0, Skipped: 0, Time elapsed: 4.86 sec
Running org.apache.maven.surefire.its.TestJUnit44Hamcrest
Tests run: 1, Failures: 0, Errors: 0, Skipped: 0, Time elapsed: 4.662 sec
Running org.apache.maven.surefire.its.WorkingDirectoryTest
Tests run: 4, Failures: 0, Errors: 0, Skipped: 0, Time elapsed: 15.91 sec
Running org.apache.maven.surefire.its.SiblingAggregatorTest
Tests run: 1, Failures: 0, Errors: 0, Skipped: 0, Time elapsed: 4.483 sec
Running org.apache.maven.surefire.its.TestUseIsolatedClassLoader
Tests run: 1, Failures: 0, Errors: 0, Skipped: 0, Time elapsed: 5.935 sec
Running org.apache.maven.surefire.its.Surefire162CharsetProviderTest
Tests run: 1, Failures: 0, Errors: 0, Skipped: 0, Time elapsed: 6.443 sec
Running org.apache.maven.surefire.its.TestNgListenerReporter
Tests run: 1, Failures: 0, Errors: 0, Skipped: 0, Time elapsed: 5.157 sec
Running org.apache.maven.surefire.its.TestNgJdk14Test
Tests run: 1, Failures: 0, Errors: 0, Skipped: 0, Time elapsed: 4.729 sec
Running org.apache.maven.surefire.its.TwoTestCasesTest
Tests run: 4, Failures: 0, Errors: 0, Skipped: 0, Time elapsed: 19.791 sec
Running org.apache.maven.surefire.its.Surefire224WellFormedXmlFailuresTest
Tests run: 1, Failures: 0, Errors: 0, Skipped: 0, Time elapsed: 4.971 sec
Running org.apache.maven.surefire.its.ForkModeTest
Tests run: 5, Failures: 0, Errors: 0, Skipped: 0, Time elapsed: 27.852 sec
Running org.apache.maven.surefire.its.Junit4VersionsTest
Tests run: 6, Failures: 0, Errors: 0, Skipped: 0, Time elapsed: 32.355 sec
Running org.apache.maven.surefire.its.TestNgBeforeMethod
Tests run: 1, Failures: 0, Errors: 0, Skipped: 0, Time elapsed: 5.406 sec
Running org.apache.maven.surefire.its.TestNgGroupThreadParallel
Tests run: 1, Failures: 0, Errors: 0, Skipped: 0, Time elapsed: 4.678 sec
Results :
Failed tests:
testExecuteError(org.apache.maven.surefire.its.TestNgExecuteErrorTest)
Tests in error:
testSystemProperties(org.apache.maven.surefire.its.SystemPropertiesTest)
testSystemPropertiesNoFork(org.apache.maven.surefire.its.SystemPropertiesTest)
Tests run: 73, Failures: 1, Errors: 2, Skipped: 0
[INFO] ------------------------------------------------------------------------
[ERROR] BUILD FAILURE
[INFO] ------------------------------------------------------------------------
[INFO] There are test failures.
Please refer to /home/hudson/workspace/surefire-trunk/jdk/1.5/label/ubuntu/trunk/surefire-integration-tests/target/surefire-reports for the individual test results.
[INFO] ------------------------------------------------------------------------
[INFO] For more information, run Maven with the -e switch
[INFO] ------------------------------------------------------------------------
[INFO] Total time: 6 minutes 34 seconds
[INFO] Finished at: Mon Jun 15 17:07:08 GMT-06:00 2009
[INFO] Final Memory: 30M/73M
[INFO] ------------------------------------------------------------------------
Build failed in Hudson: surefire-trunk » 1.5,ubuntu #3
Posted by Hudson <Hu...@sonatype.org>.
See http://grid.sonatype.org/ci/job/surefire-trunk/./jdk=1.5,label=ubuntu/3/
------------------------------------------
[...truncated 2210 lines...]
at org.codehaus.classworlds.Launcher.mainWithExitCode(Launcher.java:430)
at org.codehaus.classworlds.Launcher.main(Launcher.java:375)
Caused by: org.apache.maven.plugin.MojoFailureException: There are test failures.
Please refer to /home/hudson/workspace/surefire-trunk/jdk/1.5/label/ubuntu/trunk/surefire-integration-tests/target/test-classes/system-properties/target/surefire-reports for the individual test results.
at org.apache.maven.plugin.surefire.SurefirePlugin.execute(SurefirePlugin.java:600)
at org.apache.maven.plugin.DefaultPluginManager.executeMojo(DefaultPluginManager.java:483)
at org.apache.maven.lifecycle.DefaultLifecycleExecutor.executeGoals(DefaultLifecycleExecutor.java:678)
... 16 more
[INFO] ------------------------------------------------------------------------
[INFO] Total time: 7 seconds
[INFO] Finished at: Mon Jun 15 15:19:13 GMT-06:00 2009
[INFO] Final Memory: 9M/58M
[INFO] ------------------------------------------------------------------------
at org.apache.maven.it.Verifier.executeGoals(Verifier.java:918)
at org.apache.maven.it.Verifier.executeGoals(Verifier.java:786)
at org.apache.maven.surefire.its.SystemPropertiesTest.testSystemProperties(SystemPropertiesTest.java:31)
at org.apache.maven.surefire.its.SystemPropertiesTest.testSystemProperties(SystemPropertiesTest.java:31)
at sun.reflect.NativeMethodAccessorImpl.invoke0(Native Method)
at sun.reflect.NativeMethodAccessorImpl.invoke(NativeMethodAccessorImpl.java:39)
at sun.reflect.DelegatingMethodAccessorImpl.invoke(DelegatingMethodAccessorImpl.java:25)
at java.lang.reflect.Method.invoke(Method.java:585)
at junit.framework.TestCase.runTest(TestCase.java:154)
at junit.framework.TestCase.runBare(TestCase.java:127)
at junit.framework.TestResult$1.protect(TestResult.java:106)
at junit.framework.TestResult.runProtected(TestResult.java:124)
at junit.framework.TestResult.run(TestResult.java:109)
at junit.framework.TestCase.run(TestCase.java:118)
at junit.framework.TestSuite.runTest(TestSuite.java:208)
at junit.framework.TestSuite.run(TestSuite.java:203)
at sun.reflect.NativeMethodAccessorImpl.invoke0(Native Method)
at sun.reflect.NativeMethodAccessorImpl.invoke(NativeMethodAccessorImpl.java:39)
at sun.reflect.DelegatingMethodAccessorImpl.invoke(DelegatingMethodAccessorImpl.java:25)
at java.lang.reflect.Method.invoke(Method.java:585)
at org.apache.maven.surefire.junit.JUnitTestSet.execute(JUnitTestSet.java:213)
at org.apache.maven.surefire.suite.AbstractDirectoryTestSuite.executeTestSet(AbstractDirectoryTestSuite.java:138)
at org.apache.maven.surefire.suite.AbstractDirectoryTestSuite.execute(AbstractDirectoryTestSuite.java:125)
at org.apache.maven.surefire.Surefire.run(Surefire.java:132)
at sun.reflect.NativeMethodAccessorImpl.invoke0(Native Method)
at sun.reflect.NativeMethodAccessorImpl.invoke(NativeMethodAccessorImpl.java:39)
at sun.reflect.DelegatingMethodAccessorImpl.invoke(DelegatingMethodAccessorImpl.java:25)
at java.lang.reflect.Method.invoke(Method.java:585)
at org.apache.maven.surefire.booter.SurefireBooter.runSuitesInProcess(SurefireBooter.java:308)
at org.apache.maven.surefire.booter.SurefireBooter.main(SurefireBooter.java:879)
testSystemPropertiesNoFork(org.apache.maven.surefire.its.SystemPropertiesTest) Time elapsed: 6.509 sec <<< ERROR!
org.apache.maven.it.VerificationException: Exit code was non-zero: 1; log =
+ Error stacktraces are turned on.
[INFO] Scanning for projects...
[INFO] snapshot org.apache.maven.plugins:maven-surefire-plugin:2.5-SNAPSHOT: checking for updates from central
[INFO] snapshot org.apache.maven.plugins:maven-surefire-plugin:2.5-SNAPSHOT: checking for updates from central
[INFO] snapshot org.apache.maven.surefire:surefire:2.5-SNAPSHOT: checking for updates from central
[INFO] snapshot org.apache.maven.surefire:surefire:2.5-SNAPSHOT: checking for updates from central
[INFO] Searching repository for plugin with prefix: 'clean'.
[INFO] org.apache.maven.plugins: checking for updates from central
[INFO] org.codehaus.mojo: checking for updates from central
[INFO] ------------------------------------------------------------------------
[INFO] Building Test for systemProperties
[INFO] task-segment: [clean:clean, test]
[INFO] ------------------------------------------------------------------------
[INFO] [clean:clean]
[INFO] Deleting directory /home/hudson/workspace/surefire-trunk/jdk/1.5/label/ubuntu/trunk/surefire-integration-tests/target/test-classes/system-properties/target
[INFO] [build-helper:reserve-network-port {execution: default}]
[INFO] Reserved port 39687 for reservedPort1
[INFO] Reserved port 45961 for reservedPort2
[INFO] Reserved port 52949 for reservedPort3
[INFO] [resources:resources]
[WARNING] Using platform encoding (UTF-8 actually) to copy filtered resources, i.e. build is platform dependent!
[INFO] skip non existing resourceDirectory /home/hudson/workspace/surefire-trunk/jdk/1.5/label/ubuntu/trunk/surefire-integration-tests/target/test-classes/system-properties/src/main/resources
[INFO] [compiler:compile]
[INFO] No sources to compile
[INFO] [resources:testResources]
[WARNING] Using platform encoding (UTF-8 actually) to copy filtered resources, i.e. build is platform dependent!
[INFO] skip non existing resourceDirectory /home/hudson/workspace/surefire-trunk/jdk/1.5/label/ubuntu/trunk/surefire-integration-tests/target/test-classes/system-properties/src/test/resources
[INFO] [compiler:testCompile]
[INFO] Compiling 1 source file to /home/hudson/workspace/surefire-trunk/jdk/1.5/label/ubuntu/trunk/surefire-integration-tests/target/test-classes/system-properties/target/test-classes
[INFO] snapshot org.apache.maven.surefire:surefire-booter:2.5-SNAPSHOT: checking for updates from central
[INFO] snapshot org.apache.maven.surefire:surefire-booter:2.5-SNAPSHOT: checking for updates from central
[INFO] snapshot org.apache.maven.surefire:surefire-api:2.5-SNAPSHOT: checking for updates from central
[INFO] snapshot org.apache.maven.surefire:surefire-api:2.5-SNAPSHOT: checking for updates from central
[WARNING] DEPRECATED [systemProperties]: use systemPropertyVariables instead
[INFO] [surefire:test]
[INFO] snapshot org.apache.maven.surefire:surefire-junit:2.5-SNAPSHOT: checking for updates from central
[INFO] snapshot org.apache.maven.surefire:surefire-providers:2.5-SNAPSHOT: checking for updates from central
[INFO] Surefire report directory: /home/hudson/workspace/surefire-trunk/jdk/1.5/label/ubuntu/trunk/surefire-integration-tests/target/test-classes/system-properties/target/surefire-reports
-------------------------------------------------------
T E S T S
-------------------------------------------------------
Running systemProperties.BasicTest
reservedPort1: 39687
reservedPort2: 45961
reservedPort3: 52949
Tests run: 6, Failures: 1, Errors: 0, Skipped: 0, Time elapsed: 0.022 sec <<< FAILURE!
testSystemPropertyGenerateByOtherPlugin(systemProperties.BasicTest) Time elapsed: 0.002 sec <<< FAILURE!
junit.framework.AssertionFailedError: expected:<1> but was:<52949>
at junit.framework.Assert.fail(Assert.java:47)
at junit.framework.Assert.failNotEquals(Assert.java:282)
at junit.framework.Assert.assertEquals(Assert.java:64)
at junit.framework.Assert.assertEquals(Assert.java:201)
at junit.framework.Assert.assertEquals(Assert.java:207)
at systemProperties.BasicTest.testSystemPropertyGenerateByOtherPlugin(BasicTest.java:46)
Results :
Failed tests:
testSystemPropertyGenerateByOtherPlugin(systemProperties.BasicTest)
Tests run: 6, Failures: 1, Errors: 0, Skipped: 0
[INFO] ------------------------------------------------------------------------
[ERROR] BUILD FAILURE
[INFO] ------------------------------------------------------------------------
[INFO] There are test failures.
Please refer to /home/hudson/workspace/surefire-trunk/jdk/1.5/label/ubuntu/trunk/surefire-integration-tests/target/test-classes/system-properties/target/surefire-reports for the individual test results.
[INFO] ------------------------------------------------------------------------
[INFO] Trace
org.apache.maven.BuildFailureException: There are test failures.
Please refer to /home/hudson/workspace/surefire-trunk/jdk/1.5/label/ubuntu/trunk/surefire-integration-tests/target/test-classes/system-properties/target/surefire-reports for the individual test results.
at org.apache.maven.lifecycle.DefaultLifecycleExecutor.executeGoals(DefaultLifecycleExecutor.java:699)
at org.apache.maven.lifecycle.DefaultLifecycleExecutor.executeGoalWithLifecycle(DefaultLifecycleExecutor.java:540)
at org.apache.maven.lifecycle.DefaultLifecycleExecutor.executeGoal(DefaultLifecycleExecutor.java:519)
at org.apache.maven.lifecycle.DefaultLifecycleExecutor.executeGoalAndHandleFailures(DefaultLifecycleExecutor.java:371)
at org.apache.maven.lifecycle.DefaultLifecycleExecutor.executeTaskSegments(DefaultLifecycleExecutor.java:332)
at org.apache.maven.lifecycle.DefaultLifecycleExecutor.execute(DefaultLifecycleExecutor.java:181)
at org.apache.maven.DefaultMaven.doExecute(DefaultMaven.java:356)
at org.apache.maven.DefaultMaven.execute(DefaultMaven.java:137)
at org.apache.maven.cli.MavenCli.main(MavenCli.java:356)
at sun.reflect.NativeMethodAccessorImpl.invoke0(Native Method)
at sun.reflect.NativeMethodAccessorImpl.invoke(NativeMethodAccessorImpl.java:39)
at sun.reflect.DelegatingMethodAccessorImpl.invoke(DelegatingMethodAccessorImpl.java:25)
at java.lang.reflect.Method.invoke(Method.java:585)
at org.codehaus.classworlds.Launcher.launchEnhanced(Launcher.java:315)
at org.codehaus.classworlds.Launcher.launch(Launcher.java:255)
at org.codehaus.classworlds.Launcher.mainWithExitCode(Launcher.java:430)
at org.codehaus.classworlds.Launcher.main(Launcher.java:375)
Caused by: org.apache.maven.plugin.MojoFailureException: There are test failures.
Please refer to /home/hudson/workspace/surefire-trunk/jdk/1.5/label/ubuntu/trunk/surefire-integration-tests/target/test-classes/system-properties/target/surefire-reports for the individual test results.
at org.apache.maven.plugin.surefire.SurefirePlugin.execute(SurefirePlugin.java:600)
at org.apache.maven.plugin.DefaultPluginManager.executeMojo(DefaultPluginManager.java:483)
at org.apache.maven.lifecycle.DefaultLifecycleExecutor.executeGoals(DefaultLifecycleExecutor.java:678)
... 16 more
[INFO] ------------------------------------------------------------------------
[INFO] Total time: 5 seconds
[INFO] Finished at: Mon Jun 15 15:19:19 GMT-06:00 2009
[INFO] Final Memory: 9M/65M
[INFO] ------------------------------------------------------------------------
at org.apache.maven.it.Verifier.executeGoals(Verifier.java:918)
at org.apache.maven.it.Verifier.executeGoals(Verifier.java:786)
at org.apache.maven.surefire.its.SystemPropertiesTest.testSystemPropertiesNoFork(SystemPropertiesTest.java:52)
at org.apache.maven.surefire.its.SystemPropertiesTest.testSystemPropertiesNoFork(SystemPropertiesTest.java:52)
at sun.reflect.NativeMethodAccessorImpl.invoke0(Native Method)
at sun.reflect.NativeMethodAccessorImpl.invoke(NativeMethodAccessorImpl.java:39)
at sun.reflect.DelegatingMethodAccessorImpl.invoke(DelegatingMethodAccessorImpl.java:25)
at java.lang.reflect.Method.invoke(Method.java:585)
at junit.framework.TestCase.runTest(TestCase.java:154)
at junit.framework.TestCase.runBare(TestCase.java:127)
at junit.framework.TestResult$1.protect(TestResult.java:106)
at junit.framework.TestResult.runProtected(TestResult.java:124)
at junit.framework.TestResult.run(TestResult.java:109)
at junit.framework.TestCase.run(TestCase.java:118)
at junit.framework.TestSuite.runTest(TestSuite.java:208)
at junit.framework.TestSuite.run(TestSuite.java:203)
at sun.reflect.NativeMethodAccessorImpl.invoke0(Native Method)
at sun.reflect.NativeMethodAccessorImpl.invoke(NativeMethodAccessorImpl.java:39)
at sun.reflect.DelegatingMethodAccessorImpl.invoke(DelegatingMethodAccessorImpl.java:25)
at java.lang.reflect.Method.invoke(Method.java:585)
at org.apache.maven.surefire.junit.JUnitTestSet.execute(JUnitTestSet.java:213)
at org.apache.maven.surefire.suite.AbstractDirectoryTestSuite.executeTestSet(AbstractDirectoryTestSuite.java:138)
at org.apache.maven.surefire.suite.AbstractDirectoryTestSuite.execute(AbstractDirectoryTestSuite.java:125)
at org.apache.maven.surefire.Surefire.run(Surefire.java:132)
at sun.reflect.NativeMethodAccessorImpl.invoke0(Native Method)
at sun.reflect.NativeMethodAccessorImpl.invoke(NativeMethodAccessorImpl.java:39)
at sun.reflect.DelegatingMethodAccessorImpl.invoke(DelegatingMethodAccessorImpl.java:25)
at java.lang.reflect.Method.invoke(Method.java:585)
at org.apache.maven.surefire.booter.SurefireBooter.runSuitesInProcess(SurefireBooter.java:308)
at org.apache.maven.surefire.booter.SurefireBooter.main(SurefireBooter.java:879)
Running org.apache.maven.surefire.its.PlexusConflictTest
Tests run: 2, Failures: 0, Errors: 0, Skipped: 0, Time elapsed: 13.573 sec
Running org.apache.maven.surefire.its.AggregateReportTest
Tests run: 1, Failures: 0, Errors: 0, Skipped: 0, Time elapsed: 12.585 sec
Running org.apache.maven.surefire.its.TestNgPathWithSpaces
Tests run: 1, Failures: 0, Errors: 0, Skipped: 0, Time elapsed: 7.317 sec
Running org.apache.maven.surefire.its.TestSingleTest
Tests run: 4, Failures: 0, Errors: 0, Skipped: 0, Time elapsed: 26.274 sec
Running org.apache.maven.surefire.its.TestFailIfNoTests
Tests run: 2, Failures: 0, Errors: 0, Skipped: 0, Time elapsed: 11.088 sec
Running org.apache.maven.surefire.its.Surefire44InnerClassTest
Tests run: 1, Failures: 0, Errors: 0, Skipped: 0, Time elapsed: 5.543 sec
Running org.apache.maven.surefire.its.TestNgVersionsTest
Tests run: 6, Failures: 0, Errors: 0, Skipped: 0, Time elapsed: 46.533 sec
Running org.apache.maven.surefire.its.TestFailIfNoTestsForkMode
Tests run: 6, Failures: 0, Errors: 0, Skipped: 0, Time elapsed: 36.822 sec
Running org.apache.maven.surefire.its.TimeoutForkedTest
Tests run: 1, Failures: 0, Errors: 0, Skipped: 0, Time elapsed: 9.901 sec
Running org.apache.maven.surefire.its.TestPlainOldJavaClasspath
Tests run: 1, Failures: 0, Errors: 0, Skipped: 0, Time elapsed: 6.689 sec
Running org.apache.maven.surefire.its.EnvironmentVariableTest
Tests run: 1, Failures: 0, Errors: 0, Skipped: 0, Time elapsed: 6.769 sec
Running org.apache.maven.surefire.its.TestNgSuiteXmlTest
Tests run: 2, Failures: 0, Errors: 0, Skipped: 0, Time elapsed: 13.602 sec
Running org.apache.maven.surefire.its.TestNgSuiteXmlSingleTest
Tests run: 1, Failures: 0, Errors: 0, Skipped: 0, Time elapsed: 7.177 sec
Running org.apache.maven.surefire.its.TestJUnit44Hamcrest
Tests run: 1, Failures: 0, Errors: 0, Skipped: 0, Time elapsed: 7.084 sec
Running org.apache.maven.surefire.its.WorkingDirectoryTest
Tests run: 4, Failures: 0, Errors: 0, Skipped: 0, Time elapsed: 22.892 sec
Running org.apache.maven.surefire.its.SiblingAggregatorTest
Tests run: 1, Failures: 0, Errors: 0, Skipped: 0, Time elapsed: 7.023 sec
Running org.apache.maven.surefire.its.TestUseIsolatedClassLoader
Tests run: 1, Failures: 0, Errors: 0, Skipped: 0, Time elapsed: 6.117 sec
Running org.apache.maven.surefire.its.Surefire162CharsetProviderTest
Tests run: 1, Failures: 0, Errors: 0, Skipped: 0, Time elapsed: 5.54 sec
Running org.apache.maven.surefire.its.TestNgListenerReporter
Tests run: 1, Failures: 0, Errors: 0, Skipped: 0, Time elapsed: 6.164 sec
Running org.apache.maven.surefire.its.TestNgJdk14Test
Tests run: 1, Failures: 0, Errors: 0, Skipped: 0, Time elapsed: 4.918 sec
Running org.apache.maven.surefire.its.TwoTestCasesTest
Tests run: 4, Failures: 0, Errors: 0, Skipped: 0, Time elapsed: 19.328 sec
Running org.apache.maven.surefire.its.Surefire224WellFormedXmlFailuresTest
Tests run: 1, Failures: 0, Errors: 0, Skipped: 0, Time elapsed: 6.212 sec
Running org.apache.maven.surefire.its.ForkModeTest
Tests run: 5, Failures: 0, Errors: 0, Skipped: 0, Time elapsed: 35.879 sec
Running org.apache.maven.surefire.its.Junit4VersionsTest
Tests run: 6, Failures: 0, Errors: 0, Skipped: 0, Time elapsed: 40.846 sec
Running org.apache.maven.surefire.its.TestNgBeforeMethod
Tests run: 1, Failures: 0, Errors: 0, Skipped: 0, Time elapsed: 7.121 sec
Running org.apache.maven.surefire.its.TestNgGroupThreadParallel
Tests run: 1, Failures: 0, Errors: 0, Skipped: 0, Time elapsed: 7.177 sec
Results :
Failed tests:
testExecuteError(org.apache.maven.surefire.its.TestNgExecuteErrorTest)
Tests in error:
testSystemProperties(org.apache.maven.surefire.its.SystemPropertiesTest)
testSystemPropertiesNoFork(org.apache.maven.surefire.its.SystemPropertiesTest)
Tests run: 73, Failures: 1, Errors: 2, Skipped: 0
[INFO] ------------------------------------------------------------------------
[ERROR] BUILD FAILURE
[INFO] ------------------------------------------------------------------------
[INFO] There are test failures.
Please refer to /home/hudson/workspace/surefire-trunk/jdk/1.5/label/ubuntu/trunk/surefire-integration-tests/target/surefire-reports for the individual test results.
[INFO] ------------------------------------------------------------------------
[INFO] For more information, run Maven with the -e switch
[INFO] ------------------------------------------------------------------------
[INFO] Total time: 10 minutes 3 seconds
[INFO] Finished at: Mon Jun 15 15:25:40 GMT-06:00 2009
[INFO] Final Memory: 24M/85M
[INFO] ------------------------------------------------------------------------
Build failed in Hudson: surefire-trunk » 1.5,ubuntu #2
Posted by Hudson <Hu...@sonatype.org>.
See http://grid.sonatype.org/ci/job/surefire-trunk/./jdk=1.5,label=ubuntu/2/
------------------------------------------
[...truncated 604 lines...]
at org.codehaus.classworlds.Launcher.mainWithExitCode(Launcher.java:430)
at org.codehaus.classworlds.Launcher.main(Launcher.java:375)
Caused by: org.apache.maven.plugin.MojoFailureException: There are test failures.
Please refer to /home/hudson/workspace/surefire-trunk/jdk/1.5/label/ubuntu/trunk/surefire-integration-tests/target/test-classes/system-properties/target/surefire-reports for the individual test results.
at org.apache.maven.plugin.surefire.SurefirePlugin.execute(SurefirePlugin.java:600)
at org.apache.maven.plugin.DefaultPluginManager.executeMojo(DefaultPluginManager.java:483)
at org.apache.maven.lifecycle.DefaultLifecycleExecutor.executeGoals(DefaultLifecycleExecutor.java:678)
... 16 more
[INFO] ------------------------------------------------------------------------
[INFO] Total time: 3 seconds
[INFO] Finished at: Tue Apr 14 10:29:56 GMT-06:00 2009
[INFO] Final Memory: 9M/54M
[INFO] ------------------------------------------------------------------------
at org.apache.maven.it.Verifier.executeGoals(Verifier.java:918)
at org.apache.maven.it.Verifier.executeGoals(Verifier.java:786)
at org.apache.maven.surefire.its.SystemPropertiesTest.testSystemProperties(SystemPropertiesTest.java:31)
at org.apache.maven.surefire.its.SystemPropertiesTest.testSystemProperties(SystemPropertiesTest.java:31)
at sun.reflect.NativeMethodAccessorImpl.invoke0(Native Method)
at sun.reflect.NativeMethodAccessorImpl.invoke(NativeMethodAccessorImpl.java:39)
at sun.reflect.DelegatingMethodAccessorImpl.invoke(DelegatingMethodAccessorImpl.java:25)
at java.lang.reflect.Method.invoke(Method.java:585)
at junit.framework.TestCase.runTest(TestCase.java:154)
at junit.framework.TestCase.runBare(TestCase.java:127)
at junit.framework.TestResult$1.protect(TestResult.java:106)
at junit.framework.TestResult.runProtected(TestResult.java:124)
at junit.framework.TestResult.run(TestResult.java:109)
at junit.framework.TestCase.run(TestCase.java:118)
at junit.framework.TestSuite.runTest(TestSuite.java:208)
at junit.framework.TestSuite.run(TestSuite.java:203)
at sun.reflect.NativeMethodAccessorImpl.invoke0(Native Method)
at sun.reflect.NativeMethodAccessorImpl.invoke(NativeMethodAccessorImpl.java:39)
at sun.reflect.DelegatingMethodAccessorImpl.invoke(DelegatingMethodAccessorImpl.java:25)
at java.lang.reflect.Method.invoke(Method.java:585)
at org.apache.maven.surefire.junit.JUnitTestSet.execute(JUnitTestSet.java:213)
at org.apache.maven.surefire.suite.AbstractDirectoryTestSuite.executeTestSet(AbstractDirectoryTestSuite.java:138)
at org.apache.maven.surefire.suite.AbstractDirectoryTestSuite.execute(AbstractDirectoryTestSuite.java:125)
at org.apache.maven.surefire.Surefire.run(Surefire.java:132)
at sun.reflect.NativeMethodAccessorImpl.invoke0(Native Method)
at sun.reflect.NativeMethodAccessorImpl.invoke(NativeMethodAccessorImpl.java:39)
at sun.reflect.DelegatingMethodAccessorImpl.invoke(DelegatingMethodAccessorImpl.java:25)
at java.lang.reflect.Method.invoke(Method.java:585)
at org.apache.maven.surefire.booter.SurefireBooter.runSuitesInProcess(SurefireBooter.java:308)
at org.apache.maven.surefire.booter.SurefireBooter.main(SurefireBooter.java:879)
testSystemPropertiesNoFork(org.apache.maven.surefire.its.SystemPropertiesTest) Time elapsed: 4.063 sec <<< ERROR!
org.apache.maven.it.VerificationException: Exit code was non-zero: 1; log =
+ Error stacktraces are turned on.
[INFO] Scanning for projects...
[INFO] snapshot org.apache.maven.plugins:maven-surefire-plugin:2.5-SNAPSHOT: checking for updates from central
[INFO] snapshot org.apache.maven.plugins:maven-surefire-plugin:2.5-SNAPSHOT: checking for updates from central
[INFO] snapshot org.apache.maven.surefire:surefire:2.5-SNAPSHOT: checking for updates from central
[INFO] snapshot org.apache.maven.surefire:surefire:2.5-SNAPSHOT: checking for updates from central
[INFO] Searching repository for plugin with prefix: 'clean'.
[INFO] org.apache.maven.plugins: checking for updates from central
[INFO] org.codehaus.mojo: checking for updates from central
[INFO] ------------------------------------------------------------------------
[INFO] Building Test for systemProperties
[INFO] task-segment: [clean:clean, test]
[INFO] ------------------------------------------------------------------------
[INFO] [clean:clean]
[INFO] Deleting directory /home/hudson/workspace/surefire-trunk/jdk/1.5/label/ubuntu/trunk/surefire-integration-tests/target/test-classes/system-properties/target
[INFO] [build-helper:reserve-network-port {execution: default}]
[INFO] Reserved port 56348 for reservedPort1
[INFO] Reserved port 58481 for reservedPort2
[INFO] Reserved port 58597 for reservedPort3
[INFO] [resources:resources]
[WARNING] Using platform encoding (UTF-8 actually) to copy filtered resources, i.e. build is platform dependent!
[INFO] skip non existing resourceDirectory /home/hudson/workspace/surefire-trunk/jdk/1.5/label/ubuntu/trunk/surefire-integration-tests/target/test-classes/system-properties/src/main/resources
[INFO] [compiler:compile]
[INFO] No sources to compile
[INFO] [resources:testResources]
[WARNING] Using platform encoding (UTF-8 actually) to copy filtered resources, i.e. build is platform dependent!
[INFO] skip non existing resourceDirectory /home/hudson/workspace/surefire-trunk/jdk/1.5/label/ubuntu/trunk/surefire-integration-tests/target/test-classes/system-properties/src/test/resources
[INFO] [compiler:testCompile]
[INFO] Compiling 1 source file to /home/hudson/workspace/surefire-trunk/jdk/1.5/label/ubuntu/trunk/surefire-integration-tests/target/test-classes/system-properties/target/test-classes
[INFO] snapshot org.apache.maven.surefire:surefire-booter:2.5-SNAPSHOT: checking for updates from central
[INFO] snapshot org.apache.maven.surefire:surefire-booter:2.5-SNAPSHOT: checking for updates from central
[INFO] snapshot org.apache.maven.surefire:surefire-api:2.5-SNAPSHOT: checking for updates from central
[INFO] snapshot org.apache.maven.surefire:surefire-api:2.5-SNAPSHOT: checking for updates from central
[WARNING] DEPRECATED [systemProperties]: use systemPropertyVariables instead
[INFO] [surefire:test]
[INFO] snapshot org.apache.maven.surefire:surefire-junit:2.5-SNAPSHOT: checking for updates from central
[INFO] snapshot org.apache.maven.surefire:surefire-providers:2.5-SNAPSHOT: checking for updates from central
[INFO] Surefire report directory: /home/hudson/workspace/surefire-trunk/jdk/1.5/label/ubuntu/trunk/surefire-integration-tests/target/test-classes/system-properties/target/surefire-reports
-------------------------------------------------------
T E S T S
-------------------------------------------------------
Running systemProperties.BasicTest
reservedPort1: 56348
reservedPort2: 58481
reservedPort3: 58597
Tests run: 6, Failures: 1, Errors: 0, Skipped: 0, Time elapsed: 0.016 sec <<< FAILURE!
testSystemPropertyGenerateByOtherPlugin(systemProperties.BasicTest) Time elapsed: 0.001 sec <<< FAILURE!
junit.framework.AssertionFailedError: expected:<1> but was:<58597>
at junit.framework.Assert.fail(Assert.java:47)
at junit.framework.Assert.failNotEquals(Assert.java:282)
at junit.framework.Assert.assertEquals(Assert.java:64)
at junit.framework.Assert.assertEquals(Assert.java:201)
at junit.framework.Assert.assertEquals(Assert.java:207)
at systemProperties.BasicTest.testSystemPropertyGenerateByOtherPlugin(BasicTest.java:46)
Results :
Failed tests:
testSystemPropertyGenerateByOtherPlugin(systemProperties.BasicTest)
Tests run: 6, Failures: 1, Errors: 0, Skipped: 0
[INFO] ------------------------------------------------------------------------
[ERROR] BUILD FAILURE
[INFO] ------------------------------------------------------------------------
[INFO] There are test failures.
Please refer to /home/hudson/workspace/surefire-trunk/jdk/1.5/label/ubuntu/trunk/surefire-integration-tests/target/test-classes/system-properties/target/surefire-reports for the individual test results.
[INFO] ------------------------------------------------------------------------
[INFO] Trace
org.apache.maven.BuildFailureException: There are test failures.
Please refer to /home/hudson/workspace/surefire-trunk/jdk/1.5/label/ubuntu/trunk/surefire-integration-tests/target/test-classes/system-properties/target/surefire-reports for the individual test results.
at org.apache.maven.lifecycle.DefaultLifecycleExecutor.executeGoals(DefaultLifecycleExecutor.java:699)
at org.apache.maven.lifecycle.DefaultLifecycleExecutor.executeGoalWithLifecycle(DefaultLifecycleExecutor.java:540)
at org.apache.maven.lifecycle.DefaultLifecycleExecutor.executeGoal(DefaultLifecycleExecutor.java:519)
at org.apache.maven.lifecycle.DefaultLifecycleExecutor.executeGoalAndHandleFailures(DefaultLifecycleExecutor.java:371)
at org.apache.maven.lifecycle.DefaultLifecycleExecutor.executeTaskSegments(DefaultLifecycleExecutor.java:332)
at org.apache.maven.lifecycle.DefaultLifecycleExecutor.execute(DefaultLifecycleExecutor.java:181)
at org.apache.maven.DefaultMaven.doExecute(DefaultMaven.java:356)
at org.apache.maven.DefaultMaven.execute(DefaultMaven.java:137)
at org.apache.maven.cli.MavenCli.main(MavenCli.java:356)
at sun.reflect.NativeMethodAccessorImpl.invoke0(Native Method)
at sun.reflect.NativeMethodAccessorImpl.invoke(NativeMethodAccessorImpl.java:39)
at sun.reflect.DelegatingMethodAccessorImpl.invoke(DelegatingMethodAccessorImpl.java:25)
at java.lang.reflect.Method.invoke(Method.java:585)
at org.codehaus.classworlds.Launcher.launchEnhanced(Launcher.java:315)
at org.codehaus.classworlds.Launcher.launch(Launcher.java:255)
at org.codehaus.classworlds.Launcher.mainWithExitCode(Launcher.java:430)
at org.codehaus.classworlds.Launcher.main(Launcher.java:375)
Caused by: org.apache.maven.plugin.MojoFailureException: There are test failures.
Please refer to /home/hudson/workspace/surefire-trunk/jdk/1.5/label/ubuntu/trunk/surefire-integration-tests/target/test-classes/system-properties/target/surefire-reports for the individual test results.
at org.apache.maven.plugin.surefire.SurefirePlugin.execute(SurefirePlugin.java:600)
at org.apache.maven.plugin.DefaultPluginManager.executeMojo(DefaultPluginManager.java:483)
at org.apache.maven.lifecycle.DefaultLifecycleExecutor.executeGoals(DefaultLifecycleExecutor.java:678)
... 16 more
[INFO] ------------------------------------------------------------------------
[INFO] Total time: 3 seconds
[INFO] Finished at: Tue Apr 14 10:30:00 GMT-06:00 2009
[INFO] Final Memory: 9M/58M
[INFO] ------------------------------------------------------------------------
at org.apache.maven.it.Verifier.executeGoals(Verifier.java:918)
at org.apache.maven.it.Verifier.executeGoals(Verifier.java:786)
at org.apache.maven.surefire.its.SystemPropertiesTest.testSystemPropertiesNoFork(SystemPropertiesTest.java:52)
at org.apache.maven.surefire.its.SystemPropertiesTest.testSystemPropertiesNoFork(SystemPropertiesTest.java:52)
at sun.reflect.NativeMethodAccessorImpl.invoke0(Native Method)
at sun.reflect.NativeMethodAccessorImpl.invoke(NativeMethodAccessorImpl.java:39)
at sun.reflect.DelegatingMethodAccessorImpl.invoke(DelegatingMethodAccessorImpl.java:25)
at java.lang.reflect.Method.invoke(Method.java:585)
at junit.framework.TestCase.runTest(TestCase.java:154)
at junit.framework.TestCase.runBare(TestCase.java:127)
at junit.framework.TestResult$1.protect(TestResult.java:106)
at junit.framework.TestResult.runProtected(TestResult.java:124)
at junit.framework.TestResult.run(TestResult.java:109)
at junit.framework.TestCase.run(TestCase.java:118)
at junit.framework.TestSuite.runTest(TestSuite.java:208)
at junit.framework.TestSuite.run(TestSuite.java:203)
at sun.reflect.NativeMethodAccessorImpl.invoke0(Native Method)
at sun.reflect.NativeMethodAccessorImpl.invoke(NativeMethodAccessorImpl.java:39)
at sun.reflect.DelegatingMethodAccessorImpl.invoke(DelegatingMethodAccessorImpl.java:25)
at java.lang.reflect.Method.invoke(Method.java:585)
at org.apache.maven.surefire.junit.JUnitTestSet.execute(JUnitTestSet.java:213)
at org.apache.maven.surefire.suite.AbstractDirectoryTestSuite.executeTestSet(AbstractDirectoryTestSuite.java:138)
at org.apache.maven.surefire.suite.AbstractDirectoryTestSuite.execute(AbstractDirectoryTestSuite.java:125)
at org.apache.maven.surefire.Surefire.run(Surefire.java:132)
at sun.reflect.NativeMethodAccessorImpl.invoke0(Native Method)
at sun.reflect.NativeMethodAccessorImpl.invoke(NativeMethodAccessorImpl.java:39)
at sun.reflect.DelegatingMethodAccessorImpl.invoke(DelegatingMethodAccessorImpl.java:25)
at java.lang.reflect.Method.invoke(Method.java:585)
at org.apache.maven.surefire.booter.SurefireBooter.runSuitesInProcess(SurefireBooter.java:308)
at org.apache.maven.surefire.booter.SurefireBooter.main(SurefireBooter.java:879)
Running org.apache.maven.surefire.its.PlexusConflictTest
Tests run: 2, Failures: 0, Errors: 0, Skipped: 0, Time elapsed: 8.307 sec
Running org.apache.maven.surefire.its.AggregateReportTest
Tests run: 1, Failures: 0, Errors: 0, Skipped: 0, Time elapsed: 6.437 sec
Running org.apache.maven.surefire.its.TestNgPathWithSpaces
Tests run: 1, Failures: 0, Errors: 0, Skipped: 0, Time elapsed: 4.814 sec
Running org.apache.maven.surefire.its.TestSingleTest
Tests run: 4, Failures: 0, Errors: 0, Skipped: 0, Time elapsed: 17.631 sec
Running org.apache.maven.surefire.its.TestFailIfNoTests
Tests run: 2, Failures: 0, Errors: 0, Skipped: 0, Time elapsed: 6.542 sec
Running org.apache.maven.surefire.its.Surefire44InnerClassTest
Tests run: 1, Failures: 0, Errors: 0, Skipped: 0, Time elapsed: 4.076 sec
Running org.apache.maven.surefire.its.TestNgVersionsTest
Tests run: 6, Failures: 0, Errors: 0, Skipped: 0, Time elapsed: 29.028 sec
Running org.apache.maven.surefire.its.TestFailIfNoTestsForkMode
Tests run: 6, Failures: 0, Errors: 0, Skipped: 0, Time elapsed: 25.615 sec
Running org.apache.maven.surefire.its.TimeoutForkedTest
Tests run: 1, Failures: 0, Errors: 0, Skipped: 0, Time elapsed: 8.298 sec
Running org.apache.maven.surefire.its.TestPlainOldJavaClasspath
Tests run: 1, Failures: 0, Errors: 0, Skipped: 0, Time elapsed: 4.762 sec
Running org.apache.maven.surefire.its.EnvironmentVariableTest
Tests run: 1, Failures: 0, Errors: 0, Skipped: 0, Time elapsed: 4.6 sec
Running org.apache.maven.surefire.its.TestNgSuiteXmlTest
Tests run: 2, Failures: 0, Errors: 0, Skipped: 0, Time elapsed: 10.869 sec
Running org.apache.maven.surefire.its.TestNgSuiteXmlSingleTest
Tests run: 1, Failures: 0, Errors: 0, Skipped: 0, Time elapsed: 4.579 sec
Running org.apache.maven.surefire.its.TestJUnit44Hamcrest
Tests run: 1, Failures: 0, Errors: 0, Skipped: 0, Time elapsed: 4.347 sec
Running org.apache.maven.surefire.its.WorkingDirectoryTest
Tests run: 4, Failures: 0, Errors: 0, Skipped: 0, Time elapsed: 15.3 sec
Running org.apache.maven.surefire.its.SiblingAggregatorTest
Tests run: 1, Failures: 0, Errors: 0, Skipped: 0, Time elapsed: 5.026 sec
Running org.apache.maven.surefire.its.TestUseIsolatedClassLoader
Tests run: 1, Failures: 0, Errors: 0, Skipped: 0, Time elapsed: 4.543 sec
Running org.apache.maven.surefire.its.Surefire162CharsetProviderTest
Tests run: 1, Failures: 0, Errors: 0, Skipped: 0, Time elapsed: 4.193 sec
Running org.apache.maven.surefire.its.TestNgListenerReporter
Tests run: 1, Failures: 0, Errors: 0, Skipped: 0, Time elapsed: 4.221 sec
Running org.apache.maven.surefire.its.TestNgJdk14Test
Tests run: 1, Failures: 0, Errors: 0, Skipped: 0, Time elapsed: 4.233 sec
Running org.apache.maven.surefire.its.TwoTestCasesTest
Tests run: 4, Failures: 0, Errors: 0, Skipped: 0, Time elapsed: 16.478 sec
Running org.apache.maven.surefire.its.Surefire224WellFormedXmlFailuresTest
Tests run: 1, Failures: 0, Errors: 0, Skipped: 0, Time elapsed: 4.54 sec
Running org.apache.maven.surefire.its.ForkModeTest
Tests run: 5, Failures: 0, Errors: 0, Skipped: 0, Time elapsed: 21.655 sec
Running org.apache.maven.surefire.its.Junit4VersionsTest
Tests run: 6, Failures: 0, Errors: 0, Skipped: 0, Time elapsed: 26.361 sec
Running org.apache.maven.surefire.its.TestNgBeforeMethod
Tests run: 1, Failures: 0, Errors: 0, Skipped: 0, Time elapsed: 4.354 sec
Running org.apache.maven.surefire.its.TestNgGroupThreadParallel
Tests run: 1, Failures: 0, Errors: 0, Skipped: 0, Time elapsed: 4.433 sec
Results :
Failed tests:
testExecuteError(org.apache.maven.surefire.its.TestNgExecuteErrorTest)
Tests in error:
testSystemProperties(org.apache.maven.surefire.its.SystemPropertiesTest)
testSystemPropertiesNoFork(org.apache.maven.surefire.its.SystemPropertiesTest)
Tests run: 73, Failures: 1, Errors: 2, Skipped: 0
[INFO] ------------------------------------------------------------------------
[ERROR] BUILD FAILURE
[INFO] ------------------------------------------------------------------------
[INFO] There are test failures.
Please refer to /home/hudson/workspace/surefire-trunk/jdk/1.5/label/ubuntu/trunk/surefire-integration-tests/target/surefire-reports for the individual test results.
[INFO] ------------------------------------------------------------------------
[INFO] For more information, run Maven with the -e switch
[INFO] ------------------------------------------------------------------------
[INFO] Total time: 5 minutes 49 seconds
[INFO] Finished at: Tue Apr 14 10:34:16 GMT-06:00 2009
[INFO] Final Memory: 29M/82M
[INFO] ------------------------------------------------------------------------