You are viewing a plain text version of this content. The canonical link for it is here.
Posted to builds@solr.apache.org by Policeman Jenkins Server <je...@thetaphi.de> on 2025/03/24 12:32:27 UTC

[JENKINS] Solr-main-Windows (64bit/hotspot/jdk-21.0.6) - Build # 5312 - Still Failing!

Build: https://jenkins.thetaphi.de/job/Solr-main-Windows/5312/
Java: 64bit/hotspot/jdk-21.0.6 -XX:+UseCompressedOops -XX:+UseParallelGC

All tests passed

[JENKINS] Solr-main-Windows (64bit/hotspot/jdk-21.0.6) - Build # 5322 - Still Failing!

Posted by Policeman Jenkins Server <je...@thetaphi.de>.
Build: https://jenkins.thetaphi.de/job/Solr-main-Windows/5322/
Java: 64bit/hotspot/jdk-21.0.6 -XX:+UseCompressedOops -XX:+UseG1GC

All tests passed

[JENKINS] Solr-main-Windows (64bit/hotspot/jdk-21.0.6) - Build # 5321 - Still Failing!

Posted by Policeman Jenkins Server <je...@thetaphi.de>.
Build: https://jenkins.thetaphi.de/job/Solr-main-Windows/5321/
Java: 64bit/hotspot/jdk-21.0.6 -XX:-UseCompressedOops -XX:+UseParallelGC

All tests passed

[JENKINS] Solr-main-Windows (64bit/hotspot/jdk-24) - Build # 5320 - Still Failing!

Posted by Policeman Jenkins Server <je...@thetaphi.de>.
Build: https://jenkins.thetaphi.de/job/Solr-main-Windows/5320/
Java: 64bit/hotspot/jdk-24 -XX:+UseCompressedOops -XX:+UseParallelGC

All tests passed

[JENKINS] Solr-main-Windows (64bit/hotspot/jdk-21.0.6) - Build # 5319 - Still Failing!

Posted by Policeman Jenkins Server <je...@thetaphi.de>.
Build: https://jenkins.thetaphi.de/job/Solr-main-Windows/5319/
Java: 64bit/hotspot/jdk-21.0.6 -XX:-UseCompressedOops -XX:+UseG1GC

All tests passed

[JENKINS] Solr-main-Windows (64bit/hotspot/jdk-24) - Build # 5318 - Still Failing!

Posted by Policeman Jenkins Server <je...@thetaphi.de>.
Build: https://jenkins.thetaphi.de/job/Solr-main-Windows/5318/
Java: 64bit/hotspot/jdk-24 -XX:+UseCompressedOops -XX:+UseG1GC

1 tests failed.
FAILED:  org.apache.solr.client.solrj.request.TestV2Request.classMethod

Error Message:
java.lang.AssertionError: ObjectTracker found 1 object(s) that were not released!!! [LBHttp2SolrClient]
org.apache.solr.client.solrj.impl.LBHttp2SolrClient:org.apache.solr.common.util.ObjectReleaseTracker$ObjectTrackerException: org.apache.solr.client.solrj.impl.LBHttp2SolrClient
	at org.apache.solr.common.util.ObjectReleaseTracker.track(ObjectReleaseTracker.java:54)
	at org.apache.solr.client.solrj.impl.LBSolrClient.<init>(LBSolrClient.java:413)
	at org.apache.solr.client.solrj.impl.LBHttp2SolrClient.<init>(LBHttp2SolrClient.java:103)
	at org.apache.solr.client.solrj.impl.LBHttp2SolrClient$Builder.build(LBHttp2SolrClient.java:328)
	at org.apache.solr.client.solrj.impl.CloudHttp2SolrClient.<init>(CloudHttp2SolrClient.java:76)
	at org.apache.solr.client.solrj.impl.CloudHttp2SolrClient$Builder.build(CloudHttp2SolrClient.java:478)
	at org.apache.solr.cloud.ZkController.getSolrCloudManager(ZkController.java:882)
	at org.apache.solr.cloud.Overseer.getSolrCloudManager(Overseer.java:950)
	at org.apache.solr.cloud.api.collections.OverseerCollectionMessageHandler.<init>(OverseerCollectionMessageHandler.java:107)
	at org.apache.solr.cloud.OverseerCollectionConfigSetProcessor.getOverseerMessageHandlerSelector(OverseerCollectionConfigSetProcessor.java:101)
	at org.apache.solr.cloud.OverseerCollectionConfigSetProcessor.<init>(OverseerCollectionConfigSetProcessor.java:77)
	at org.apache.solr.cloud.OverseerCollectionConfigSetProcessor.<init>(OverseerCollectionConfigSetProcessor.java:45)
	at org.apache.solr.cloud.Overseer.start(Overseer.java:771)
	at org.apache.solr.cloud.OverseerElectionContext.runLeaderProcess(OverseerElectionContext.java:76)
	at org.apache.solr.cloud.LeaderElector.runIamLeaderProcess(LeaderElector.java:169)
	at org.apache.solr.cloud.LeaderElector.checkIfIamLeader(LeaderElector.java:129)
	at org.apache.solr.cloud.LeaderElector$ElectionWatcher.process(LeaderElector.java:349)
	at org.apache.solr.common.cloud.SolrZkClient$ProcessWatchWithExecutor.lambda$process$0(SolrZkClient.java:1087)
	at org.apache.solr.common.util.ExecutorUtil$MDCAwareThreadPoolExecutor.lambda$execute$0(ExecutorUtil.java:380)
	at java.base/java.util.concurrent.ThreadPoolExecutor.runWorker(ThreadPoolExecutor.java:1095)
	at java.base/java.util.concurrent.ThreadPoolExecutor$Worker.run(ThreadPoolExecutor.java:619)
	at java.base/java.lang.Thread.run(Thread.java:1447)
Caused by: java.lang.Exception: Submitter stack trace
	at org.apache.solr.common.util.ExecutorUtil$MDCAwareThreadPoolExecutor.execute(ExecutorUtil.java:347)
	at org.apache.solr.common.cloud.SolrZkClient$ProcessWatchWithExecutor.process(SolrZkClient.java:1083)
	at org.apache.curator.framework.imps.NamespaceWatcher.process(NamespaceWatcher.java:69)
	at org.apache.zookeeper.ClientCnxn$EventThread.processEvent(ClientCnxn.java:564)
	at org.apache.zookeeper.ClientCnxn$EventThread.run(ClientCnxn.java:539)

 expected null, but was:<ObjectTracker found 1 object(s) that were not released!!! [LBHttp2SolrClient]
org.apache.solr.client.solrj.impl.LBHttp2SolrClient:org.apache.solr.common.util.ObjectReleaseTracker$ObjectTrackerException: org.apache.solr.client.solrj.impl.LBHttp2SolrClient
	at org.apache.solr.common.util.ObjectReleaseTracker.track(ObjectReleaseTracker.java:54)
	at org.apache.solr.client.solrj.impl.LBSolrClient.<init>(LBSolrClient.java:413)
	at org.apache.solr.client.solrj.impl.LBHttp2SolrClient.<init>(LBHttp2SolrClient.java:103)
	at org.apache.solr.client.solrj.impl.LBHttp2SolrClient$Builder.build(LBHttp2SolrClient.java:328)
	at org.apache.solr.client.solrj.impl.CloudHttp2SolrClient.<init>(CloudHttp2SolrClient.java:76)
	at org.apache.solr.client.solrj.impl.CloudHttp2SolrClient$Builder.build(CloudHttp2SolrClient.java:478)
	at org.apache.solr.cloud.ZkController.getSolrCloudManager(ZkController.java:882)
	at org.apache.solr.cloud.Overseer.getSolrCloudManager(Overseer.java:950)
	at org.apache.solr.cloud.api.collections.OverseerCollectionMessageHandler.<init>(OverseerCollectionMessageHandler.java:107)
	at org.apache.solr.cloud.OverseerCollectionConfigSetProcessor.getOverseerMessageHandlerSelector(OverseerCollectionConfigSetProcessor.java:101)
	at org.apache.solr.cloud.OverseerCollectionConfigSetProcessor.<init>(OverseerCollectionConfigSetProcessor.java:77)
	at org.apache.solr.cloud.OverseerCollectionConfigSetProcessor.<init>(OverseerCollectionConfigSetProcessor.java:45)
	at org.apache.solr.cloud.Overseer.start(Overseer.java:771)
	at org.apache.solr.cloud.OverseerElectionContext.runLeaderProcess(OverseerElectionContext.java:76)
	at org.apache.solr.cloud.LeaderElector.runIamLeaderProcess(LeaderElector.java:169)
	at org.apache.solr.cloud.LeaderElector.checkIfIamLeader(LeaderElector.java:129)
	at org.apache.solr.cloud.LeaderElector$ElectionWatcher.process(LeaderElector.java:349)
	at org.apache.solr.common.cloud.SolrZkClient$ProcessWatchWithExecutor.lambda$process$0(SolrZkClient.java:1087)
	at org.apache.solr.common.util.ExecutorUtil$MDCAwareThreadPoolExecutor.lambda$execute$0(ExecutorUtil.java:380)
	at java.base/java.util.concurrent.ThreadPoolExecutor.runWorker(ThreadPoolExecutor.java:1095)
	at java.base/java.util.concurrent.ThreadPoolExecutor$Worker.run(ThreadPoolExecutor.java:619)
	at java.base/java.lang.Thread.run(Thread.java:1447)
Caused by: java.lang.Exception: Submitter stack trace
	at org.apache.solr.common.util.ExecutorUtil$MDCAwareThreadPoolExecutor.execute(ExecutorUtil.java:347)
	at org.apache.solr.common.cloud.SolrZkClient$ProcessWatchWithExecutor.process(SolrZkClient.java:1083)
	at org.apache.curator.framework.imps.NamespaceWatcher.process(NamespaceWatcher.java:69)
	at org.apache.zookeeper.ClientCnxn$EventThread.processEvent(ClientCnxn.java:564)
	at org.apache.zookeeper.ClientCnxn$EventThread.run(ClientCnxn.java:539)

>

Stack Trace:
java.lang.AssertionError: ObjectTracker found 1 object(s) that were not released!!! [LBHttp2SolrClient]
org.apache.solr.client.solrj.impl.LBHttp2SolrClient:org.apache.solr.common.util.ObjectReleaseTracker$ObjectTrackerException: org.apache.solr.client.solrj.impl.LBHttp2SolrClient
	at org.apache.solr.common.util.ObjectReleaseTracker.track(ObjectReleaseTracker.java:54)
	at org.apache.solr.client.solrj.impl.LBSolrClient.<init>(LBSolrClient.java:413)
	at org.apache.solr.client.solrj.impl.LBHttp2SolrClient.<init>(LBHttp2SolrClient.java:103)
	at org.apache.solr.client.solrj.impl.LBHttp2SolrClient$Builder.build(LBHttp2SolrClient.java:328)
	at org.apache.solr.client.solrj.impl.CloudHttp2SolrClient.<init>(CloudHttp2SolrClient.java:76)
	at org.apache.solr.client.solrj.impl.CloudHttp2SolrClient$Builder.build(CloudHttp2SolrClient.java:478)
	at org.apache.solr.cloud.ZkController.getSolrCloudManager(ZkController.java:882)
	at org.apache.solr.cloud.Overseer.getSolrCloudManager(Overseer.java:950)
	at org.apache.solr.cloud.api.collections.OverseerCollectionMessageHandler.<init>(OverseerCollectionMessageHandler.java:107)
	at org.apache.solr.cloud.OverseerCollectionConfigSetProcessor.getOverseerMessageHandlerSelector(OverseerCollectionConfigSetProcessor.java:101)
	at org.apache.solr.cloud.OverseerCollectionConfigSetProcessor.<init>(OverseerCollectionConfigSetProcessor.java:77)
	at org.apache.solr.cloud.OverseerCollectionConfigSetProcessor.<init>(OverseerCollectionConfigSetProcessor.java:45)
	at org.apache.solr.cloud.Overseer.start(Overseer.java:771)
	at org.apache.solr.cloud.OverseerElectionContext.runLeaderProcess(OverseerElectionContext.java:76)
	at org.apache.solr.cloud.LeaderElector.runIamLeaderProcess(LeaderElector.java:169)
	at org.apache.solr.cloud.LeaderElector.checkIfIamLeader(LeaderElector.java:129)
	at org.apache.solr.cloud.LeaderElector$ElectionWatcher.process(LeaderElector.java:349)
	at org.apache.solr.common.cloud.SolrZkClient$ProcessWatchWithExecutor.lambda$process$0(SolrZkClient.java:1087)
	at org.apache.solr.common.util.ExecutorUtil$MDCAwareThreadPoolExecutor.lambda$execute$0(ExecutorUtil.java:380)
	at java.base/java.util.concurrent.ThreadPoolExecutor.runWorker(ThreadPoolExecutor.java:1095)
	at java.base/java.util.concurrent.ThreadPoolExecutor$Worker.run(ThreadPoolExecutor.java:619)
	at java.base/java.lang.Thread.run(Thread.java:1447)
Caused by: java.lang.Exception: Submitter stack trace
	at org.apache.solr.common.util.ExecutorUtil$MDCAwareThreadPoolExecutor.execute(ExecutorUtil.java:347)
	at org.apache.solr.common.cloud.SolrZkClient$ProcessWatchWithExecutor.process(SolrZkClient.java:1083)
	at org.apache.curator.framework.imps.NamespaceWatcher.process(NamespaceWatcher.java:69)
	at org.apache.zookeeper.ClientCnxn$EventThread.processEvent(ClientCnxn.java:564)
	at org.apache.zookeeper.ClientCnxn$EventThread.run(ClientCnxn.java:539)

 expected null, but was:<ObjectTracker found 1 object(s) that were not released!!! [LBHttp2SolrClient]
org.apache.solr.client.solrj.impl.LBHttp2SolrClient:org.apache.solr.common.util.ObjectReleaseTracker$ObjectTrackerException: org.apache.solr.client.solrj.impl.LBHttp2SolrClient
	at org.apache.solr.common.util.ObjectReleaseTracker.track(ObjectReleaseTracker.java:54)
	at org.apache.solr.client.solrj.impl.LBSolrClient.<init>(LBSolrClient.java:413)
	at org.apache.solr.client.solrj.impl.LBHttp2SolrClient.<init>(LBHttp2SolrClient.java:103)
	at org.apache.solr.client.solrj.impl.LBHttp2SolrClient$Builder.build(LBHttp2SolrClient.java:328)
	at org.apache.solr.client.solrj.impl.CloudHttp2SolrClient.<init>(CloudHttp2SolrClient.java:76)
	at org.apache.solr.client.solrj.impl.CloudHttp2SolrClient$Builder.build(CloudHttp2SolrClient.java:478)
	at org.apache.solr.cloud.ZkController.getSolrCloudManager(ZkController.java:882)
	at org.apache.solr.cloud.Overseer.getSolrCloudManager(Overseer.java:950)
	at org.apache.solr.cloud.api.collections.OverseerCollectionMessageHandler.<init>(OverseerCollectionMessageHandler.java:107)
	at org.apache.solr.cloud.OverseerCollectionConfigSetProcessor.getOverseerMessageHandlerSelector(OverseerCollectionConfigSetProcessor.java:101)
	at org.apache.solr.cloud.OverseerCollectionConfigSetProcessor.<init>(OverseerCollectionConfigSetProcessor.java:77)
	at org.apache.solr.cloud.OverseerCollectionConfigSetProcessor.<init>(OverseerCollectionConfigSetProcessor.java:45)
	at org.apache.solr.cloud.Overseer.start(Overseer.java:771)
	at org.apache.solr.cloud.OverseerElectionContext.runLeaderProcess(OverseerElectionContext.java:76)
	at org.apache.solr.cloud.LeaderElector.runIamLeaderProcess(LeaderElector.java:169)
	at org.apache.solr.cloud.LeaderElector.checkIfIamLeader(LeaderElector.java:129)
	at org.apache.solr.cloud.LeaderElector$ElectionWatcher.process(LeaderElector.java:349)
	at org.apache.solr.common.cloud.SolrZkClient$ProcessWatchWithExecutor.lambda$process$0(SolrZkClient.java:1087)
	at org.apache.solr.common.util.ExecutorUtil$MDCAwareThreadPoolExecutor.lambda$execute$0(ExecutorUtil.java:380)
	at java.base/java.util.concurrent.ThreadPoolExecutor.runWorker(ThreadPoolExecutor.java:1095)
	at java.base/java.util.concurrent.ThreadPoolExecutor$Worker.run(ThreadPoolExecutor.java:619)
	at java.base/java.lang.Thread.run(Thread.java:1447)
Caused by: java.lang.Exception: Submitter stack trace
	at org.apache.solr.common.util.ExecutorUtil$MDCAwareThreadPoolExecutor.execute(ExecutorUtil.java:347)
	at org.apache.solr.common.cloud.SolrZkClient$ProcessWatchWithExecutor.process(SolrZkClient.java:1083)
	at org.apache.curator.framework.imps.NamespaceWatcher.process(NamespaceWatcher.java:69)
	at org.apache.zookeeper.ClientCnxn$EventThread.processEvent(ClientCnxn.java:564)
	at org.apache.zookeeper.ClientCnxn$EventThread.run(ClientCnxn.java:539)

>
	at __randomizedtesting.SeedInfo.seed([F29CAA340A40DB71]:0)
	at org.junit.Assert.fail(Assert.java:89)
	at org.junit.Assert.failNotNull(Assert.java:756)
	at org.junit.Assert.assertNull(Assert.java:738)
	at org.apache.solr.SolrTestCase$1.afterIfSuccessful(SolrTestCase.java:103)
	at com.carrotsearch.randomizedtesting.rules.TestRuleAdapter$1.afterIfSuccessful(TestRuleAdapter.java:36)
	at com.carrotsearch.randomizedtesting.rules.StatementAdapter.evaluate(StatementAdapter.java:37)
	at com.carrotsearch.randomizedtesting.rules.StatementAdapter.evaluate(StatementAdapter.java:36)
	at org.apache.lucene.tests.util.AbstractBeforeAfterRule$1.evaluate(AbstractBeforeAfterRule.java:43)
	at com.carrotsearch.randomizedtesting.rules.SystemPropertiesRestoreRule$1.evaluate(SystemPropertiesRestoreRule.java:80)
	at org.junit.rules.RunRules.evaluate(RunRules.java:20)
	at org.apache.lucene.tests.util.AbstractBeforeAfterRule$1.evaluate(AbstractBeforeAfterRule.java:43)
	at com.carrotsearch.randomizedtesting.rules.StatementAdapter.evaluate(StatementAdapter.java:36)
	at org.apache.lucene.tests.util.TestRuleStoreClassName$1.evaluate(TestRuleStoreClassName.java:38)
	at com.carrotsearch.randomizedtesting.rules.NoShadowingOrOverridesOnMethodsRule$1.evaluate(NoShadowingOrOverridesOnMethodsRule.java:40)
	at com.carrotsearch.randomizedtesting.rules.NoShadowingOrOverridesOnMethodsRule$1.evaluate(NoShadowingOrOverridesOnMethodsRule.java:40)
	at com.carrotsearch.randomizedtesting.rules.StatementAdapter.evaluate(StatementAdapter.java:36)
	at com.carrotsearch.randomizedtesting.rules.StatementAdapter.evaluate(StatementAdapter.java:36)
	at org.apache.lucene.tests.util.TestRuleAssertionsRequired$1.evaluate(TestRuleAssertionsRequired.java:53)
	at org.apache.lucene.tests.util.AbstractBeforeAfterRule$1.evaluate(AbstractBeforeAfterRule.java:43)
	at org.apache.lucene.tests.util.TestRuleMarkFailure$1.evaluate(TestRuleMarkFailure.java:44)
	at org.apache.lucene.tests.util.TestRuleIgnoreAfterMaxFailures$1.evaluate(TestRuleIgnoreAfterMaxFailures.java:60)
	at org.apache.lucene.tests.util.TestRuleIgnoreTestSuites$1.evaluate(TestRuleIgnoreTestSuites.java:47)
	at org.junit.rules.RunRules.evaluate(RunRules.java:20)
	at com.carrotsearch.randomizedtesting.rules.StatementAdapter.evaluate(StatementAdapter.java:36)
	at com.carrotsearch.randomizedtesting.ThreadLeakControl$StatementRunner.run(ThreadLeakControl.java:390)
	at com.carrotsearch.randomizedtesting.ThreadLeakControl.lambda$forkTimeoutingTask$0(ThreadLeakControl.java:850)
	at java.base/java.lang.Thread.run(Thread.java:1447)

[JENKINS] Solr-main-Windows (64bit/hotspot/jdk-23.0.2) - Build # 5317 - Still Failing!

Posted by Policeman Jenkins Server <je...@thetaphi.de>.
Build: https://jenkins.thetaphi.de/job/Solr-main-Windows/5317/
Java: 64bit/hotspot/jdk-23.0.2 -XX:+UseCompressedOops -XX:+UseG1GC

All tests passed

[JENKINS] Solr-main-Windows (64bit/hotspot/jdk-22.0.2) - Build # 5316 - Still Failing!

Posted by Policeman Jenkins Server <je...@thetaphi.de>.
Build: https://jenkins.thetaphi.de/job/Solr-main-Windows/5316/
Java: 64bit/hotspot/jdk-22.0.2 -XX:-UseCompressedOops -XX:+UseParallelGC

All tests passed

[JENKINS] Solr-main-Windows (64bit/hotspot/jdk-23.0.2) - Build # 5315 - Still Failing!

Posted by Policeman Jenkins Server <je...@thetaphi.de>.
Build: https://jenkins.thetaphi.de/job/Solr-main-Windows/5315/
Java: 64bit/hotspot/jdk-23.0.2 -XX:-UseCompressedOops -XX:+UseG1GC

1 tests failed.
FAILED:  org.apache.solr.gcs.GCSIncrementalBackupTest.testSkipConfigset

Error Message:
org.apache.solr.common.SolrException: Could not find a healthy node to handle the request.

Stack Trace:
org.apache.solr.common.SolrException: Could not find a healthy node to handle the request.
	at __randomizedtesting.SeedInfo.seed([9A557C4CF7013A86:91ACE3456F436C91]:0)
	at app//org.apache.solr.client.solrj.impl.CloudSolrClient.sendRequest(CloudSolrClient.java:1142)
	at app//org.apache.solr.client.solrj.impl.CloudSolrClient.requestWithRetryOnStaleState(CloudSolrClient.java:846)
	at app//org.apache.solr.client.solrj.impl.CloudSolrClient.requestWithRetryOnStaleState(CloudSolrClient.java:982)
	at app//org.apache.solr.client.solrj.impl.CloudSolrClient.requestWithRetryOnStaleState(CloudSolrClient.java:982)
	at app//org.apache.solr.client.solrj.impl.CloudSolrClient.requestWithRetryOnStaleState(CloudSolrClient.java:982)
	at app//org.apache.solr.client.solrj.impl.CloudSolrClient.requestWithRetryOnStaleState(CloudSolrClient.java:982)
	at app//org.apache.solr.client.solrj.impl.CloudSolrClient.requestWithRetryOnStaleState(CloudSolrClient.java:982)
	at app//org.apache.solr.client.solrj.impl.CloudSolrClient.request(CloudSolrClient.java:778)
	at app//org.apache.solr.client.solrj.SolrRequest.process(SolrRequest.java:260)
	at app//org.apache.solr.client.solrj.SolrClient.query(SolrClient.java:926)
	at app//org.apache.solr.cloud.api.collections.AbstractIncrementalBackupTest.testSkipConfigset(AbstractIncrementalBackupTest.java:418)
	at java.base@23.0.2/jdk.internal.reflect.DirectMethodHandleAccessor.invoke(DirectMethodHandleAccessor.java:103)
	at java.base@23.0.2/java.lang.reflect.Method.invoke(Method.java:580)
	at app//com.carrotsearch.randomizedtesting.RandomizedRunner.invoke(RandomizedRunner.java:1758)
	at app//com.carrotsearch.randomizedtesting.RandomizedRunner$8.evaluate(RandomizedRunner.java:946)
	at app//com.carrotsearch.randomizedtesting.RandomizedRunner$9.evaluate(RandomizedRunner.java:982)
	at app//com.carrotsearch.randomizedtesting.RandomizedRunner$10.evaluate(RandomizedRunner.java:996)
	at app//com.carrotsearch.randomizedtesting.rules.SystemPropertiesRestoreRule$1.evaluate(SystemPropertiesRestoreRule.java:80)
	at app//org.junit.rules.RunRules.evaluate(RunRules.java:20)
	at app//org.apache.lucene.tests.util.TestRuleSetupTeardownChained$1.evaluate(TestRuleSetupTeardownChained.java:48)
	at app//org.apache.lucene.tests.util.AbstractBeforeAfterRule$1.evaluate(AbstractBeforeAfterRule.java:43)
	at app//org.apache.lucene.tests.util.TestRuleThreadAndTestName$1.evaluate(TestRuleThreadAndTestName.java:45)
	at app//org.apache.lucene.tests.util.TestRuleIgnoreAfterMaxFailures$1.evaluate(TestRuleIgnoreAfterMaxFailures.java:60)
	at app//org.apache.lucene.tests.util.TestRuleMarkFailure$1.evaluate(TestRuleMarkFailure.java:44)
	at app//org.junit.rules.RunRules.evaluate(RunRules.java:20)
	at app//com.carrotsearch.randomizedtesting.rules.StatementAdapter.evaluate(StatementAdapter.java:36)
	at app//com.carrotsearch.randomizedtesting.ThreadLeakControl$StatementRunner.run(ThreadLeakControl.java:390)
	at app//com.carrotsearch.randomizedtesting.ThreadLeakControl.forkTimeoutingTask(ThreadLeakControl.java:843)
	at app//com.carrotsearch.randomizedtesting.ThreadLeakControl$3.evaluate(ThreadLeakControl.java:490)
	at app//com.carrotsearch.randomizedtesting.RandomizedRunner.runSingleTest(RandomizedRunner.java:955)
	at app//com.carrotsearch.randomizedtesting.RandomizedRunner$5.evaluate(RandomizedRunner.java:840)
	at app//com.carrotsearch.randomizedtesting.RandomizedRunner$6.evaluate(RandomizedRunner.java:891)
	at app//com.carrotsearch.randomizedtesting.RandomizedRunner$7.evaluate(RandomizedRunner.java:902)
	at app//com.carrotsearch.randomizedtesting.rules.StatementAdapter.evaluate(StatementAdapter.java:36)
	at app//com.carrotsearch.randomizedtesting.rules.StatementAdapter.evaluate(StatementAdapter.java:36)
	at app//org.apache.lucene.tests.util.AbstractBeforeAfterRule$1.evaluate(AbstractBeforeAfterRule.java:43)
	at app//com.carrotsearch.randomizedtesting.rules.SystemPropertiesRestoreRule$1.evaluate(SystemPropertiesRestoreRule.java:80)
	at app//org.junit.rules.RunRules.evaluate(RunRules.java:20)
	at app//org.apache.lucene.tests.util.AbstractBeforeAfterRule$1.evaluate(AbstractBeforeAfterRule.java:43)
	at app//com.carrotsearch.randomizedtesting.rules.StatementAdapter.evaluate(StatementAdapter.java:36)
	at app//org.apache.lucene.tests.util.TestRuleStoreClassName$1.evaluate(TestRuleStoreClassName.java:38)
	at app//com.carrotsearch.randomizedtesting.rules.NoShadowingOrOverridesOnMethodsRule$1.evaluate(NoShadowingOrOverridesOnMethodsRule.java:40)
	at app//com.carrotsearch.randomizedtesting.rules.NoShadowingOrOverridesOnMethodsRule$1.evaluate(NoShadowingOrOverridesOnMethodsRule.java:40)
	at app//com.carrotsearch.randomizedtesting.rules.StatementAdapter.evaluate(StatementAdapter.java:36)
	at app//com.carrotsearch.randomizedtesting.rules.StatementAdapter.evaluate(StatementAdapter.java:36)
	at app//org.apache.lucene.tests.util.TestRuleAssertionsRequired$1.evaluate(TestRuleAssertionsRequired.java:53)
	at app//org.apache.lucene.tests.util.AbstractBeforeAfterRule$1.evaluate(AbstractBeforeAfterRule.java:43)
	at app//org.apache.lucene.tests.util.TestRuleMarkFailure$1.evaluate(TestRuleMarkFailure.java:44)
	at app//org.apache.lucene.tests.util.TestRuleIgnoreAfterMaxFailures$1.evaluate(TestRuleIgnoreAfterMaxFailures.java:60)
	at app//org.apache.lucene.tests.util.TestRuleIgnoreTestSuites$1.evaluate(TestRuleIgnoreTestSuites.java:47)
	at app//org.junit.rules.RunRules.evaluate(RunRules.java:20)
	at app//com.carrotsearch.randomizedtesting.rules.StatementAdapter.evaluate(StatementAdapter.java:36)
	at app//com.carrotsearch.randomizedtesting.ThreadLeakControl$StatementRunner.run(ThreadLeakControl.java:390)
	at app//com.carrotsearch.randomizedtesting.ThreadLeakControl.lambda$forkTimeoutingTask$0(ThreadLeakControl.java:850)
	at java.base@23.0.2/java.lang.Thread.run(Thread.java:1575)

[JENKINS] Solr-main-Windows (64bit/hotspot/jdk-24) - Build # 5313 - Still Failing!

Posted by Policeman Jenkins Server <je...@thetaphi.de>.
Build: https://jenkins.thetaphi.de/job/Solr-main-Windows/5313/
Java: 64bit/hotspot/jdk-24 -XX:-UseCompressedOops -XX:+UseParallelGC

All tests passed

Re: [JENKINS] Solr-main-Windows (64bit/hotspot/jdk-21.0.6) - Build # 5312 - Still Failing!

Posted by Houston Putman <ho...@apache.org>.
Thanks for taking a look at these. Ostensibly, Windows is failing because
there is an System.exit() being called somewhere in the codepath of a
SolrCLI test. We have a PR to address it, which should hopefully be merged
relatively soon.

https://github.com/apache/solr/pull/3258

- Houston

On Mon, Mar 24, 2025 at 10:12 AM Uwe Schindler <uw...@thetaphi.de> wrote:

> Hi,
>
> I can reproduce all failures on Windows. I can't run any :solr:core:test
> on windows anymore, with neither JDK21 or any later version). I always
> fails with exactly that message (just different port number):
>
> WARNING: Test org.apache.solr.TestRandomFaceting wrote 14,420,636 bytes
> of output.
> WARNING: Test org.apache.solr.schema.DocValuesTest wrote 11,400,417
> bytes of output.
> WARNING: Test org.apache.solr.schema.TestCloudSchemaless wrote
> 14,885,156 bytes of output.
>
> Unexpected exception thrown.
> org.gradle.internal.remote.internal.MessageIOException: Could not write
> '/127.0.0.1:53478'.
>          at
>
> org.gradle.internal.remote.internal.inet.SocketConnection.flush(SocketConnection.java:145)
>          at
>
> org.gradle.internal.remote.internal.hub.MessageHub$ConnectionDispatch.run(MessageHub.java:333)
>          at
>
> org.gradle.internal.concurrent.ExecutorPolicy$CatchAndRecordFailures.onExecute(ExecutorPolicy.java:64)
>          at
>
> org.gradle.internal.concurrent.AbstractManagedExecutor$1.run(AbstractManagedExecutor.java:48)
>          at
>
> java.base/java.util.concurrent.ThreadPoolExecutor.runWorker(ThreadPoolExecutor.java:1144)
>          at
>
> java.base/java.util.concurrent.ThreadPoolExecutor$Worker.run(ThreadPoolExecutor.java:642)
>          at java.base/java.lang.Thread.run(Thread.java:1583)
> Caused by: java.io.IOException: Connection reset by peer
>          at java.base/sun.nio.ch.SocketDispatcher.write0(Native Method)
>          at
> java.base/sun.nio.ch.SocketDispatcher.write(SocketDispatcher.java:54)
>          at
> java.base/sun.nio.ch.IOUtil.writeFromNativeBuffer(IOUtil.java:137)
>          at java.base/sun.nio.ch.IOUtil.write(IOUtil.java:81)
>          at java.base/sun.nio.ch.IOUtil.write(IOUtil.java:58)
>          at
> java.base/sun.nio.ch.SocketChannelImpl.write(SocketChannelImpl.java:542)
>          at
>
> org.gradle.internal.remote.internal.inet.SocketConnection$SocketOutputStream.writeWithNonBlockingRetry(SocketConnection.java:285)
>          at
>
> org.gradle.internal.remote.internal.inet.SocketConnection$SocketOutputStream.writeBufferToChannel(SocketConnection.java:272)
>          at
>
> org.gradle.internal.remote.internal.inet.SocketConnection$SocketOutputStream.flush(SocketConnection.java:266)
>          at
>
> org.gradle.internal.remote.internal.inet.SocketConnection.flush(SocketConnection.java:143)
>          ... 6 more
>
>  > Task :solr:core:test
> :solr:core:test (SUCCESS): 5018 test(s), 209 skipped
>
> It looks like somehow the connection between test runner and Gradle or
> between Gradle Daemon stops. As this happens after a long time of
> waiting, I have the feeling that some test is taking too long and then
> the connection is reset.
>
> This is not an issue of JDK 24 or later, it is a general WIndows
> problem. I am no longer possible to run the tests without that failure.
>
> Uwe
>
> Am 24.03.2025 um 13:32 schrieb Policeman Jenkins Server:
> > Build: https://jenkins.thetaphi.de/job/Solr-main-Windows/5312/
> > Java: 64bit/hotspot/jdk-21.0.6 -XX:+UseCompressedOops -XX:+UseParallelGC
> >
> > All tests passed
> >
> > ---------------------------------------------------------------------
> > To unsubscribe, e-mail: builds-unsubscribe@solr.apache.org
> > For additional commands, e-mail: builds-help@solr.apache.org
>
> --
> Uwe Schindler
> Achterdiek 19, D-28357 Bremen
> https://www.thetaphi.de
> eMail: uwe@thetaphi.de
>
>
> ---------------------------------------------------------------------
> To unsubscribe, e-mail: dev-unsubscribe@solr.apache.org
> For additional commands, e-mail: dev-help@solr.apache.org
>
>

Re: [JENKINS] Solr-main-Windows (64bit/hotspot/jdk-21.0.6) - Build # 5312 - Still Failing!

Posted by Uwe Schindler <uw...@thetaphi.de>.
Hi,

I can reproduce all failures on Windows. I can't run any :solr:core:test 
on windows anymore, with neither JDK21 or any later version). I always 
fails with exactly that message (just different port number):

WARNING: Test org.apache.solr.TestRandomFaceting wrote 14,420,636 bytes 
of output.
WARNING: Test org.apache.solr.schema.DocValuesTest wrote 11,400,417 
bytes of output.
WARNING: Test org.apache.solr.schema.TestCloudSchemaless wrote 
14,885,156 bytes of output.

Unexpected exception thrown.
org.gradle.internal.remote.internal.MessageIOException: Could not write 
'/127.0.0.1:53478'.
         at 
org.gradle.internal.remote.internal.inet.SocketConnection.flush(SocketConnection.java:145)
         at 
org.gradle.internal.remote.internal.hub.MessageHub$ConnectionDispatch.run(MessageHub.java:333)
         at 
org.gradle.internal.concurrent.ExecutorPolicy$CatchAndRecordFailures.onExecute(ExecutorPolicy.java:64)
         at 
org.gradle.internal.concurrent.AbstractManagedExecutor$1.run(AbstractManagedExecutor.java:48)
         at 
java.base/java.util.concurrent.ThreadPoolExecutor.runWorker(ThreadPoolExecutor.java:1144)
         at 
java.base/java.util.concurrent.ThreadPoolExecutor$Worker.run(ThreadPoolExecutor.java:642)
         at java.base/java.lang.Thread.run(Thread.java:1583)
Caused by: java.io.IOException: Connection reset by peer
         at java.base/sun.nio.ch.SocketDispatcher.write0(Native Method)
         at 
java.base/sun.nio.ch.SocketDispatcher.write(SocketDispatcher.java:54)
         at 
java.base/sun.nio.ch.IOUtil.writeFromNativeBuffer(IOUtil.java:137)
         at java.base/sun.nio.ch.IOUtil.write(IOUtil.java:81)
         at java.base/sun.nio.ch.IOUtil.write(IOUtil.java:58)
         at 
java.base/sun.nio.ch.SocketChannelImpl.write(SocketChannelImpl.java:542)
         at 
org.gradle.internal.remote.internal.inet.SocketConnection$SocketOutputStream.writeWithNonBlockingRetry(SocketConnection.java:285)
         at 
org.gradle.internal.remote.internal.inet.SocketConnection$SocketOutputStream.writeBufferToChannel(SocketConnection.java:272)
         at 
org.gradle.internal.remote.internal.inet.SocketConnection$SocketOutputStream.flush(SocketConnection.java:266)
         at 
org.gradle.internal.remote.internal.inet.SocketConnection.flush(SocketConnection.java:143)
         ... 6 more

 > Task :solr:core:test
:solr:core:test (SUCCESS): 5018 test(s), 209 skipped

It looks like somehow the connection between test runner and Gradle or 
between Gradle Daemon stops. As this happens after a long time of 
waiting, I have the feeling that some test is taking too long and then 
the connection is reset.

This is not an issue of JDK 24 or later, it is a general WIndows 
problem. I am no longer possible to run the tests without that failure.

Uwe

Am 24.03.2025 um 13:32 schrieb Policeman Jenkins Server:
> Build: https://jenkins.thetaphi.de/job/Solr-main-Windows/5312/
> Java: 64bit/hotspot/jdk-21.0.6 -XX:+UseCompressedOops -XX:+UseParallelGC
>
> All tests passed
>
> ---------------------------------------------------------------------
> To unsubscribe, e-mail: builds-unsubscribe@solr.apache.org
> For additional commands, e-mail: builds-help@solr.apache.org

-- 
Uwe Schindler
Achterdiek 19, D-28357 Bremen
https://www.thetaphi.de
eMail: uwe@thetaphi.de


---------------------------------------------------------------------
To unsubscribe, e-mail: dev-unsubscribe@solr.apache.org
For additional commands, e-mail: dev-help@solr.apache.org