You are viewing a plain text version of this content. The canonical link for it is here.
Posted to builds@solr.apache.org by Apache Jenkins Server <je...@builds.apache.org> on 2023/02/08 06:14:04 UTC

[JENKINS] Solr » Solr-Check-main - Build # 6043 - Unstable!

Build: https://ci-builds.apache.org/job/Solr/job/Solr-Check-main/6043/

3 tests failed.
FAILED:  org.apache.solr.update.RootFieldTest.classMethod

Error Message:
org.apache.solr.common.SolrException: Error CREATEing SolrCore 'collection1': Unable to create core [collection1] Caused by: No system property or default value specified for solr.test.sys.prop2 value:

  
  ${solr.data.dir:}

  
  
    1000000
    2000000
    3000000
    4000000
    ${solr.hdfs.home:}
    ${solr.hdfs.blockcache.enabled:true}
    ${solr.hdfs.blockcache.global:true}
    ${solr.hdfs.blockcache.write.enabled:false}
    ${solr.hdfs.blockcache.blocksperbank:10}
    ${solr.hdfs.blockcache.slab.count:1}
  

  

  ${tests.luceneMatchVersion:LATEST}

  

  
  
  
  
  ${useCompoundFile:false}

  ${solr.tests.maxBufferedDocs}
  ${solr.tests.ramBufferSizeMB}
  ${solr.tests.maxCommitMergeWaitTime:-1}
  ${solr.tests.ramPerThreadHardLimitMB}

  

  1000
  10000

  
  ${solr.tests.lockType:single}

  ${solr.tests.infostream:false}



  

    
      ${solr.autoCommit.maxTime:-1}
    

    

    
      ${solr.ulog.dir:}
    

    
      ${solr.commitwithin.softcommit:true}
    

  

  
    
    ${solr.max.booleanClauses:1024}

    
    

    

    

    

    
    true

    

    

    10

    
    

    
    
    

    
    

    2000

  

  

  
  
    true
  

  
    
     dismax
     *:*
     0.01
     
        text^0.5 features_t^1.0 subject^1.4 title_stemmed^2.0
     
     
        text^0.2 features_t^1.1 subject^1.4 title_stemmed^2.0 title^1.5
     
     
        weight^0.5 recip(rord(id),1,1000,1000)^0.3
     
     
        3<-1 5<-2 6<90%
     
     100
    
  

  

  
  
    
      4
      true
      text,name,subject,title,whitetok
    
  

  
  
    
      4
      true
      text,name,subject,title,whitetok
    
  



  
    
    lowerpunctfilt

    
      default
      lowerfilt
      spellchecker1
      false
    
    
      direct
      DirectSolrSpellChecker
      lowerfilt
      3
    
    
      directMQF2
      DirectSolrSpellChecker
      lowerfilt
      3
      2
    
    
      wordbreak
      solr.WordBreakSolrSpellChecker
      lowerfilt
      true
      true
      10
    
    
      multipleFields
      lowerfilt1and2
      spellcheckerMultipleFields
      false
     
    
    
      jarowinkler
      lowerfilt
      
      org.apache.lucene.search.spell.JaroWinklerDistance
      spellchecker2

    
    
      solr.FileBasedSpellChecker
      external
      spellings.txt
      UTF-8
      spellchecker3
    
    
    
      freq
      lowerfilt
      spellcheckerFreq
      
      freq
      false
    
    
      fqcn
      lowerfilt
      spellcheckerFQCN
      org.apache.solr.spelling.SampleComparator
      false
    
    
      perDict
      org.apache.solr.handler.component.DummyCustomParamSpellChecker
      lowerfilt
    
  

    


  
  

  
    
      
      false
      
      false
      
      1
    
    
      spellcheck
    
  
  
    
      direct
      false
      false
      1
    
    
      spellcheck
    
  
  
    
      default
      wordbreak
      20
    
    
      spellcheck
    
  
  
    
      direct
      wordbreak
      20
    
    
      spellcheck
    
  
  
      
        dismax
        lowerfilt1^1
      
      
        spellcheck
      
 

  

  

  

  
    

    
    
      tvComponent
    
  

  
  

  
  
   
   
    
     100
    
   

   
    
     70
    
   

   
   
    
     <em>
     </em>
    
   

   
   

   
   
   

   
     
       10
       .,!? 	

     
   

   
     
       WORD
       en
       US
     
   
  
  

  
    
    
      max-age=30, public
    
  

  
    
      foo_s
    
    
      foo_s:bar
    
  
  
    
      foo_s
      foo_s:bar
    
  

  
  prefix-${solr.test.sys.prop2}-suffix

  

  
    
      
        uniq
        uniq2
        uniq3
      
    
    
  

  
    
    
      regex_dup_A_s
      x
      x_x
    
    
    
      regex_dup_B_s
      x
      x_x
    
    
  

  
    
    
      regex_dup_A_s
      x
      x_x
    
    
      regex_dup_B_s
      x
      x_x
    
    
  

  
    
    org.apache.solr.rest.ManagedResourceStorage$InMemoryStorageIO
  

  
  
    
      text
    
  

  
  
    text
  
  
    nl
  



Stack Trace:
org.apache.solr.common.SolrException: Error CREATEing SolrCore 'collection1': Unable to create core [collection1] Caused by: No system property or default value specified for solr.test.sys.prop2 value:

  
  ${solr.data.dir:}

  
  
    1000000
    2000000
    3000000
    4000000
    ${solr.hdfs.home:}
    ${solr.hdfs.blockcache.enabled:true}
    ${solr.hdfs.blockcache.global:true}
    ${solr.hdfs.blockcache.write.enabled:false}
    ${solr.hdfs.blockcache.blocksperbank:10}
    ${solr.hdfs.blockcache.slab.count:1}
  

  

  ${tests.luceneMatchVersion:LATEST}

  

  
  
  
  
  ${useCompoundFile:false}

  ${solr.tests.maxBufferedDocs}
  ${solr.tests.ramBufferSizeMB}
  ${solr.tests.maxCommitMergeWaitTime:-1}
  ${solr.tests.ramPerThreadHardLimitMB}

  

  1000
  10000

  
  ${solr.tests.lockType:single}

  ${solr.tests.infostream:false}



  

    
      ${solr.autoCommit.maxTime:-1}
    

    

    
      ${solr.ulog.dir:}
    

    
      ${solr.commitwithin.softcommit:true}
    

  

  
    
    ${solr.max.booleanClauses:1024}

    
    

    

    

    

    
    true

    

    

    10

    
    

    
    
    

    
    

    2000

  

  

  
  
    true
  

  
    
     dismax
     *:*
     0.01
     
        text^0.5 features_t^1.0 subject^1.4 title_stemmed^2.0
     
     
        text^0.2 features_t^1.1 subject^1.4 title_stemmed^2.0 title^1.5
     
     
        weight^0.5 recip(rord(id),1,1000,1000)^0.3
     
     
        3<-1 5<-2 6<90%
     
     100
    
  

  

  
  
    
      4
      true
      text,name,subject,title,whitetok
    
  

  
  
    
      4
      true
      text,name,subject,title,whitetok
    
  



  
    
    lowerpunctfilt

    
      default
      lowerfilt
      spellchecker1
      false
    
    
      direct
      DirectSolrSpellChecker
      lowerfilt
      3
    
    
      directMQF2
      DirectSolrSpellChecker
      lowerfilt
      3
      2
    
    
      wordbreak
      solr.WordBreakSolrSpellChecker
      lowerfilt
      true
      true
      10
    
    
      multipleFields
      lowerfilt1and2
      spellcheckerMultipleFields
      false
     
    
    
      jarowinkler
      lowerfilt
      
      org.apache.lucene.search.spell.JaroWinklerDistance
      spellchecker2

    
    
      solr.FileBasedSpellChecker
      external
      spellings.txt
      UTF-8
      spellchecker3
    
    
    
      freq
      lowerfilt
      spellcheckerFreq
      
      freq
      false
    
    
      fqcn
      lowerfilt
      spellcheckerFQCN
      org.apache.solr.spelling.SampleComparator
      false
    
    
      perDict
      org.apache.solr.handler.component.DummyCustomParamSpellChecker
      lowerfilt
    
  

    


  
  

  
    
      
      false
      
      false
      
      1
    
    
      spellcheck
    
  
  
    
      direct
      false
      false
      1
    
    
      spellcheck
    
  
  
    
      default
      wordbreak
      20
    
    
      spellcheck
    
  
  
    
      direct
      wordbreak
      20
    
    
      spellcheck
    
  
  
      
        dismax
        lowerfilt1^1
      
      
        spellcheck
      
 

  

  

  

  
    

    
    
      tvComponent
    
  

  
  

  
  
   
   
    
     100
    
   

   
    
     70
    
   

   
   
    
     <em>
     </em>
    
   

   
   

   
   
   

   
     
       10
       .,!? 	

     
   

   
     
       WORD
       en
       US
     
   
  
  

  
    
    
      max-age=30, public
    
  

  
    
      foo_s
    
    
      foo_s:bar
    
  
  
    
      foo_s
      foo_s:bar
    
  

  
  prefix-${solr.test.sys.prop2}-suffix

  

  
    
      
        uniq
        uniq2
        uniq3
      
    
    
  

  
    
    
      regex_dup_A_s
      x
      x_x
    
    
    
      regex_dup_B_s
      x
      x_x
    
    
  

  
    
    
      regex_dup_A_s
      x
      x_x
    
    
      regex_dup_B_s
      x
      x_x
    
    
  

  
    
    org.apache.solr.rest.ManagedResourceStorage$InMemoryStorageIO
  

  
  
    
      text
    
  

  
  
    text
  
  
    nl
  


	at __randomizedtesting.SeedInfo.seed([1384E3678F3177AA]:0)
	at app//org.apache.solr.core.CoreContainer.create(CoreContainer.java:1550)
	at app//org.apache.solr.handler.admin.CoreAdminOperation.lambda$static$0(CoreAdminOperation.java:113)
	at app//org.apache.solr.handler.admin.CoreAdminOperation.execute(CoreAdminOperation.java:409)
	at app//org.apache.solr.handler.admin.CoreAdminHandler$CallInfo.call(CoreAdminHandler.java:451)
	at app//org.apache.solr.handler.admin.CoreAdminHandler.handleRequestBody(CoreAdminHandler.java:234)
	at app//org.apache.solr.handler.RequestHandlerBase.handleRequest(RequestHandlerBase.java:224)
	at app//org.apache.solr.client.solrj.embedded.EmbeddedSolrServer.request(EmbeddedSolrServer.java:171)
	at app//org.apache.solr.client.solrj.SolrRequest.process(SolrRequest.java:234)
	at app//org.apache.solr.client.solrj.SolrRequest.process(SolrRequest.java:249)
	at app//org.apache.solr.util.SolrClientTestRule.create(SolrClientTestRule.java:131)
	at app//org.apache.solr.util.SolrClientTestRule$NewCollectionBuilder.create(SolrClientTestRule.java:109)
	at app//org.apache.solr.update.RootFieldTest.beforeTest(RootFieldTest.java:59)
	at java.base@11.0.16.1/jdk.internal.reflect.NativeMethodAccessorImpl.invoke0(Native Method)
	at java.base@11.0.16.1/jdk.internal.reflect.NativeMethodAccessorImpl.invoke(NativeMethodAccessorImpl.java:62)
	at java.base@11.0.16.1/jdk.internal.reflect.DelegatingMethodAccessorImpl.invoke(DelegatingMethodAccessorImpl.java:43)
	at java.base@11.0.16.1/java.lang.reflect.Method.invoke(Method.java:566)
	at app//com.carrotsearch.randomizedtesting.RandomizedRunner.invoke(RandomizedRunner.java:1758)
	at app//com.carrotsearch.randomizedtesting.RandomizedRunner$6.evaluate(RandomizedRunner.java:886)
	at app//com.carrotsearch.randomizedtesting.RandomizedRunner$7.evaluate(RandomizedRunner.java:902)
	at app//org.junit.rules.ExternalResource$1.evaluate(ExternalResource.java:54)
	at app//com.carrotsearch.randomizedtesting.rules.StatementAdapter.evaluate(StatementAdapter.java:36)
	at app//com.carrotsearch.randomizedtesting.rules.StatementAdapter.evaluate(StatementAdapter.java:36)
	at app//org.apache.lucene.tests.util.AbstractBeforeAfterRule$1.evaluate(AbstractBeforeAfterRule.java:43)
	at app//org.apache.lucene.tests.util.AbstractBeforeAfterRule$1.evaluate(AbstractBeforeAfterRule.java:43)
	at app//com.carrotsearch.randomizedtesting.rules.SystemPropertiesRestoreRule$1.evaluate(SystemPropertiesRestoreRule.java:80)
	at app//org.junit.rules.RunRules.evaluate(RunRules.java:20)
	at app//org.apache.lucene.tests.util.AbstractBeforeAfterRule$1.evaluate(AbstractBeforeAfterRule.java:43)
	at app//com.carrotsearch.randomizedtesting.rules.StatementAdapter.evaluate(StatementAdapter.java:36)
	at app//org.apache.lucene.tests.util.TestRuleStoreClassName$1.evaluate(TestRuleStoreClassName.java:38)
	at app//com.carrotsearch.randomizedtesting.rules.NoShadowingOrOverridesOnMethodsRule$1.evaluate(NoShadowingOrOverridesOnMethodsRule.java:40)
	at app//com.carrotsearch.randomizedtesting.rules.NoShadowingOrOverridesOnMethodsRule$1.evaluate(NoShadowingOrOverridesOnMethodsRule.java:40)
	at app//com.carrotsearch.randomizedtesting.rules.StatementAdapter.evaluate(StatementAdapter.java:36)
	at app//com.carrotsearch.randomizedtesting.rules.StatementAdapter.evaluate(StatementAdapter.java:36)
	at app//org.apache.lucene.tests.util.TestRuleAssertionsRequired$1.evaluate(TestRuleAssertionsRequired.java:53)
	at app//org.apache.lucene.tests.util.AbstractBeforeAfterRule$1.evaluate(AbstractBeforeAfterRule.java:43)
	at app//org.apache.lucene.tests.util.TestRuleMarkFailure$1.evaluate(TestRuleMarkFailure.java:44)
	at app//org.apache.lucene.tests.util.TestRuleIgnoreAfterMaxFailures$1.evaluate(TestRuleIgnoreAfterMaxFailures.java:60)
	at app//org.apache.lucene.tests.util.TestRuleIgnoreTestSuites$1.evaluate(TestRuleIgnoreTestSuites.java:47)
	at app//org.junit.rules.RunRules.evaluate(RunRules.java:20)
	at app//com.carrotsearch.randomizedtesting.rules.StatementAdapter.evaluate(StatementAdapter.java:36)
	at app//com.carrotsearch.randomizedtesting.ThreadLeakControl$StatementRunner.run(ThreadLeakControl.java:390)
	at app//com.carrotsearch.randomizedtesting.ThreadLeakControl.lambda$forkTimeoutingTask$0(ThreadLeakControl.java:850)
	at java.base@11.0.16.1/java.lang.Thread.run(Thread.java:829)
Caused by: org.apache.solr.common.SolrException: Unable to create core [collection1]
	at app//org.apache.solr.core.CoreContainer.createFromDescriptor(CoreContainer.java:1665)
	at app//org.apache.solr.core.CoreContainer.create(CoreContainer.java:1508)
	... 42 more
Caused by: org.apache.solr.common.SolrException: Could not load conf for core collection1: Error loading solr config from /home/jenkins/jenkins-slave/workspace/Solr/Solr-Check-main/solr/core/build/resources/test/solr/configsets/../collection1/conf/solrconfig.xml
	at app//org.apache.solr.core.ConfigSetService.loadConfigSet(ConfigSetService.java:263)
	at app//org.apache.solr.core.CoreContainer.createFromDescriptor(CoreContainer.java:1632)
	... 43 more
Caused by: org.apache.solr.common.SolrException: Error loading solr config from /home/jenkins/jenkins-slave/workspace/Solr/Solr-Check-main/solr/core/build/resources/test/solr/configsets/../collection1/conf/solrconfig.xml
	at app//org.apache.solr.core.SolrConfig.readFromResourceLoader(SolrConfig.java:165)
	at app//org.apache.solr.core.ConfigSetService.createSolrConfig(ConfigSetService.java:294)
	at app//org.apache.solr.core.ConfigSetService.loadConfigSet(ConfigSetService.java:247)
	... 44 more
Caused by: org.apache.solr.common.SolrException: No system property or default value specified for solr.test.sys.prop2 value:

  
  ${solr.data.dir:}

  
  
    1000000
    2000000
    3000000
    4000000
    ${solr.hdfs.home:}
    ${solr.hdfs.blockcache.enabled:true}
    ${solr.hdfs.blockcache.global:true}
    ${solr.hdfs.blockcache.write.enabled:false}
    ${solr.hdfs.blockcache.blocksperbank:10}
    ${solr.hdfs.blockcache.slab.count:1}
  

  

  ${tests.luceneMatchVersion:LATEST}

  

  
  
  
  
  ${useCompoundFile:false}

  ${solr.tests.maxBufferedDocs}
  ${solr.tests.ramBufferSizeMB}
  ${solr.tests.maxCommitMergeWaitTime:-1}
  ${solr.tests.ramPerThreadHardLimitMB}

  

  1000
  10000

  
  ${solr.tests.lockType:single}

  ${solr.tests.infostream:false}



  

    
      ${solr.autoCommit.maxTime:-1}
    

    

    
      ${solr.ulog.dir:}
    

    
      ${solr.commitwithin.softcommit:true}
    

  

  
    
    ${solr.max.booleanClauses:1024}

    
    

    

    

    

    
    true

    

    

    10

    
    

    
    
    

    
    

    2000

  

  

  
  
    true
  

  
    
     dismax
     *:*
     0.01
     
        text^0.5 features_t^1.0 subject^1.4 title_stemmed^2.0
     
     
        text^0.2 features_t^1.1 subject^1.4 title_stemmed^2.0 title^1.5
     
     
        weight^0.5 recip(rord(id),1,1000,1000)^0.3
     
     
        3<-1 5<-2 6<90%
     
     100
    
  

  

  
  
    
      4
      true
      text,name,subject,title,whitetok
    
  

  
  
    
      4
      true
      text,name,subject,title,whitetok
    
  



  
    
    lowerpunctfilt

    
      default
      lowerfilt
      spellchecker1
      false
    
    
      direct
      DirectSolrSpellChecker
      lowerfilt
      3
    
    
      directMQF2
      DirectSolrSpellChecker
      lowerfilt
      3
      2
    
    
      wordbreak
      solr.WordBreakSolrSpellChecker
      lowerfilt
      true
      true
      10
    
    
      multipleFields
      lowerfilt1and2
      spellcheckerMultipleFields
      false
     
    
    
      jarowinkler
      lowerfilt
      
      org.apache.lucene.search.spell.JaroWinklerDistance
      spellchecker2

    
    
      solr.FileBasedSpellChecker
      external
      spellings.txt
      UTF-8
      spellchecker3
    
    
    
      freq
      lowerfilt
      spellcheckerFreq
      
      freq
      false
    
    
      fqcn
      lowerfilt
      spellcheckerFQCN
      org.apache.solr.spelling.SampleComparator
      false
    
    
      perDict
      org.apache.solr.handler.component.DummyCustomParamSpellChecker
      lowerfilt
    
  

    


  
  

  
    
      
      false
      
      false
      
      1
    
    
      spellcheck
    
  
  
    
      direct
      false
      false
      1
    
    
      spellcheck
    
  
  
    
      default
      wordbreak
      20
    
    
      spellcheck
    
  
  
    
      direct
      wordbreak
      20
    
    
      spellcheck
    
  
  
      
        dismax
        lowerfilt1^1
      
      
        spellcheck
      
 

  

  

  

  
    

    
    
      tvComponent
    
  

  
  

  
  
   
   
    
     100
    
   

   
    
     70
    
   

   
   
    
     <em>
     </em>
    
   

   
   

   
   
   

   
     
       10
       .,!? 	

     
   

   
     
       WORD
       en
       US
     
   
  
  

  
    
    
      max-age=30, public
    
  

  
    
      foo_s
    
    
      foo_s:bar
    
  
  
    
      foo_s
      foo_s:bar
    
  

  
  prefix-${solr.test.sys.prop2}-suffix

  

  
    
      
        uniq
        uniq2
        uniq3
      
    
    
  

  
    
    
      regex_dup_A_s
      x
      x_x
    
    
    
      regex_dup_B_s
      x
      x_x
    
    
  

  
    
    
      regex_dup_A_s
      x
      x_x
    
    
      regex_dup_B_s
      x
      x_x
    
    
  

  
    
    org.apache.solr.rest.ManagedResourceStorage$InMemoryStorageIO
  

  
  
    
      text
    
  

  
  
    text
  
  
    nl
  


	at app//org.apache.solr.common.util.PropertiesUtil.substitute(PropertiesUtil.java:70)
	at app//org.apache.solr.util.DataConfigNode.subtituteVal(DataConfigNode.java:61)
	at app//org.apache.solr.util.DataConfigNode.txt(DataConfigNode.java:91)
	at app//org.apache.solr.core.SolrConfig.<init>(SolrConfig.java:244)
	at app//org.apache.solr.core.SolrConfig.readFromResourceLoader(SolrConfig.java:157)
	... 46 more


FAILED:  org.apache.solr.update.processor.JavaBinAtomicUpdateMultivalueTest.classMethod

Error Message:
org.apache.solr.common.SolrException: Error CREATEing SolrCore 'collection1': Unable to create core [collection1] Caused by: No system property or default value specified for solr.test.sys.prop2 value:

  
  ${solr.data.dir:}

  
  
    1000000
    2000000
    3000000
    4000000
    ${solr.hdfs.home:}
    ${solr.hdfs.blockcache.enabled:true}
    ${solr.hdfs.blockcache.global:true}
    ${solr.hdfs.blockcache.write.enabled:false}
    ${solr.hdfs.blockcache.blocksperbank:10}
    ${solr.hdfs.blockcache.slab.count:1}
  

  

  ${tests.luceneMatchVersion:LATEST}

  

  
  
  
  
  ${useCompoundFile:false}

  ${solr.tests.maxBufferedDocs}
  ${solr.tests.ramBufferSizeMB}
  ${solr.tests.maxCommitMergeWaitTime:-1}
  ${solr.tests.ramPerThreadHardLimitMB}

  

  1000
  10000

  
  ${solr.tests.lockType:single}

  ${solr.tests.infostream:false}



  

    
      ${solr.autoCommit.maxTime:-1}
    

    

    
      ${solr.ulog.dir:}
    

    
      ${solr.commitwithin.softcommit:true}
    

  

  
    
    ${solr.max.booleanClauses:1024}

    
    

    

    

    

    
    true

    

    

    10

    
    

    
    
    

    
    

    2000

  

  

  
  
    true
  

  
    
     dismax
     *:*
     0.01
     
        text^0.5 features_t^1.0 subject^1.4 title_stemmed^2.0
     
     
        text^0.2 features_t^1.1 subject^1.4 title_stemmed^2.0 title^1.5
     
     
        weight^0.5 recip(rord(id),1,1000,1000)^0.3
     
     
        3<-1 5<-2 6<90%
     
     100
    
  

  

  
  
    
      4
      true
      text,name,subject,title,whitetok
    
  

  
  
    
      4
      true
      text,name,subject,title,whitetok
    
  



  
    
    lowerpunctfilt

    
      default
      lowerfilt
      spellchecker1
      false
    
    
      direct
      DirectSolrSpellChecker
      lowerfilt
      3
    
    
      directMQF2
      DirectSolrSpellChecker
      lowerfilt
      3
      2
    
    
      wordbreak
      solr.WordBreakSolrSpellChecker
      lowerfilt
      true
      true
      10
    
    
      multipleFields
      lowerfilt1and2
      spellcheckerMultipleFields
      false
     
    
    
      jarowinkler
      lowerfilt
      
      org.apache.lucene.search.spell.JaroWinklerDistance
      spellchecker2

    
    
      solr.FileBasedSpellChecker
      external
      spellings.txt
      UTF-8
      spellchecker3
    
    
    
      freq
      lowerfilt
      spellcheckerFreq
      
      freq
      false
    
    
      fqcn
      lowerfilt
      spellcheckerFQCN
      org.apache.solr.spelling.SampleComparator
      false
    
    
      perDict
      org.apache.solr.handler.component.DummyCustomParamSpellChecker
      lowerfilt
    
  

    


  
  

  
    
      
      false
      
      false
      
      1
    
    
      spellcheck
    
  
  
    
      direct
      false
      false
      1
    
    
      spellcheck
    
  
  
    
      default
      wordbreak
      20
    
    
      spellcheck
    
  
  
    
      direct
      wordbreak
      20
    
    
      spellcheck
    
  
  
      
        dismax
        lowerfilt1^1
      
      
        spellcheck
      
 

  

  

  

  
    

    
    
      tvComponent
    
  

  
  

  
  
   
   
    
     100
    
   

   
    
     70
    
   

   
   
    
     <em>
     </em>
    
   

   
   

   
   
   

   
     
       10
       .,!? 	

     
   

   
     
       WORD
       en
       US
     
   
  
  

  
    
    
      max-age=30, public
    
  

  
    
      foo_s
    
    
      foo_s:bar
    
  
  
    
      foo_s
      foo_s:bar
    
  

  
  prefix-${solr.test.sys.prop2}-suffix

  

  
    
      
        uniq
        uniq2
        uniq3
      
    
    
  

  
    
    
      regex_dup_A_s
      x
      x_x
    
    
    
      regex_dup_B_s
      x
      x_x
    
    
  

  
    
    
      regex_dup_A_s
      x
      x_x
    
    
      regex_dup_B_s
      x
      x_x
    
    
  

  
    
    org.apache.solr.rest.ManagedResourceStorage$InMemoryStorageIO
  

  
  
    
      text
    
  

  
  
    text
  
  
    nl
  



Stack Trace:
org.apache.solr.common.SolrException: Error CREATEing SolrCore 'collection1': Unable to create core [collection1] Caused by: No system property or default value specified for solr.test.sys.prop2 value:

  
  ${solr.data.dir:}

  
  
    1000000
    2000000
    3000000
    4000000
    ${solr.hdfs.home:}
    ${solr.hdfs.blockcache.enabled:true}
    ${solr.hdfs.blockcache.global:true}
    ${solr.hdfs.blockcache.write.enabled:false}
    ${solr.hdfs.blockcache.blocksperbank:10}
    ${solr.hdfs.blockcache.slab.count:1}
  

  

  ${tests.luceneMatchVersion:LATEST}

  

  
  
  
  
  ${useCompoundFile:false}

  ${solr.tests.maxBufferedDocs}
  ${solr.tests.ramBufferSizeMB}
  ${solr.tests.maxCommitMergeWaitTime:-1}
  ${solr.tests.ramPerThreadHardLimitMB}

  

  1000
  10000

  
  ${solr.tests.lockType:single}

  ${solr.tests.infostream:false}



  

    
      ${solr.autoCommit.maxTime:-1}
    

    

    
      ${solr.ulog.dir:}
    

    
      ${solr.commitwithin.softcommit:true}
    

  

  
    
    ${solr.max.booleanClauses:1024}

    
    

    

    

    

    
    true

    

    

    10

    
    

    
    
    

    
    

    2000

  

  

  
  
    true
  

  
    
     dismax
     *:*
     0.01
     
        text^0.5 features_t^1.0 subject^1.4 title_stemmed^2.0
     
     
        text^0.2 features_t^1.1 subject^1.4 title_stemmed^2.0 title^1.5
     
     
        weight^0.5 recip(rord(id),1,1000,1000)^0.3
     
     
        3<-1 5<-2 6<90%
     
     100
    
  

  

  
  
    
      4
      true
      text,name,subject,title,whitetok
    
  

  
  
    
      4
      true
      text,name,subject,title,whitetok
    
  



  
    
    lowerpunctfilt

    
      default
      lowerfilt
      spellchecker1
      false
    
    
      direct
      DirectSolrSpellChecker
      lowerfilt
      3
    
    
      directMQF2
      DirectSolrSpellChecker
      lowerfilt
      3
      2
    
    
      wordbreak
      solr.WordBreakSolrSpellChecker
      lowerfilt
      true
      true
      10
    
    
      multipleFields
      lowerfilt1and2
      spellcheckerMultipleFields
      false
     
    
    
      jarowinkler
      lowerfilt
      
      org.apache.lucene.search.spell.JaroWinklerDistance
      spellchecker2

    
    
      solr.FileBasedSpellChecker
      external
      spellings.txt
      UTF-8
      spellchecker3
    
    
    
      freq
      lowerfilt
      spellcheckerFreq
      
      freq
      false
    
    
      fqcn
      lowerfilt
      spellcheckerFQCN
      org.apache.solr.spelling.SampleComparator
      false
    
    
      perDict
      org.apache.solr.handler.component.DummyCustomParamSpellChecker
      lowerfilt
    
  

    


  
  

  
    
      
      false
      
      false
      
      1
    
    
      spellcheck
    
  
  
    
      direct
      false
      false
      1
    
    
      spellcheck
    
  
  
    
      default
      wordbreak
      20
    
    
      spellcheck
    
  
  
    
      direct
      wordbreak
      20
    
    
      spellcheck
    
  
  
      
        dismax
        lowerfilt1^1
      
      
        spellcheck
      
 

  

  

  

  
    

    
    
      tvComponent
    
  

  
  

  
  
   
   
    
     100
    
   

   
    
     70
    
   

   
   
    
     <em>
     </em>
    
   

   
   

   
   
   

   
     
       10
       .,!? 	

     
   

   
     
       WORD
       en
       US
     
   
  
  

  
    
    
      max-age=30, public
    
  

  
    
      foo_s
    
    
      foo_s:bar
    
  
  
    
      foo_s
      foo_s:bar
    
  

  
  prefix-${solr.test.sys.prop2}-suffix

  

  
    
      
        uniq
        uniq2
        uniq3
      
    
    
  

  
    
    
      regex_dup_A_s
      x
      x_x
    
    
    
      regex_dup_B_s
      x
      x_x
    
    
  

  
    
    
      regex_dup_A_s
      x
      x_x
    
    
      regex_dup_B_s
      x
      x_x
    
    
  

  
    
    org.apache.solr.rest.ManagedResourceStorage$InMemoryStorageIO
  

  
  
    
      text
    
  

  
  
    text
  
  
    nl
  


	at __randomizedtesting.SeedInfo.seed([1384E3678F3177AA]:0)
	at app//org.apache.solr.core.CoreContainer.create(CoreContainer.java:1550)
	at app//org.apache.solr.handler.admin.CoreAdminOperation.lambda$static$0(CoreAdminOperation.java:113)
	at app//org.apache.solr.handler.admin.CoreAdminOperation.execute(CoreAdminOperation.java:409)
	at app//org.apache.solr.handler.admin.CoreAdminHandler$CallInfo.call(CoreAdminHandler.java:451)
	at app//org.apache.solr.handler.admin.CoreAdminHandler.handleRequestBody(CoreAdminHandler.java:234)
	at app//org.apache.solr.handler.RequestHandlerBase.handleRequest(RequestHandlerBase.java:224)
	at app//org.apache.solr.client.solrj.embedded.EmbeddedSolrServer.request(EmbeddedSolrServer.java:171)
	at app//org.apache.solr.client.solrj.SolrRequest.process(SolrRequest.java:234)
	at app//org.apache.solr.client.solrj.SolrRequest.process(SolrRequest.java:249)
	at app//org.apache.solr.util.SolrClientTestRule.create(SolrClientTestRule.java:131)
	at app//org.apache.solr.util.SolrClientTestRule$NewCollectionBuilder.create(SolrClientTestRule.java:109)
	at app//org.apache.solr.update.processor.AbstractAtomicUpdatesMultivalueTestBase.initWithRequestWriter(AbstractAtomicUpdatesMultivalueTestBase.java:54)
	at app//org.apache.solr.update.processor.JavaBinAtomicUpdateMultivalueTest.beforeClass(JavaBinAtomicUpdateMultivalueTest.java:26)
	at java.base@11.0.16.1/jdk.internal.reflect.NativeMethodAccessorImpl.invoke0(Native Method)
	at java.base@11.0.16.1/jdk.internal.reflect.NativeMethodAccessorImpl.invoke(NativeMethodAccessorImpl.java:62)
	at java.base@11.0.16.1/jdk.internal.reflect.DelegatingMethodAccessorImpl.invoke(DelegatingMethodAccessorImpl.java:43)
	at java.base@11.0.16.1/java.lang.reflect.Method.invoke(Method.java:566)
	at app//com.carrotsearch.randomizedtesting.RandomizedRunner.invoke(RandomizedRunner.java:1758)
	at app//com.carrotsearch.randomizedtesting.RandomizedRunner$6.evaluate(RandomizedRunner.java:886)
	at app//com.carrotsearch.randomizedtesting.RandomizedRunner$7.evaluate(RandomizedRunner.java:902)
	at app//org.junit.rules.ExternalResource$1.evaluate(ExternalResource.java:54)
	at app//com.carrotsearch.randomizedtesting.rules.StatementAdapter.evaluate(StatementAdapter.java:36)
	at app//com.carrotsearch.randomizedtesting.rules.StatementAdapter.evaluate(StatementAdapter.java:36)
	at app//org.apache.lucene.tests.util.AbstractBeforeAfterRule$1.evaluate(AbstractBeforeAfterRule.java:43)
	at app//org.apache.lucene.tests.util.AbstractBeforeAfterRule$1.evaluate(AbstractBeforeAfterRule.java:43)
	at app//com.carrotsearch.randomizedtesting.rules.SystemPropertiesRestoreRule$1.evaluate(SystemPropertiesRestoreRule.java:80)
	at app//org.junit.rules.RunRules.evaluate(RunRules.java:20)
	at app//org.apache.lucene.tests.util.AbstractBeforeAfterRule$1.evaluate(AbstractBeforeAfterRule.java:43)
	at app//com.carrotsearch.randomizedtesting.rules.StatementAdapter.evaluate(StatementAdapter.java:36)
	at app//org.apache.lucene.tests.util.TestRuleStoreClassName$1.evaluate(TestRuleStoreClassName.java:38)
	at app//com.carrotsearch.randomizedtesting.rules.NoShadowingOrOverridesOnMethodsRule$1.evaluate(NoShadowingOrOverridesOnMethodsRule.java:40)
	at app//com.carrotsearch.randomizedtesting.rules.NoShadowingOrOverridesOnMethodsRule$1.evaluate(NoShadowingOrOverridesOnMethodsRule.java:40)
	at app//com.carrotsearch.randomizedtesting.rules.StatementAdapter.evaluate(StatementAdapter.java:36)
	at app//com.carrotsearch.randomizedtesting.rules.StatementAdapter.evaluate(StatementAdapter.java:36)
	at app//org.apache.lucene.tests.util.TestRuleAssertionsRequired$1.evaluate(TestRuleAssertionsRequired.java:53)
	at app//org.apache.lucene.tests.util.AbstractBeforeAfterRule$1.evaluate(AbstractBeforeAfterRule.java:43)
	at app//org.apache.lucene.tests.util.TestRuleMarkFailure$1.evaluate(TestRuleMarkFailure.java:44)
	at app//org.apache.lucene.tests.util.TestRuleIgnoreAfterMaxFailures$1.evaluate(TestRuleIgnoreAfterMaxFailures.java:60)
	at app//org.apache.lucene.tests.util.TestRuleIgnoreTestSuites$1.evaluate(TestRuleIgnoreTestSuites.java:47)
	at app//org.junit.rules.RunRules.evaluate(RunRules.java:20)
	at app//com.carrotsearch.randomizedtesting.rules.StatementAdapter.evaluate(StatementAdapter.java:36)
	at app//com.carrotsearch.randomizedtesting.ThreadLeakControl$StatementRunner.run(ThreadLeakControl.java:390)
	at app//com.carrotsearch.randomizedtesting.ThreadLeakControl.lambda$forkTimeoutingTask$0(ThreadLeakControl.java:850)
	at java.base@11.0.16.1/java.lang.Thread.run(Thread.java:829)
Caused by: org.apache.solr.common.SolrException: Unable to create core [collection1]
	at app//org.apache.solr.core.CoreContainer.createFromDescriptor(CoreContainer.java:1665)
	at app//org.apache.solr.core.CoreContainer.create(CoreContainer.java:1508)
	... 43 more
Caused by: org.apache.solr.common.SolrException: Could not load conf for core collection1: Error loading solr config from /home/jenkins/jenkins-slave/workspace/Solr/Solr-Check-main/solr/core/build/resources/test/solr/configsets/../collection1/conf/solrconfig.xml
	at app//org.apache.solr.core.ConfigSetService.loadConfigSet(ConfigSetService.java:263)
	at app//org.apache.solr.core.CoreContainer.createFromDescriptor(CoreContainer.java:1632)
	... 44 more
Caused by: org.apache.solr.common.SolrException: Error loading solr config from /home/jenkins/jenkins-slave/workspace/Solr/Solr-Check-main/solr/core/build/resources/test/solr/configsets/../collection1/conf/solrconfig.xml
	at app//org.apache.solr.core.SolrConfig.readFromResourceLoader(SolrConfig.java:165)
	at app//org.apache.solr.core.ConfigSetService.createSolrConfig(ConfigSetService.java:294)
	at app//org.apache.solr.core.ConfigSetService.loadConfigSet(ConfigSetService.java:247)
	... 45 more
Caused by: org.apache.solr.common.SolrException: No system property or default value specified for solr.test.sys.prop2 value:

  
  ${solr.data.dir:}

  
  
    1000000
    2000000
    3000000
    4000000
    ${solr.hdfs.home:}
    ${solr.hdfs.blockcache.enabled:true}
    ${solr.hdfs.blockcache.global:true}
    ${solr.hdfs.blockcache.write.enabled:false}
    ${solr.hdfs.blockcache.blocksperbank:10}
    ${solr.hdfs.blockcache.slab.count:1}
  

  

  ${tests.luceneMatchVersion:LATEST}

  

  
  
  
  
  ${useCompoundFile:false}

  ${solr.tests.maxBufferedDocs}
  ${solr.tests.ramBufferSizeMB}
  ${solr.tests.maxCommitMergeWaitTime:-1}
  ${solr.tests.ramPerThreadHardLimitMB}

  

  1000
  10000

  
  ${solr.tests.lockType:single}

  ${solr.tests.infostream:false}



  

    
      ${solr.autoCommit.maxTime:-1}
    

    

    
      ${solr.ulog.dir:}
    

    
      ${solr.commitwithin.softcommit:true}
    

  

  
    
    ${solr.max.booleanClauses:1024}

    
    

    

    

    

    
    true

    

    

    10

    
    

    
    
    

    
    

    2000

  

  

  
  
    true
  

  
    
     dismax
     *:*
     0.01
     
        text^0.5 features_t^1.0 subject^1.4 title_stemmed^2.0
     
     
        text^0.2 features_t^1.1 subject^1.4 title_stemmed^2.0 title^1.5
     
     
        weight^0.5 recip(rord(id),1,1000,1000)^0.3
     
     
        3<-1 5<-2 6<90%
     
     100
    
  

  

  
  
    
      4
      true
      text,name,subject,title,whitetok
    
  

  
  
    
      4
      true
      text,name,subject,title,whitetok
    
  



  
    
    lowerpunctfilt

    
      default
      lowerfilt
      spellchecker1
      false
    
    
      direct
      DirectSolrSpellChecker
      lowerfilt
      3
    
    
      directMQF2
      DirectSolrSpellChecker
      lowerfilt
      3
      2
    
    
      wordbreak
      solr.WordBreakSolrSpellChecker
      lowerfilt
      true
      true
      10
    
    
      multipleFields
      lowerfilt1and2
      spellcheckerMultipleFields
      false
     
    
    
      jarowinkler
      lowerfilt
      
      org.apache.lucene.search.spell.JaroWinklerDistance
      spellchecker2

    
    
      solr.FileBasedSpellChecker
      external
      spellings.txt
      UTF-8
      spellchecker3
    
    
    
      freq
      lowerfilt
      spellcheckerFreq
      
      freq
      false
    
    
      fqcn
      lowerfilt
      spellcheckerFQCN
      org.apache.solr.spelling.SampleComparator
      false
    
    
      perDict
      org.apache.solr.handler.component.DummyCustomParamSpellChecker
      lowerfilt
    
  

    


  
  

  
    
      
      false
      
      false
      
      1
    
    
      spellcheck
    
  
  
    
      direct
      false
      false
      1
    
    
      spellcheck
    
  
  
    
      default
      wordbreak
      20
    
    
      spellcheck
    
  
  
    
      direct
      wordbreak
      20
    
    
      spellcheck
    
  
  
      
        dismax
        lowerfilt1^1
      
      
        spellcheck
      
 

  

  

  

  
    

    
    
      tvComponent
    
  

  
  

  
  
   
   
    
     100
    
   

   
    
     70
    
   

   
   
    
     <em>
     </em>
    
   

   
   

   
   
   

   
     
       10
       .,!? 	

     
   

   
     
       WORD
       en
       US
     
   
  
  

  
    
    
      max-age=30, public
    
  

  
    
      foo_s
    
    
      foo_s:bar
    
  
  
    
      foo_s
      foo_s:bar
    
  

  
  prefix-${solr.test.sys.prop2}-suffix

  

  
    
      
        uniq
        uniq2
        uniq3
      
    
    
  

  
    
    
      regex_dup_A_s
      x
      x_x
    
    
    
      regex_dup_B_s
      x
      x_x
    
    
  

  
    
    
      regex_dup_A_s
      x
      x_x
    
    
      regex_dup_B_s
      x
      x_x
    
    
  

  
    
    org.apache.solr.rest.ManagedResourceStorage$InMemoryStorageIO
  

  
  
    
      text
    
  

  
  
    text
  
  
    nl
  


	at app//org.apache.solr.common.util.PropertiesUtil.substitute(PropertiesUtil.java:70)
	at app//org.apache.solr.util.DataConfigNode.subtituteVal(DataConfigNode.java:61)
	at app//org.apache.solr.util.DataConfigNode.txt(DataConfigNode.java:91)
	at app//org.apache.solr.core.SolrConfig.<init>(SolrConfig.java:244)
	at app//org.apache.solr.core.SolrConfig.readFromResourceLoader(SolrConfig.java:157)
	... 47 more


FAILED:  org.apache.solr.update.processor.XMLAtomicUpdateMultivalueTest.classMethod

Error Message:
org.apache.solr.common.SolrException: Error CREATEing SolrCore 'collection1': Unable to create core [collection1] Caused by: No system property or default value specified for solr.test.sys.prop2 value:

  
  ${solr.data.dir:}

  
  
    1000000
    2000000
    3000000
    4000000
    ${solr.hdfs.home:}
    ${solr.hdfs.blockcache.enabled:true}
    ${solr.hdfs.blockcache.global:true}
    ${solr.hdfs.blockcache.write.enabled:false}
    ${solr.hdfs.blockcache.blocksperbank:10}
    ${solr.hdfs.blockcache.slab.count:1}
  

  

  ${tests.luceneMatchVersion:LATEST}

  

  
  
  
  
  ${useCompoundFile:false}

  ${solr.tests.maxBufferedDocs}
  ${solr.tests.ramBufferSizeMB}
  ${solr.tests.maxCommitMergeWaitTime:-1}
  ${solr.tests.ramPerThreadHardLimitMB}

  

  1000
  10000

  
  ${solr.tests.lockType:single}

  ${solr.tests.infostream:false}



  

    
      ${solr.autoCommit.maxTime:-1}
    

    

    
      ${solr.ulog.dir:}
    

    
      ${solr.commitwithin.softcommit:true}
    

  

  
    
    ${solr.max.booleanClauses:1024}

    
    

    

    

    

    
    true

    

    

    10

    
    

    
    
    

    
    

    2000

  

  

  
  
    true
  

  
    
     dismax
     *:*
     0.01
     
        text^0.5 features_t^1.0 subject^1.4 title_stemmed^2.0
     
     
        text^0.2 features_t^1.1 subject^1.4 title_stemmed^2.0 title^1.5
     
     
        weight^0.5 recip(rord(id),1,1000,1000)^0.3
     
     
        3<-1 5<-2 6<90%
     
     100
    
  

  

  
  
    
      4
      true
      text,name,subject,title,whitetok
    
  

  
  
    
      4
      true
      text,name,subject,title,whitetok
    
  



  
    
    lowerpunctfilt

    
      default
      lowerfilt
      spellchecker1
      false
    
    
      direct
      DirectSolrSpellChecker
      lowerfilt
      3
    
    
      directMQF2
      DirectSolrSpellChecker
      lowerfilt
      3
      2
    
    
      wordbreak
      solr.WordBreakSolrSpellChecker
      lowerfilt
      true
      true
      10
    
    
      multipleFields
      lowerfilt1and2
      spellcheckerMultipleFields
      false
     
    
    
      jarowinkler
      lowerfilt
      
      org.apache.lucene.search.spell.JaroWinklerDistance
      spellchecker2

    
    
      solr.FileBasedSpellChecker
      external
      spellings.txt
      UTF-8
      spellchecker3
    
    
    
      freq
      lowerfilt
      spellcheckerFreq
      
      freq
      false
    
    
      fqcn
      lowerfilt
      spellcheckerFQCN
      org.apache.solr.spelling.SampleComparator
      false
    
    
      perDict
      org.apache.solr.handler.component.DummyCustomParamSpellChecker
      lowerfilt
    
  

    


  
  

  
    
      
      false
      
      false
      
      1
    
    
      spellcheck
    
  
  
    
      direct
      false
      false
      1
    
    
      spellcheck
    
  
  
    
      default
      wordbreak
      20
    
    
      spellcheck
    
  
  
    
      direct
      wordbreak
      20
    
    
      spellcheck
    
  
  
      
        dismax
        lowerfilt1^1
      
      
        spellcheck
      
 

  

  

  

  
    

    
    
      tvComponent
    
  

  
  

  
  
   
   
    
     100
    
   

   
    
     70
    
   

   
   
    
     <em>
     </em>
    
   

   
   

   
   
   

   
     
       10
       .,!? 	

     
   

   
     
       WORD
       en
       US
     
   
  
  

  
    
    
      max-age=30, public
    
  

  
    
      foo_s
    
    
      foo_s:bar
    
  
  
    
      foo_s
      foo_s:bar
    
  

  
  prefix-${solr.test.sys.prop2}-suffix

  

  
    
      
        uniq
        uniq2
        uniq3
      
    
    
  

  
    
    
      regex_dup_A_s
      x
      x_x
    
    
    
      regex_dup_B_s
      x
      x_x
    
    
  

  
    
    
      regex_dup_A_s
      x
      x_x
    
    
      regex_dup_B_s
      x
      x_x
    
    
  

  
    
    org.apache.solr.rest.ManagedResourceStorage$InMemoryStorageIO
  

  
  
    
      text
    
  

  
  
    text
  
  
    nl
  



Stack Trace:
org.apache.solr.common.SolrException: Error CREATEing SolrCore 'collection1': Unable to create core [collection1] Caused by: No system property or default value specified for solr.test.sys.prop2 value:

  
  ${solr.data.dir:}

  
  
    1000000
    2000000
    3000000
    4000000
    ${solr.hdfs.home:}
    ${solr.hdfs.blockcache.enabled:true}
    ${solr.hdfs.blockcache.global:true}
    ${solr.hdfs.blockcache.write.enabled:false}
    ${solr.hdfs.blockcache.blocksperbank:10}
    ${solr.hdfs.blockcache.slab.count:1}
  

  

  ${tests.luceneMatchVersion:LATEST}

  

  
  
  
  
  ${useCompoundFile:false}

  ${solr.tests.maxBufferedDocs}
  ${solr.tests.ramBufferSizeMB}
  ${solr.tests.maxCommitMergeWaitTime:-1}
  ${solr.tests.ramPerThreadHardLimitMB}

  

  1000
  10000

  
  ${solr.tests.lockType:single}

  ${solr.tests.infostream:false}



  

    
      ${solr.autoCommit.maxTime:-1}
    

    

    
      ${solr.ulog.dir:}
    

    
      ${solr.commitwithin.softcommit:true}
    

  

  
    
    ${solr.max.booleanClauses:1024}

    
    

    

    

    

    
    true

    

    

    10

    
    

    
    
    

    
    

    2000

  

  

  
  
    true
  

  
    
     dismax
     *:*
     0.01
     
        text^0.5 features_t^1.0 subject^1.4 title_stemmed^2.0
     
     
        text^0.2 features_t^1.1 subject^1.4 title_stemmed^2.0 title^1.5
     
     
        weight^0.5 recip(rord(id),1,1000,1000)^0.3
     
     
        3<-1 5<-2 6<90%
     
     100
    
  

  

  
  
    
      4
      true
      text,name,subject,title,whitetok
    
  

  
  
    
      4
      true
      text,name,subject,title,whitetok
    
  



  
    
    lowerpunctfilt

    
      default
      lowerfilt
      spellchecker1
      false
    
    
      direct
      DirectSolrSpellChecker
      lowerfilt
      3
    
    
      directMQF2
      DirectSolrSpellChecker
      lowerfilt
      3
      2
    
    
      wordbreak
      solr.WordBreakSolrSpellChecker
      lowerfilt
      true
      true
      10
    
    
      multipleFields
      lowerfilt1and2
      spellcheckerMultipleFields
      false
     
    
    
      jarowinkler
      lowerfilt
      
      org.apache.lucene.search.spell.JaroWinklerDistance
      spellchecker2

    
    
      solr.FileBasedSpellChecker
      external
      spellings.txt
      UTF-8
      spellchecker3
    
    
    
      freq
      lowerfilt
      spellcheckerFreq
      
      freq
      false
    
    
      fqcn
      lowerfilt
      spellcheckerFQCN
      org.apache.solr.spelling.SampleComparator
      false
    
    
      perDict
      org.apache.solr.handler.component.DummyCustomParamSpellChecker
      lowerfilt
    
  

    


  
  

  
    
      
      false
      
      false
      
      1
    
    
      spellcheck
    
  
  
    
      direct
      false
      false
      1
    
    
      spellcheck
    
  
  
    
      default
      wordbreak
      20
    
    
      spellcheck
    
  
  
    
      direct
      wordbreak
      20
    
    
      spellcheck
    
  
  
      
        dismax
        lowerfilt1^1
      
      
        spellcheck
      
 

  

  

  

  
    

    
    
      tvComponent
    
  

  
  

  
  
   
   
    
     100
    
   

   
    
     70
    
   

   
   
    
     <em>
     </em>
    
   

   
   

   
   
   

   
     
       10
       .,!? 	

     
   

   
     
       WORD
       en
       US
     
   
  
  

  
    
    
      max-age=30, public
    
  

  
    
      foo_s
    
    
      foo_s:bar
    
  
  
    
      foo_s
      foo_s:bar
    
  

  
  prefix-${solr.test.sys.prop2}-suffix

  

  
    
      
        uniq
        uniq2
        uniq3
      
    
    
  

  
    
    
      regex_dup_A_s
      x
      x_x
    
    
    
      regex_dup_B_s
      x
      x_x
    
    
  

  
    
    
      regex_dup_A_s
      x
      x_x
    
    
      regex_dup_B_s
      x
      x_x
    
    
  

  
    
    org.apache.solr.rest.ManagedResourceStorage$InMemoryStorageIO
  

  
  
    
      text
    
  

  
  
    text
  
  
    nl
  


	at __randomizedtesting.SeedInfo.seed([1384E3678F3177AA]:0)
	at app//org.apache.solr.core.CoreContainer.create(CoreContainer.java:1550)
	at app//org.apache.solr.handler.admin.CoreAdminOperation.lambda$static$0(CoreAdminOperation.java:113)
	at app//org.apache.solr.handler.admin.CoreAdminOperation.execute(CoreAdminOperation.java:409)
	at app//org.apache.solr.handler.admin.CoreAdminHandler$CallInfo.call(CoreAdminHandler.java:451)
	at app//org.apache.solr.handler.admin.CoreAdminHandler.handleRequestBody(CoreAdminHandler.java:234)
	at app//org.apache.solr.handler.RequestHandlerBase.handleRequest(RequestHandlerBase.java:224)
	at app//org.apache.solr.client.solrj.embedded.EmbeddedSolrServer.request(EmbeddedSolrServer.java:171)
	at app//org.apache.solr.client.solrj.SolrRequest.process(SolrRequest.java:234)
	at app//org.apache.solr.client.solrj.SolrRequest.process(SolrRequest.java:249)
	at app//org.apache.solr.util.SolrClientTestRule.create(SolrClientTestRule.java:131)
	at app//org.apache.solr.util.SolrClientTestRule$NewCollectionBuilder.create(SolrClientTestRule.java:109)
	at app//org.apache.solr.update.processor.AbstractAtomicUpdatesMultivalueTestBase.initWithRequestWriter(AbstractAtomicUpdatesMultivalueTestBase.java:54)
	at app//org.apache.solr.update.processor.XMLAtomicUpdateMultivalueTest.beforeClass(XMLAtomicUpdateMultivalueTest.java:26)
	at java.base@11.0.16.1/jdk.internal.reflect.NativeMethodAccessorImpl.invoke0(Native Method)
	at java.base@11.0.16.1/jdk.internal.reflect.NativeMethodAccessorImpl.invoke(NativeMethodAccessorImpl.java:62)
	at java.base@11.0.16.1/jdk.internal.reflect.DelegatingMethodAccessorImpl.invoke(DelegatingMethodAccessorImpl.java:43)
	at java.base@11.0.16.1/java.lang.reflect.Method.invoke(Method.java:566)
	at app//com.carrotsearch.randomizedtesting.RandomizedRunner.invoke(RandomizedRunner.java:1758)
	at app//com.carrotsearch.randomizedtesting.RandomizedRunner$6.evaluate(RandomizedRunner.java:886)
	at app//com.carrotsearch.randomizedtesting.RandomizedRunner$7.evaluate(RandomizedRunner.java:902)
	at app//org.junit.rules.ExternalResource$1.evaluate(ExternalResource.java:54)
	at app//com.carrotsearch.randomizedtesting.rules.StatementAdapter.evaluate(StatementAdapter.java:36)
	at app//com.carrotsearch.randomizedtesting.rules.StatementAdapter.evaluate(StatementAdapter.java:36)
	at app//org.apache.lucene.tests.util.AbstractBeforeAfterRule$1.evaluate(AbstractBeforeAfterRule.java:43)
	at app//org.apache.lucene.tests.util.AbstractBeforeAfterRule$1.evaluate(AbstractBeforeAfterRule.java:43)
	at app//com.carrotsearch.randomizedtesting.rules.SystemPropertiesRestoreRule$1.evaluate(SystemPropertiesRestoreRule.java:80)
	at app//org.junit.rules.RunRules.evaluate(RunRules.java:20)
	at app//org.apache.lucene.tests.util.AbstractBeforeAfterRule$1.evaluate(AbstractBeforeAfterRule.java:43)
	at app//com.carrotsearch.randomizedtesting.rules.StatementAdapter.evaluate(StatementAdapter.java:36)
	at app//org.apache.lucene.tests.util.TestRuleStoreClassName$1.evaluate(TestRuleStoreClassName.java:38)
	at app//com.carrotsearch.randomizedtesting.rules.NoShadowingOrOverridesOnMethodsRule$1.evaluate(NoShadowingOrOverridesOnMethodsRule.java:40)
	at app//com.carrotsearch.randomizedtesting.rules.NoShadowingOrOverridesOnMethodsRule$1.evaluate(NoShadowingOrOverridesOnMethodsRule.java:40)
	at app//com.carrotsearch.randomizedtesting.rules.StatementAdapter.evaluate(StatementAdapter.java:36)
	at app//com.carrotsearch.randomizedtesting.rules.StatementAdapter.evaluate(StatementAdapter.java:36)
	at app//org.apache.lucene.tests.util.TestRuleAssertionsRequired$1.evaluate(TestRuleAssertionsRequired.java:53)
	at app//org.apache.lucene.tests.util.AbstractBeforeAfterRule$1.evaluate(AbstractBeforeAfterRule.java:43)
	at app//org.apache.lucene.tests.util.TestRuleMarkFailure$1.evaluate(TestRuleMarkFailure.java:44)
	at app//org.apache.lucene.tests.util.TestRuleIgnoreAfterMaxFailures$1.evaluate(TestRuleIgnoreAfterMaxFailures.java:60)
	at app//org.apache.lucene.tests.util.TestRuleIgnoreTestSuites$1.evaluate(TestRuleIgnoreTestSuites.java:47)
	at app//org.junit.rules.RunRules.evaluate(RunRules.java:20)
	at app//com.carrotsearch.randomizedtesting.rules.StatementAdapter.evaluate(StatementAdapter.java:36)
	at app//com.carrotsearch.randomizedtesting.ThreadLeakControl$StatementRunner.run(ThreadLeakControl.java:390)
	at app//com.carrotsearch.randomizedtesting.ThreadLeakControl.lambda$forkTimeoutingTask$0(ThreadLeakControl.java:850)
	at java.base@11.0.16.1/java.lang.Thread.run(Thread.java:829)
Caused by: org.apache.solr.common.SolrException: Unable to create core [collection1]
	at app//org.apache.solr.core.CoreContainer.createFromDescriptor(CoreContainer.java:1665)
	at app//org.apache.solr.core.CoreContainer.create(CoreContainer.java:1508)
	... 43 more
Caused by: org.apache.solr.common.SolrException: Could not load conf for core collection1: Error loading solr config from /home/jenkins/jenkins-slave/workspace/Solr/Solr-Check-main/solr/core/build/resources/test/solr/configsets/../collection1/conf/solrconfig.xml
	at app//org.apache.solr.core.ConfigSetService.loadConfigSet(ConfigSetService.java:263)
	at app//org.apache.solr.core.CoreContainer.createFromDescriptor(CoreContainer.java:1632)
	... 44 more
Caused by: org.apache.solr.common.SolrException: Error loading solr config from /home/jenkins/jenkins-slave/workspace/Solr/Solr-Check-main/solr/core/build/resources/test/solr/configsets/../collection1/conf/solrconfig.xml
	at app//org.apache.solr.core.SolrConfig.readFromResourceLoader(SolrConfig.java:165)
	at app//org.apache.solr.core.ConfigSetService.createSolrConfig(ConfigSetService.java:294)
	at app//org.apache.solr.core.ConfigSetService.loadConfigSet(ConfigSetService.java:247)
	... 45 more
Caused by: org.apache.solr.common.SolrException: No system property or default value specified for solr.test.sys.prop2 value:

  
  ${solr.data.dir:}

  
  
    1000000
    2000000
    3000000
    4000000
    ${solr.hdfs.home:}
    ${solr.hdfs.blockcache.enabled:true}
    ${solr.hdfs.blockcache.global:true}
    ${solr.hdfs.blockcache.write.enabled:false}
    ${solr.hdfs.blockcache.blocksperbank:10}
    ${solr.hdfs.blockcache.slab.count:1}
  

  

  ${tests.luceneMatchVersion:LATEST}

  

  
  
  
  
  ${useCompoundFile:false}

  ${solr.tests.maxBufferedDocs}
  ${solr.tests.ramBufferSizeMB}
  ${solr.tests.maxCommitMergeWaitTime:-1}
  ${solr.tests.ramPerThreadHardLimitMB}

  

  1000
  10000

  
  ${solr.tests.lockType:single}

  ${solr.tests.infostream:false}



  

    
      ${solr.autoCommit.maxTime:-1}
    

    

    
      ${solr.ulog.dir:}
    

    
      ${solr.commitwithin.softcommit:true}
    

  

  
    
    ${solr.max.booleanClauses:1024}

    
    

    

    

    

    
    true

    

    

    10

    
    

    
    
    

    
    

    2000

  

  

  
  
    true
  

  
    
     dismax
     *:*
     0.01
     
        text^0.5 features_t^1.0 subject^1.4 title_stemmed^2.0
     
     
        text^0.2 features_t^1.1 subject^1.4 title_stemmed^2.0 title^1.5
     
     
        weight^0.5 recip(rord(id),1,1000,1000)^0.3
     
     
        3<-1 5<-2 6<90%
     
     100
    
  

  

  
  
    
      4
      true
      text,name,subject,title,whitetok
    
  

  
  
    
      4
      true
      text,name,subject,title,whitetok
    
  



  
    
    lowerpunctfilt

    
      default
      lowerfilt
      spellchecker1
      false
    
    
      direct
      DirectSolrSpellChecker
      lowerfilt
      3
    
    
      directMQF2
      DirectSolrSpellChecker
      lowerfilt
      3
      2
    
    
      wordbreak
      solr.WordBreakSolrSpellChecker
      lowerfilt
      true
      true
      10
    
    
      multipleFields
      lowerfilt1and2
      spellcheckerMultipleFields
      false
     
    
    
      jarowinkler
      lowerfilt
      
      org.apache.lucene.search.spell.JaroWinklerDistance
      spellchecker2

    
    
      solr.FileBasedSpellChecker
      external
      spellings.txt
      UTF-8
      spellchecker3
    
    
    
      freq
      lowerfilt
      spellcheckerFreq
      
      freq
      false
    
    
      fqcn
      lowerfilt
      spellcheckerFQCN
      org.apache.solr.spelling.SampleComparator
      false
    
    
      perDict
      org.apache.solr.handler.component.DummyCustomParamSpellChecker
      lowerfilt
    
  

    


  
  

  
    
      
      false
      
      false
      
      1
    
    
      spellcheck
    
  
  
    
      direct
      false
      false
      1
    
    
      spellcheck
    
  
  
    
      default
      wordbreak
      20
    
    
      spellcheck
    
  
  
    
      direct
      wordbreak
      20
    
    
      spellcheck
    
  
  
      
        dismax
        lowerfilt1^1
      
      
        spellcheck
      
 

  

  

  

  
    

    
    
      tvComponent
    
  

  
  

  
  
   
   
    
     100
    
   

   
    
     70
    
   

   
   
    
     <em>
     </em>
    
   

   
   

   
   
   

   
     
       10
       .,!? 	

     
   

   
     
       WORD
       en
       US
     
   
  
  

  
    
    
      max-age=30, public
    
  

  
    
      foo_s
    
    
      foo_s:bar
    
  
  
    
      foo_s
      foo_s:bar
    
  

  
  prefix-${solr.test.sys.prop2}-suffix

  

  
    
      
        uniq
        uniq2
        uniq3
      
    
    
  

  
    
    
      regex_dup_A_s
      x
      x_x
    
    
    
      regex_dup_B_s
      x
      x_x
    
    
  

  
    
    
      regex_dup_A_s
      x
      x_x
    
    
      regex_dup_B_s
      x
      x_x
    
    
  

  
    
    org.apache.solr.rest.ManagedResourceStorage$InMemoryStorageIO
  

  
  
    
      text
    
  

  
  
    text
  
  
    nl
  


	at app//org.apache.solr.common.util.PropertiesUtil.substitute(PropertiesUtil.java:70)
	at app//org.apache.solr.util.DataConfigNode.subtituteVal(DataConfigNode.java:61)
	at app//org.apache.solr.util.DataConfigNode.txt(DataConfigNode.java:91)
	at app//org.apache.solr.core.SolrConfig.<init>(SolrConfig.java:244)
	at app//org.apache.solr.core.SolrConfig.readFromResourceLoader(SolrConfig.java:157)
	... 47 more




Build Log:
[...truncated 10731 lines...]
ERROR: The following test(s) have failed:
  - org.apache.solr.update.RootFieldTest.classMethod (:solr:core)
    Test output: /home/jenkins/jenkins-slave/workspace/Solr/Solr-Check-main/solr/core/build/test-results/test/outputs/OUTPUT-org.apache.solr.update.RootFieldTest.txt
    Reproduce with: gradlew :solr:core:test --tests "org.apache.solr.update.RootFieldTest.classMethod" -Ptests.jvms=4 -Ptests.haltonfailure=false "-Ptests.jvmargs=-XX:TieredStopAtLevel=1 -XX:+UseParallelGC -XX:ActiveProcessorCount=1 -XX:ReservedCodeCacheSize=120m" -Ptests.seed=1384E3678F3177AA -Ptests.multiplier=2 -Ptests.badapples=false -Ptests.file.encoding=US-ASCII

  - org.apache.solr.update.processor.XMLAtomicUpdateMultivalueTest.classMethod (:solr:core)
    Test output: /home/jenkins/jenkins-slave/workspace/Solr/Solr-Check-main/solr/core/build/test-results/test/outputs/OUTPUT-org.apache.solr.update.processor.XMLAtomicUpdateMultivalueTest.txt
    Reproduce with: gradlew :solr:core:test --tests "org.apache.solr.update.processor.XMLAtomicUpdateMultivalueTest.classMethod" -Ptests.jvms=4 -Ptests.haltonfailure=false "-Ptests.jvmargs=-XX:TieredStopAtLevel=1 -XX:+UseParallelGC -XX:ActiveProcessorCount=1 -XX:ReservedCodeCacheSize=120m" -Ptests.seed=1384E3678F3177AA -Ptests.multiplier=2 -Ptests.badapples=false -Ptests.file.encoding=US-ASCII

  - org.apache.solr.update.processor.JavaBinAtomicUpdateMultivalueTest.classMethod (:solr:core)
    Test output: /home/jenkins/jenkins-slave/workspace/Solr/Solr-Check-main/solr/core/build/test-results/test/outputs/OUTPUT-org.apache.solr.update.processor.JavaBinAtomicUpdateMultivalueTest.txt
    Reproduce with: gradlew :solr:core:test --tests "org.apache.solr.update.processor.JavaBinAtomicUpdateMultivalueTest.classMethod" -Ptests.jvms=4 -Ptests.haltonfailure=false "-Ptests.jvmargs=-XX:TieredStopAtLevel=1 -XX:+UseParallelGC -XX:ActiveProcessorCount=1 -XX:ReservedCodeCacheSize=120m" -Ptests.seed=1384E3678F3177AA -Ptests.multiplier=2 -Ptests.badapples=false -Ptests.file.encoding=US-ASCII


Deprecated Gradle features were used in this build, making it incompatible with Gradle 8.0.

You can use '--warning-mode all' to show the individual deprecation warnings and determine if they come from your own scripts or plugins.

See https://docs.gradle.org/7.6/userguide/command_line_interface.html#sec:command_line_warnings

BUILD SUCCESSFUL in 53m 54s
632 actionable tasks: 632 executed
Build step 'Invoke Gradle script' changed build result to SUCCESS
Archiving artifacts
hudson.FilePath$ValidateAntFileMask$1Cancel
	at hudson.FilePath$ValidateAntFileMask$1.isCaseSensitive(FilePath.java:3209)
	at org.apache.tools.ant.DirectoryScanner.lambda$isIncluded$3(DirectoryScanner.java:1374)
	at java.base/java.util.stream.MatchOps$1MatchSink.accept(MatchOps.java:90)
	at java.base/java.util.Spliterators$ArraySpliterator.tryAdvance(Spliterators.java:958)
	at java.base/java.util.stream.ReferencePipeline.forEachWithCancel(ReferencePipeline.java:127)
	at java.base/java.util.stream.AbstractPipeline.copyIntoWithCancel(AbstractPipeline.java:502)
	at java.base/java.util.stream.AbstractPipeline.copyInto(AbstractPipeline.java:488)
	at java.base/java.util.stream.AbstractPipeline.wrapAndCopyInto(AbstractPipeline.java:474)
	at java.base/java.util.stream.MatchOps$MatchOp.evaluateSequential(MatchOps.java:230)
	at java.base/java.util.stream.MatchOps$MatchOp.evaluateSequential(MatchOps.java:196)
	at java.base/java.util.stream.AbstractPipeline.evaluate(AbstractPipeline.java:234)
	at java.base/java.util.stream.ReferencePipeline.anyMatch(ReferencePipeline.java:528)
	at org.apache.tools.ant.DirectoryScanner.isIncluded(DirectoryScanner.java:1374)
	at org.apache.tools.ant.DirectoryScanner.scandir(DirectoryScanner.java:1241)
	at org.apache.tools.ant.DirectoryScanner.scandir(DirectoryScanner.java:1267)
	at org.apache.tools.ant.DirectoryScanner.scandir(DirectoryScanner.java:1267)
	at org.apache.tools.ant.DirectoryScanner.scandir(DirectoryScanner.java:1267)
	at org.apache.tools.ant.DirectoryScanner.scandir(DirectoryScanner.java:1267)
	at org.apache.tools.ant.DirectoryScanner.scandir(DirectoryScanner.java:1267)
	at org.apache.tools.ant.DirectoryScanner.scandir(DirectoryScanner.java:1267)
	at org.apache.tools.ant.DirectoryScanner.scandir(DirectoryScanner.java:1267)
	at org.apache.tools.ant.DirectoryScanner.scandir(DirectoryScanner.java:1267)
	at org.apache.tools.ant.DirectoryScanner.scandir(DirectoryScanner.java:1267)
	at org.apache.tools.ant.DirectoryScanner.scandir(DirectoryScanner.java:1194)
	at org.apache.tools.ant.DirectoryScanner.scandir(DirectoryScanner.java:1156)
	at org.apache.tools.ant.DirectoryScanner.checkIncludePatterns(DirectoryScanner.java:954)
	at org.apache.tools.ant.DirectoryScanner.scan(DirectoryScanner.java:912)
	at hudson.FilePath$ValidateAntFileMask.hasMatch(FilePath.java:3222)
Caused: java.lang.InterruptedException: no matches found within 10000
	at hudson.FilePath$ValidateAntFileMask.hasMatch(FilePath.java:3227)
	at hudson.FilePath$ValidateAntFileMask.invoke(FilePath.java:3105)
	at hudson.FilePath$ValidateAntFileMask.invoke(FilePath.java:3083)
	at hudson.FilePath$FileCallableWrapper.call(FilePath.java:3487)
Also:   hudson.remoting.Channel$CallSiteStackTrace: Remote call to lucene-solr-2
		at hudson.remoting.Channel.attachCallSiteStackTrace(Channel.java:1784)
		at hudson.remoting.UserRequest$ExceptionResponse.retrieve(UserRequest.java:356)
		at hudson.remoting.Channel.call(Channel.java:1000)
		at hudson.FilePath.act(FilePath.java:1194)
		at hudson.FilePath.act(FilePath.java:1183)
		at hudson.FilePath.validateAntFileMask(FilePath.java:3080)
		at hudson.tasks.ArtifactArchiver.perform(ArtifactArchiver.java:269)
		at hudson.tasks.BuildStepCompatibilityLayer.perform(BuildStepCompatibilityLayer.java:79)
		at hudson.tasks.BuildStepMonitor$1.perform(BuildStepMonitor.java:20)
		at hudson.model.AbstractBuild$AbstractBuildExecution.perform(AbstractBuild.java:814)
		at hudson.model.AbstractBuild$AbstractBuildExecution.performAllBuildSteps(AbstractBuild.java:763)
		at hudson.model.Build$BuildExecution.post2(Build.java:179)
		at hudson.model.AbstractBuild$AbstractBuildExecution.post(AbstractBuild.java:707)
		at hudson.model.Run.execute(Run.java:1921)
		at hudson.model.FreeStyleBuild.run(FreeStyleBuild.java:44)
		at hudson.model.ResourceController.execute(ResourceController.java:101)
		at hudson.model.Executor.run(Executor.java:442)
Caused: hudson.FilePath$TunneledInterruptedException
	at hudson.FilePath$FileCallableWrapper.call(FilePath.java:3489)
	at hudson.remoting.UserRequest.perform(UserRequest.java:211)
	at hudson.remoting.UserRequest.perform(UserRequest.java:54)
	at hudson.remoting.Request$2.run(Request.java:376)
	at hudson.remoting.InterceptingExecutorService.lambda$wrap$0(InterceptingExecutorService.java:78)
	at java.base/java.util.concurrent.FutureTask.run(FutureTask.java:264)
	at java.base/java.util.concurrent.ThreadPoolExecutor.runWorker(ThreadPoolExecutor.java:1128)
	at java.base/java.util.concurrent.ThreadPoolExecutor$Worker.run(ThreadPoolExecutor.java:628)
	at java.base/java.lang.Thread.run(Thread.java:829)
Caused: java.lang.InterruptedException: java.lang.InterruptedException: no matches found within 10000
	at hudson.FilePath.act(FilePath.java:1196)
	at hudson.FilePath.act(FilePath.java:1183)
	at hudson.FilePath.validateAntFileMask(FilePath.java:3080)
	at hudson.tasks.ArtifactArchiver.perform(ArtifactArchiver.java:269)
	at hudson.tasks.BuildStepCompatibilityLayer.perform(BuildStepCompatibilityLayer.java:79)
	at hudson.tasks.BuildStepMonitor$1.perform(BuildStepMonitor.java:20)
	at hudson.model.AbstractBuild$AbstractBuildExecution.perform(AbstractBuild.java:814)
	at hudson.model.AbstractBuild$AbstractBuildExecution.performAllBuildSteps(AbstractBuild.java:763)
	at hudson.model.Build$BuildExecution.post2(Build.java:179)
	at hudson.model.AbstractBuild$AbstractBuildExecution.post(AbstractBuild.java:707)
	at hudson.model.Run.execute(Run.java:1921)
	at hudson.model.FreeStyleBuild.run(FreeStyleBuild.java:44)
	at hudson.model.ResourceController.execute(ResourceController.java:101)
	at hudson.model.Executor.run(Executor.java:442)
No artifacts found that match the file pattern "**/*.events,heapdumps/**,**/hs_err_pid*". Configuration error?
Recording test results
[Checks API] No suitable checks publisher found.
Build step 'Publish JUnit test result report' changed build result to UNSTABLE
Email was triggered for: Unstable (Test Failures)
Sending email for trigger: Unstable (Test Failures)

[JENKINS] Solr » Solr-Check-main - Build # 6044 - Still Unstable!

Posted by Apache Jenkins Server <je...@builds.apache.org>.
Build: https://ci-builds.apache.org/job/Solr/job/Solr-Check-main/6044/

1 tests failed.
FAILED:  org.apache.solr.metrics.reporters.SolrJmxReporterTest.testClosedCore

Error Message:
com.carrotsearch.randomizedtesting.UncaughtExceptionError: Captured an uncaught exception in thread: Thread[id=15192, name=TestMBeanThread, state=RUNNABLE, group=TGRP-SolrJmxReporterTest]

Stack Trace:
com.carrotsearch.randomizedtesting.UncaughtExceptionError: Captured an uncaught exception in thread: Thread[id=15192, name=TestMBeanThread, state=RUNNABLE, group=TGRP-SolrJmxReporterTest]
	at __randomizedtesting.SeedInfo.seed([8E67E64360A1A380:F91A30634038C170]:0)
Caused by: java.lang.AssertionError
	at __randomizedtesting.SeedInfo.seed([8E67E64360A1A380]:0)
	at org.junit.Assert.fail(Assert.java:87)
	at org.junit.Assert.assertTrue(Assert.java:42)
	at org.junit.Assert.assertNotNull(Assert.java:713)
	at org.junit.Assert.assertNotNull(Assert.java:723)
	at org.apache.solr.metrics.reporters.SolrJmxReporterTest.lambda$testClosedCore$3(SolrJmxReporterTest.java:239)
	at java.base/java.lang.Thread.run(Thread.java:829)




Build Log:
[...truncated 1401 lines...]
ERROR: The following test(s) have failed:
  - org.apache.solr.metrics.reporters.SolrJmxReporterTest.testClosedCore (:solr:core)
    Test output: /home/jenkins/jenkins-slave/workspace/Solr/Solr-Check-main/solr/core/build/test-results/test/outputs/OUTPUT-org.apache.solr.metrics.reporters.SolrJmxReporterTest.txt
    Reproduce with: gradlew :solr:core:test --tests "org.apache.solr.metrics.reporters.SolrJmxReporterTest.testClosedCore" -Ptests.jvms=4 -Ptests.haltonfailure=false "-Ptests.jvmargs=-XX:TieredStopAtLevel=1 -XX:+UseParallelGC -XX:ActiveProcessorCount=1 -XX:ReservedCodeCacheSize=120m" -Ptests.seed=8E67E64360A1A380 -Ptests.multiplier=2 -Ptests.badapples=false -Ptests.file.encoding=US-ASCII


Deprecated Gradle features were used in this build, making it incompatible with Gradle 8.0.

You can use '--warning-mode all' to show the individual deprecation warnings and determine if they come from your own scripts or plugins.

See https://docs.gradle.org/7.6/userguide/command_line_interface.html#sec:command_line_warnings

BUILD SUCCESSFUL in 1h 8m 43s
632 actionable tasks: 632 executed
Build step 'Invoke Gradle script' changed build result to SUCCESS
Archiving artifacts
hudson.FilePath$ValidateAntFileMask$1Cancel
	at hudson.FilePath$ValidateAntFileMask$1.isCaseSensitive(FilePath.java:3209)
	at org.apache.tools.ant.DirectoryScanner.isIncluded(DirectoryScanner.java:1370)
	at org.apache.tools.ant.DirectoryScanner.scandir(DirectoryScanner.java:1260)
	at org.apache.tools.ant.DirectoryScanner.scandir(DirectoryScanner.java:1267)
	at org.apache.tools.ant.DirectoryScanner.scandir(DirectoryScanner.java:1267)
	at org.apache.tools.ant.DirectoryScanner.scandir(DirectoryScanner.java:1267)
	at org.apache.tools.ant.DirectoryScanner.scandir(DirectoryScanner.java:1267)
	at org.apache.tools.ant.DirectoryScanner.scandir(DirectoryScanner.java:1267)
	at org.apache.tools.ant.DirectoryScanner.scandir(DirectoryScanner.java:1267)
	at org.apache.tools.ant.DirectoryScanner.scandir(DirectoryScanner.java:1194)
	at org.apache.tools.ant.DirectoryScanner.scandir(DirectoryScanner.java:1156)
	at org.apache.tools.ant.DirectoryScanner.checkIncludePatterns(DirectoryScanner.java:954)
	at org.apache.tools.ant.DirectoryScanner.scan(DirectoryScanner.java:912)
	at hudson.FilePath$ValidateAntFileMask.hasMatch(FilePath.java:3222)
Caused: java.lang.InterruptedException: no matches found within 10000
	at hudson.FilePath$ValidateAntFileMask.hasMatch(FilePath.java:3227)
	at hudson.FilePath$ValidateAntFileMask.invoke(FilePath.java:3105)
	at hudson.FilePath$ValidateAntFileMask.invoke(FilePath.java:3083)
	at hudson.FilePath$FileCallableWrapper.call(FilePath.java:3487)
Also:   hudson.remoting.Channel$CallSiteStackTrace: Remote call to lucene-solr-1
		at hudson.remoting.Channel.attachCallSiteStackTrace(Channel.java:1784)
		at hudson.remoting.UserRequest$ExceptionResponse.retrieve(UserRequest.java:356)
		at hudson.remoting.Channel.call(Channel.java:1000)
		at hudson.FilePath.act(FilePath.java:1194)
		at hudson.FilePath.act(FilePath.java:1183)
		at hudson.FilePath.validateAntFileMask(FilePath.java:3080)
		at hudson.tasks.ArtifactArchiver.perform(ArtifactArchiver.java:269)
		at hudson.tasks.BuildStepCompatibilityLayer.perform(BuildStepCompatibilityLayer.java:79)
		at hudson.tasks.BuildStepMonitor$1.perform(BuildStepMonitor.java:20)
		at hudson.model.AbstractBuild$AbstractBuildExecution.perform(AbstractBuild.java:814)
		at hudson.model.AbstractBuild$AbstractBuildExecution.performAllBuildSteps(AbstractBuild.java:763)
		at hudson.model.Build$BuildExecution.post2(Build.java:179)
		at hudson.model.AbstractBuild$AbstractBuildExecution.post(AbstractBuild.java:707)
		at hudson.model.Run.execute(Run.java:1921)
		at hudson.model.FreeStyleBuild.run(FreeStyleBuild.java:44)
		at hudson.model.ResourceController.execute(ResourceController.java:101)
		at hudson.model.Executor.run(Executor.java:442)
Caused: hudson.FilePath$TunneledInterruptedException
	at hudson.FilePath$FileCallableWrapper.call(FilePath.java:3489)
	at hudson.remoting.UserRequest.perform(UserRequest.java:211)
	at hudson.remoting.UserRequest.perform(UserRequest.java:54)
	at hudson.remoting.Request$2.run(Request.java:376)
	at hudson.remoting.InterceptingExecutorService.lambda$wrap$0(InterceptingExecutorService.java:78)
	at java.base/java.util.concurrent.FutureTask.run(FutureTask.java:264)
	at java.base/java.util.concurrent.ThreadPoolExecutor.runWorker(ThreadPoolExecutor.java:1128)
	at java.base/java.util.concurrent.ThreadPoolExecutor$Worker.run(ThreadPoolExecutor.java:628)
	at java.base/java.lang.Thread.run(Thread.java:829)
Caused: java.lang.InterruptedException: java.lang.InterruptedException: no matches found within 10000
	at hudson.FilePath.act(FilePath.java:1196)
	at hudson.FilePath.act(FilePath.java:1183)
	at hudson.FilePath.validateAntFileMask(FilePath.java:3080)
	at hudson.tasks.ArtifactArchiver.perform(ArtifactArchiver.java:269)
	at hudson.tasks.BuildStepCompatibilityLayer.perform(BuildStepCompatibilityLayer.java:79)
	at hudson.tasks.BuildStepMonitor$1.perform(BuildStepMonitor.java:20)
	at hudson.model.AbstractBuild$AbstractBuildExecution.perform(AbstractBuild.java:814)
	at hudson.model.AbstractBuild$AbstractBuildExecution.performAllBuildSteps(AbstractBuild.java:763)
	at hudson.model.Build$BuildExecution.post2(Build.java:179)
	at hudson.model.AbstractBuild$AbstractBuildExecution.post(AbstractBuild.java:707)
	at hudson.model.Run.execute(Run.java:1921)
	at hudson.model.FreeStyleBuild.run(FreeStyleBuild.java:44)
	at hudson.model.ResourceController.execute(ResourceController.java:101)
	at hudson.model.Executor.run(Executor.java:442)
No artifacts found that match the file pattern "**/*.events,heapdumps/**,**/hs_err_pid*". Configuration error?
Recording test results
[Checks API] No suitable checks publisher found.
Build step 'Publish JUnit test result report' changed build result to UNSTABLE
Email was triggered for: Unstable (Test Failures)
Sending email for trigger: Unstable (Test Failures)