You are viewing a plain text version of this content. The canonical link for it is here.
Posted to dev@lucene.apache.org by Policeman Jenkins Server <je...@thetaphi.de> on 2018/12/02 23:23:51 UTC

[JENKINS] Lucene-Solr-master-Linux (32bit/jdk1.8.0_172) - Build # 23288 - Unstable!

Build: https://jenkins.thetaphi.de/job/Lucene-Solr-master-Linux/23288/
Java: 32bit/jdk1.8.0_172 -client -XX:+UseSerialGC

1 tests failed.
FAILED:  org.apache.solr.cloud.TestSolrCloudWithKerberosAlt.testBasics

Error Message:


Stack Trace:
java.lang.NullPointerException
	at __randomizedtesting.SeedInfo.seed([82A5BA345B42124E:BF7D141863AC4C3E]:0)
	at org.apache.commons.io.FileUtils.deleteDirectory(FileUtils.java:1570)
	at org.apache.solr.cloud.KerberosTestServices.start(KerberosTestServices.java:79)
	at org.apache.solr.cloud.TestSolrCloudWithKerberosAlt.setupMiniKdc(TestSolrCloudWithKerberosAlt.java:84)
	at org.apache.solr.cloud.TestSolrCloudWithKerberosAlt.setUp(TestSolrCloudWithKerberosAlt.java:70)
	at sun.reflect.GeneratedMethodAccessor26.invoke(Unknown Source)
	at sun.reflect.DelegatingMethodAccessorImpl.invoke(DelegatingMethodAccessorImpl.java:43)
	at java.lang.reflect.Method.invoke(Method.java:498)
	at com.carrotsearch.randomizedtesting.RandomizedRunner.invoke(RandomizedRunner.java:1742)
	at com.carrotsearch.randomizedtesting.RandomizedRunner$9.evaluate(RandomizedRunner.java:969)
	at com.carrotsearch.randomizedtesting.RandomizedRunner$10.evaluate(RandomizedRunner.java:985)
	at com.carrotsearch.randomizedtesting.rules.SystemPropertiesRestoreRule$1.evaluate(SystemPropertiesRestoreRule.java:57)
	at org.apache.lucene.util.TestRuleSetupTeardownChained$1.evaluate(TestRuleSetupTeardownChained.java:49)
	at org.apache.lucene.util.AbstractBeforeAfterRule$1.evaluate(AbstractBeforeAfterRule.java:45)
	at org.apache.lucene.util.TestRuleThreadAndTestName$1.evaluate(TestRuleThreadAndTestName.java:48)
	at org.apache.lucene.util.TestRuleIgnoreAfterMaxFailures$1.evaluate(TestRuleIgnoreAfterMaxFailures.java:64)
	at org.apache.lucene.util.TestRuleMarkFailure$1.evaluate(TestRuleMarkFailure.java:47)
	at com.carrotsearch.randomizedtesting.rules.StatementAdapter.evaluate(StatementAdapter.java:36)
	at com.carrotsearch.randomizedtesting.ThreadLeakControl$StatementRunner.run(ThreadLeakControl.java:368)
	at com.carrotsearch.randomizedtesting.ThreadLeakControl.forkTimeoutingTask(ThreadLeakControl.java:817)
	at com.carrotsearch.randomizedtesting.ThreadLeakControl$3.evaluate(ThreadLeakControl.java:468)
	at com.carrotsearch.randomizedtesting.RandomizedRunner.runSingleTest(RandomizedRunner.java:944)
	at com.carrotsearch.randomizedtesting.RandomizedRunner$5.evaluate(RandomizedRunner.java:830)
	at com.carrotsearch.randomizedtesting.RandomizedRunner$6.evaluate(RandomizedRunner.java:880)
	at com.carrotsearch.randomizedtesting.RandomizedRunner$7.evaluate(RandomizedRunner.java:891)
	at com.carrotsearch.randomizedtesting.rules.StatementAdapter.evaluate(StatementAdapter.java:36)
	at com.carrotsearch.randomizedtesting.rules.SystemPropertiesRestoreRule$1.evaluate(SystemPropertiesRestoreRule.java:57)
	at org.apache.lucene.util.AbstractBeforeAfterRule$1.evaluate(AbstractBeforeAfterRule.java:45)
	at com.carrotsearch.randomizedtesting.rules.StatementAdapter.evaluate(StatementAdapter.java:36)
	at org.apache.lucene.util.TestRuleStoreClassName$1.evaluate(TestRuleStoreClassName.java:41)
	at com.carrotsearch.randomizedtesting.rules.NoShadowingOrOverridesOnMethodsRule$1.evaluate(NoShadowingOrOverridesOnMethodsRule.java:40)
	at com.carrotsearch.randomizedtesting.rules.NoShadowingOrOverridesOnMethodsRule$1.evaluate(NoShadowingOrOverridesOnMethodsRule.java:40)
	at com.carrotsearch.randomizedtesting.rules.StatementAdapter.evaluate(StatementAdapter.java:36)
	at com.carrotsearch.randomizedtesting.rules.StatementAdapter.evaluate(StatementAdapter.java:36)
	at com.carrotsearch.randomizedtesting.rules.StatementAdapter.evaluate(StatementAdapter.java:36)
	at org.apache.lucene.util.TestRuleAssertionsRequired$1.evaluate(TestRuleAssertionsRequired.java:53)
	at org.apache.lucene.util.TestRuleMarkFailure$1.evaluate(TestRuleMarkFailure.java:47)
	at org.apache.lucene.util.TestRuleIgnoreAfterMaxFailures$1.evaluate(TestRuleIgnoreAfterMaxFailures.java:64)
	at org.apache.lucene.util.TestRuleIgnoreTestSuites$1.evaluate(TestRuleIgnoreTestSuites.java:54)
	at com.carrotsearch.randomizedtesting.rules.StatementAdapter.evaluate(StatementAdapter.java:36)
	at com.carrotsearch.randomizedtesting.ThreadLeakControl$StatementRunner.run(ThreadLeakControl.java:368)
	at java.lang.Thread.run(Thread.java:748)




Build Log:
[...truncated 14369 lines...]
   [junit4] Suite: org.apache.solr.cloud.TestSolrCloudWithKerberosAlt
   [junit4]   2> 1830808 INFO  (SUITE-TestSolrCloudWithKerberosAlt-seed#[82A5BA345B42124E]-worker) [    ] o.a.s.SolrTestCaseJ4 SecureRandom sanity checks: test.solr.allowed.securerandom=null & java.security.egd=file:/dev/./urandom
   [junit4]   2> Creating dataDir: /home/jenkins/workspace/Lucene-Solr-master-Linux/solr/build/solr-core/test/J0/temp/solr.cloud.TestSolrCloudWithKerberosAlt_82A5BA345B42124E-001/init-core-data-001
   [junit4]   2> 1830809 WARN  (SUITE-TestSolrCloudWithKerberosAlt-seed#[82A5BA345B42124E]-worker) [    ] o.a.s.SolrTestCaseJ4 startTrackingSearchers: numOpens=146 numCloses=146
   [junit4]   2> 1830809 INFO  (SUITE-TestSolrCloudWithKerberosAlt-seed#[82A5BA345B42124E]-worker) [    ] o.a.s.SolrTestCaseJ4 Using PointFields (NUMERIC_POINTS_SYSPROP=true) w/NUMERIC_DOCVALUES_SYSPROP=true
   [junit4]   2> 1830811 INFO  (SUITE-TestSolrCloudWithKerberosAlt-seed#[82A5BA345B42124E]-worker) [    ] o.a.s.SolrTestCaseJ4 Randomized ssl (true) and clientAuth (false) via: @org.apache.solr.util.RandomizeSSL(reason=, ssl=NaN, value=NaN, clientAuth=NaN)
   [junit4]   2> 1830815 INFO  (TEST-TestSolrCloudWithKerberosAlt.testBasics-seed#[82A5BA345B42124E]) [    ] o.a.s.SolrTestCaseJ4 ###Starting testBasics
   [junit4]   2> 1836137 WARN  (TEST-TestSolrCloudWithKerberosAlt.testBasics-seed#[82A5BA345B42124E]) [    ] o.a.d.s.c.DefaultDirectoryService You didn't change the admin password of directory service instance 'DefaultKrbServer'.  Please update the admin password as soon as possible to prevent a possible security breach.
   [junit4]   2> 1839751 INFO  (TEST-TestSolrCloudWithKerberosAlt.testBasics-seed#[82A5BA345B42124E]) [    ] o.a.s.SolrTestCaseJ4 ###Ending testBasics
   [junit4]   2> NOTE: reproduce with: ant test  -Dtestcase=TestSolrCloudWithKerberosAlt -Dtests.method=testBasics -Dtests.seed=82A5BA345B42124E -Dtests.multiplier=3 -Dtests.slow=true -Dtests.locale=es-UY -Dtests.timezone=PRT -Dtests.asserts=true -Dtests.file.encoding=UTF-8
   [junit4] ERROR   8.94s J0 | TestSolrCloudWithKerberosAlt.testBasics <<<
   [junit4]    > Throwable #1: java.lang.NullPointerException
   [junit4]    > 	at __randomizedtesting.SeedInfo.seed([82A5BA345B42124E:BF7D141863AC4C3E]:0)
   [junit4]    > 	at org.apache.commons.io.FileUtils.deleteDirectory(FileUtils.java:1570)
   [junit4]    > 	at org.apache.solr.cloud.KerberosTestServices.start(KerberosTestServices.java:79)
   [junit4]    > 	at org.apache.solr.cloud.TestSolrCloudWithKerberosAlt.setupMiniKdc(TestSolrCloudWithKerberosAlt.java:84)
   [junit4]    > 	at org.apache.solr.cloud.TestSolrCloudWithKerberosAlt.setUp(TestSolrCloudWithKerberosAlt.java:70)
   [junit4]    > 	at java.lang.Thread.run(Thread.java:748)
   [junit4]   2> NOTE: leaving temporary files on disk at: /home/jenkins/workspace/Lucene-Solr-master-Linux/solr/build/solr-core/test/J0/temp/solr.cloud.TestSolrCloudWithKerberosAlt_82A5BA345B42124E-001
   [junit4]   2> NOTE: test params are: codec=Asserting(Lucene80): {}, docValues:{}, maxPointsInLeafNode=1270, maxMBSortInHeap=5.965377963336113, sim=Asserting(org.apache.lucene.search.similarities.AssertingSimilarity@265f61), locale=es-UY, timezone=PRT
   [junit4]   2> NOTE: Linux 4.15.0-39-generic i386/Oracle Corporation 1.8.0_172 (32-bit)/cpus=8,threads=1,free=222790912,total=394502144
   [junit4]   2> NOTE: All tests run in this JVM: [TestFieldCacheSortRandom, RestoreTriggerStateTest, RuleEngineTest, JvmMetricsTest, SearchHandlerTest, CurrencyRangeFacetCloudTest, SegmentsInfoRequestHandlerTest, TestFaceting, CoreAdminHandlerTest, DeleteReplicaTest, HttpPartitionOnCommitTest, TestBlobHandler, TestManagedResource, DistributedFacetPivotLargeTest, TestTolerantUpdateProcessorRandomCloud, TestLRUCache, SolrJmxReporterTest, DistributedQueueTest, HdfsLockFactoryTest, CollectionsAPIDistributedZkTest, FieldMutatingUpdateProcessorTest, TestConfigSetProperties, FileBasedSpellCheckerTest, ScriptEngineTest, TermVectorComponentDistributedTest, UpdateRequestProcessorFactoryTest, BlockDirectoryTest, TestClusterProperties, BlockJoinFacetSimpleTest, TestLeaderElectionZkExpiry, ZkControllerTest, TestFieldTypeCollectionResource, CoreMergeIndexesAdminHandlerTest, CdcrOpsAndBoundariesTest, TestCloudJSONFacetJoinDomain, ParsingFieldUpdateProcessorsTest, TestSolrConfigHandler, TestPKIAuthenticationPlugin, TestFileDictionaryLookup, SortSpecParsingTest, RankQueryTest, LeaderElectionIntegrationTest, CollectionReloadTest, CdcrVersionReplicationTest, TestMaxTokenLenTokenizer, TestLocalFSCloudBackupRestore, TestPartialUpdateDeduplication, LukeRequestHandlerTest, TestValueSourceCache, CachingDirectoryFactoryTest, TestExclusionRuleCollectionAccess, OpenCloseCoreStressTest, NodeLostTriggerIntegrationTest, FacetPivotSmallTest, TestGroupingSearch, TestBulkSchemaAPI, BasicZkTest, TestPivotHelperCode, SortByFunctionTest, ZkShardTermsTest, AdminHandlersProxyTest, V2StandaloneTest, TestRebalanceLeaders, HdfsThreadLeakTest, TestReload, DirectoryFactoryTest, DistributedSpellCheckComponentTest, JavabinLoaderTest, TestSQLHandler, SSLMigrationTest, TestPerFieldSimilarityWithDefaultOverride, MetricsHistoryHandlerTest, TestSort, PathHierarchyTokenizerFactoryTest, TestMacroExpander, HttpTriggerListenerTest, TestLegacyField, CleanupOldIndexTest, SOLR749Test, SynonymTokenizerTest, HttpSolrCallGetCoreTest, TestDynamicFieldResource, TestSimClusterStateProvider, NotRequiredUniqueKeyTest, TestCloudManagedSchema, OverseerStatusTest, TestSolrCoreProperties, SolrCmdDistributorTest, TestInPlaceUpdatesStandalone, TestWordDelimiterFilterFactory, BasicAuthStandaloneTest, Tagger2Test, MissingSegmentRecoveryTest, TestJsonRequest, TestIndexSearcher, HdfsBasicDistributedZk2Test, DistribCursorPagingTest, ComputePlanActionTest, CopyFieldTest, StatelessScriptUpdateProcessorFactoryTest, TestExactStatsCache, EchoParamsTest, ClusterStateUpdateTest, RAMDirectoryFactoryTest, TestSearcherReuse, SystemLogListenerTest, ConnectionManagerTest, SolrCLIZkUtilsTest, TestCollapseQParserPlugin, RemoteQueryErrorTest, BJQParserTest, HighlighterMaxOffsetTest, PeerSyncWithBufferUpdatesTest, TestStressRecovery, NodeMutatorTest, TestSuggestSpellingConverter, NumberUtilsTest, TestHighFrequencyDictionaryFactory, TestExceedMaxTermLength, AnalysisAfterCoreReloadTest, TestSolrIndexConfig, AddReplicaTest, QueryElevationComponentTest, TestOnReconnectListenerSupport, TestManagedSynonymFilterFactory, HdfsRecoveryZkTest, TestZkAclsWithHadoopAuth, ForceLeaderTest, ClassificationUpdateProcessorIntegrationTest, SchemaVersionSpecificBehaviorTest, TestSolrFieldCacheBean, SampleTest, UtilsToolTest, DistributedDebugComponentTest, TestCollectionAPI, IndexSchemaRuntimeFieldTest, BigEndianAscendingWordDeserializerTest, SpellCheckCollatorWithCollapseTest, TestDistributedSearch, TestRandomFaceting, TestReversedWildcardFilterFactory, TestJettySolrRunner, ActionThrottleTest, AsyncCallRequestStatusResponseTest, BasicDistributedZkTest, DeleteLastCustomShardedReplicaTest, DeleteNodeTest, LeaderFailureAfterFreshStartTest, LegacyCloudClusterPropTest, MetricsHistoryIntegrationTest, MigrateRouteKeyTest, OverseerCollectionConfigSetProcessorTest, OverseerModifyCollectionTest, OverseerRolesTest, RecoveryAfterSoftCommitTest, ShardRoutingTest, SharedFSAutoReplicaFailoverTest, SliceStateTest, SplitShardTest, TestAuthenticationFramework, TestCloudInspectUtil, TestCloudPhrasesIdentificationComponent, TestCloudPseudoReturnFields, TestCloudRecovery, TestCloudRecovery2, TestConfigSetsAPIZkFailure, TestDeleteCollectionOnDownNodes, TestDistribDocBasedVersion, TestPullReplicaErrorHandling, TestSegmentSorting, TestSolrCloudWithKerberosAlt]
   [junit4] Completed [501/837 (1!)] on J0 in 8.99s, 1 test, 1 error <<< FAILURES!

[...truncated 46315 lines...]
[repro] Jenkins log URL: https://jenkins.thetaphi.de/job/Lucene-Solr-master-Linux/23288/consoleText

[repro] Revision: c951578fcabfd5520f425156b0fa35f35811554d

[repro] Ant options: "-Dargs=-client -XX:+UseSerialGC"
[repro] Repro line:  ant test  -Dtestcase=TestSolrCloudWithKerberosAlt -Dtests.method=testBasics -Dtests.seed=82A5BA345B42124E -Dtests.multiplier=3 -Dtests.slow=true -Dtests.locale=es-UY -Dtests.timezone=PRT -Dtests.asserts=true -Dtests.file.encoding=UTF-8

[repro] ant clean

[...truncated 6 lines...]
[repro] Test suites by module:
[repro]    solr/core
[repro]       TestSolrCloudWithKerberosAlt
[repro] ant compile-test

[...truncated 3574 lines...]
[repro] ant test-nocompile -Dtests.dups=5 -Dtests.maxfailures=5 -Dtests.class="*.TestSolrCloudWithKerberosAlt" -Dtests.showOutput=onerror "-Dargs=-client -XX:+UseSerialGC" -Dtests.seed=82A5BA345B42124E -Dtests.multiplier=3 -Dtests.slow=true -Dtests.locale=es-UY -Dtests.timezone=PRT -Dtests.asserts=true -Dtests.file.encoding=UTF-8

[...truncated 70 lines...]
[repro] Failures:
[repro]   0/5 failed: org.apache.solr.cloud.TestSolrCloudWithKerberosAlt
[repro] Exiting with code 0

[...truncated 40 lines...]

[JENKINS] Lucene-Solr-master-Linux (64bit/jdk-9.0.4) - Build # 23289 - Still Unstable!

Posted by Policeman Jenkins Server <je...@thetaphi.de>.
Build: https://jenkins.thetaphi.de/job/Lucene-Solr-master-Linux/23289/
Java: 64bit/jdk-9.0.4 -XX:+UseCompressedOops -XX:+UseG1GC

1 tests failed.
FAILED:  org.apache.solr.update.processor.TimeRoutedAliasUpdateProcessorTest.testPreemptiveCreation

Error Message:
Error from server at http://127.0.0.1:38757/solr: no core retrieved for testPreemptiveCreation

Stack Trace:
org.apache.solr.client.solrj.impl.HttpSolrClient$RemoteExecutionException: Error from server at http://127.0.0.1:38757/solr: no core retrieved for testPreemptiveCreation
	at __randomizedtesting.SeedInfo.seed([87AA84094394A25D:EAC001A27BF64F69]:0)
	at org.apache.solr.client.solrj.impl.HttpSolrClient$RemoteExecutionException.create(HttpSolrClient.java:830)
	at org.apache.solr.client.solrj.impl.HttpSolrClient.executeMethod(HttpSolrClient.java:620)
	at org.apache.solr.client.solrj.impl.HttpSolrClient.request(HttpSolrClient.java:255)
	at org.apache.solr.client.solrj.impl.HttpSolrClient.request(HttpSolrClient.java:244)
	at org.apache.solr.client.solrj.impl.LBHttpSolrClient.doRequest(LBHttpSolrClient.java:484)
	at org.apache.solr.client.solrj.impl.LBHttpSolrClient.request(LBHttpSolrClient.java:414)
	at org.apache.solr.client.solrj.impl.CloudSolrClient.sendRequest(CloudSolrClient.java:1110)
	at org.apache.solr.client.solrj.impl.CloudSolrClient.requestWithRetryOnStaleState(CloudSolrClient.java:884)
	at org.apache.solr.client.solrj.impl.CloudSolrClient.request(CloudSolrClient.java:817)
	at org.apache.solr.client.solrj.SolrClient.request(SolrClient.java:1260)
	at org.apache.solr.update.processor.TimeRoutedAliasUpdateProcessorTest.createConfigSet(TimeRoutedAliasUpdateProcessorTest.java:229)
	at org.apache.solr.update.processor.TimeRoutedAliasUpdateProcessorTest.testPreemptiveCreation(TimeRoutedAliasUpdateProcessorTest.java:338)
	at java.base/jdk.internal.reflect.NativeMethodAccessorImpl.invoke0(Native Method)
	at java.base/jdk.internal.reflect.NativeMethodAccessorImpl.invoke(NativeMethodAccessorImpl.java:62)
	at java.base/jdk.internal.reflect.DelegatingMethodAccessorImpl.invoke(DelegatingMethodAccessorImpl.java:43)
	at java.base/java.lang.reflect.Method.invoke(Method.java:564)
	at com.carrotsearch.randomizedtesting.RandomizedRunner.invoke(RandomizedRunner.java:1742)
	at com.carrotsearch.randomizedtesting.RandomizedRunner$8.evaluate(RandomizedRunner.java:935)
	at com.carrotsearch.randomizedtesting.RandomizedRunner$9.evaluate(RandomizedRunner.java:971)
	at com.carrotsearch.randomizedtesting.RandomizedRunner$10.evaluate(RandomizedRunner.java:985)
	at com.carrotsearch.randomizedtesting.rules.SystemPropertiesRestoreRule$1.evaluate(SystemPropertiesRestoreRule.java:57)
	at org.apache.lucene.util.TestRuleSetupTeardownChained$1.evaluate(TestRuleSetupTeardownChained.java:49)
	at org.apache.lucene.util.AbstractBeforeAfterRule$1.evaluate(AbstractBeforeAfterRule.java:45)
	at org.apache.lucene.util.TestRuleThreadAndTestName$1.evaluate(TestRuleThreadAndTestName.java:48)
	at org.apache.lucene.util.TestRuleIgnoreAfterMaxFailures$1.evaluate(TestRuleIgnoreAfterMaxFailures.java:64)
	at org.apache.lucene.util.TestRuleMarkFailure$1.evaluate(TestRuleMarkFailure.java:47)
	at com.carrotsearch.randomizedtesting.rules.StatementAdapter.evaluate(StatementAdapter.java:36)
	at com.carrotsearch.randomizedtesting.ThreadLeakControl$StatementRunner.run(ThreadLeakControl.java:368)
	at com.carrotsearch.randomizedtesting.ThreadLeakControl.forkTimeoutingTask(ThreadLeakControl.java:817)
	at com.carrotsearch.randomizedtesting.ThreadLeakControl$3.evaluate(ThreadLeakControl.java:468)
	at com.carrotsearch.randomizedtesting.RandomizedRunner.runSingleTest(RandomizedRunner.java:944)
	at com.carrotsearch.randomizedtesting.RandomizedRunner$5.evaluate(RandomizedRunner.java:830)
	at com.carrotsearch.randomizedtesting.RandomizedRunner$6.evaluate(RandomizedRunner.java:880)
	at com.carrotsearch.randomizedtesting.RandomizedRunner$7.evaluate(RandomizedRunner.java:891)
	at com.carrotsearch.randomizedtesting.rules.StatementAdapter.evaluate(StatementAdapter.java:36)
	at com.carrotsearch.randomizedtesting.rules.SystemPropertiesRestoreRule$1.evaluate(SystemPropertiesRestoreRule.java:57)
	at org.apache.lucene.util.AbstractBeforeAfterRule$1.evaluate(AbstractBeforeAfterRule.java:45)
	at com.carrotsearch.randomizedtesting.rules.StatementAdapter.evaluate(StatementAdapter.java:36)
	at org.apache.lucene.util.TestRuleStoreClassName$1.evaluate(TestRuleStoreClassName.java:41)
	at com.carrotsearch.randomizedtesting.rules.NoShadowingOrOverridesOnMethodsRule$1.evaluate(NoShadowingOrOverridesOnMethodsRule.java:40)
	at com.carrotsearch.randomizedtesting.rules.NoShadowingOrOverridesOnMethodsRule$1.evaluate(NoShadowingOrOverridesOnMethodsRule.java:40)
	at com.carrotsearch.randomizedtesting.rules.StatementAdapter.evaluate(StatementAdapter.java:36)
	at com.carrotsearch.randomizedtesting.rules.StatementAdapter.evaluate(StatementAdapter.java:36)
	at org.apache.lucene.util.TestRuleAssertionsRequired$1.evaluate(TestRuleAssertionsRequired.java:53)
	at org.apache.lucene.util.TestRuleMarkFailure$1.evaluate(TestRuleMarkFailure.java:47)
	at org.apache.lucene.util.TestRuleIgnoreAfterMaxFailures$1.evaluate(TestRuleIgnoreAfterMaxFailures.java:64)
	at org.apache.lucene.util.TestRuleIgnoreTestSuites$1.evaluate(TestRuleIgnoreTestSuites.java:54)
	at com.carrotsearch.randomizedtesting.rules.StatementAdapter.evaluate(StatementAdapter.java:36)
	at com.carrotsearch.randomizedtesting.ThreadLeakControl$StatementRunner.run(ThreadLeakControl.java:368)
	at java.base/java.lang.Thread.run(Thread.java:844)




Build Log:
[...truncated 13832 lines...]
   [junit4] Suite: org.apache.solr.update.processor.TimeRoutedAliasUpdateProcessorTest
   [junit4]   2> 796007 INFO  (SUITE-TimeRoutedAliasUpdateProcessorTest-seed#[87AA84094394A25D]-worker) [    ] o.a.s.SolrTestCaseJ4 SecureRandom sanity checks: test.solr.allowed.securerandom=null & java.security.egd=file:/dev/./urandom
   [junit4]   2> Creating dataDir: /home/jenkins/workspace/Lucene-Solr-master-Linux/solr/build/solr-core/test/J1/temp/solr.update.processor.TimeRoutedAliasUpdateProcessorTest_87AA84094394A25D-001/init-core-data-001
   [junit4]   2> 796008 WARN  (SUITE-TimeRoutedAliasUpdateProcessorTest-seed#[87AA84094394A25D]-worker) [    ] o.a.s.SolrTestCaseJ4 startTrackingSearchers: numOpens=127 numCloses=127
   [junit4]   2> 796008 INFO  (SUITE-TimeRoutedAliasUpdateProcessorTest-seed#[87AA84094394A25D]-worker) [    ] o.a.s.SolrTestCaseJ4 Using PointFields (NUMERIC_POINTS_SYSPROP=true) w/NUMERIC_DOCVALUES_SYSPROP=false
   [junit4]   2> 796009 INFO  (SUITE-TimeRoutedAliasUpdateProcessorTest-seed#[87AA84094394A25D]-worker) [    ] o.a.s.SolrTestCaseJ4 Randomized ssl (false) and clientAuth (true) via: @org.apache.solr.util.RandomizeSSL(reason="", ssl=0.0/0.0, value=0.0/0.0, clientAuth=0.0/0.0)
   [junit4]   2> 796010 INFO  (TEST-TimeRoutedAliasUpdateProcessorTest.testSliceRouting-seed#[87AA84094394A25D]) [    ] o.a.s.SolrTestCaseJ4 ###Starting testSliceRouting
   [junit4]   2> 796011 INFO  (TEST-TimeRoutedAliasUpdateProcessorTest.testSliceRouting-seed#[87AA84094394A25D]) [    ] o.a.s.c.MiniSolrCloudCluster Starting cluster of 4 servers in /home/jenkins/workspace/Lucene-Solr-master-Linux/solr/build/solr-core/test/J1/temp/solr.update.processor.TimeRoutedAliasUpdateProcessorTest_87AA84094394A25D-001/tempDir-001
   [junit4]   2> 796011 INFO  (TEST-TimeRoutedAliasUpdateProcessorTest.testSliceRouting-seed#[87AA84094394A25D]) [    ] o.a.s.c.ZkTestServer STARTING ZK TEST SERVER
   [junit4]   2> 796045 INFO  (ZkTestServer Run Thread) [    ] o.a.s.c.ZkTestServer client port:0.0.0.0/0.0.0.0:0
   [junit4]   2> 796045 INFO  (ZkTestServer Run Thread) [    ] o.a.s.c.ZkTestServer Starting server
   [junit4]   2> 796073 ERROR (ZkTestServer Run Thread) [    ] o.a.z.s.ZooKeeperServer ZKShutdownHandler is not registered, so ZooKeeper server won't take any action on ERROR or SHUTDOWN server state changes
   [junit4]   2> 796112 INFO  (TEST-TimeRoutedAliasUpdateProcessorTest.testSliceRouting-seed#[87AA84094394A25D]) [    ] o.a.s.c.ZkTestServer start zk server on port:33699
   [junit4]   2> 796112 INFO  (TEST-TimeRoutedAliasUpdateProcessorTest.testSliceRouting-seed#[87AA84094394A25D]) [    ] o.a.s.c.ZkTestServer parse host and port list: 127.0.0.1:33699
   [junit4]   2> 796112 INFO  (TEST-TimeRoutedAliasUpdateProcessorTest.testSliceRouting-seed#[87AA84094394A25D]) [    ] o.a.s.c.ZkTestServer connecting to 127.0.0.1 33699
   [junit4]   2> 796181 INFO  (zkConnectionManagerCallback-3688-thread-1) [    ] o.a.s.c.c.ConnectionManager zkClient has connected
   [junit4]   2> 796249 INFO  (zkConnectionManagerCallback-3690-thread-1) [    ] o.a.s.c.c.ConnectionManager zkClient has connected
   [junit4]   2> 796281 INFO  (zkConnectionManagerCallback-3692-thread-1) [    ] o.a.s.c.c.ConnectionManager zkClient has connected
   [junit4]   2> 796326 WARN  (jetty-launcher-3685-thread-1) [    ] o.e.j.s.AbstractConnector Ignoring deprecated socket close linger time
   [junit4]   2> 796326 INFO  (jetty-launcher-3685-thread-1) [    ] o.a.s.c.s.e.JettySolrRunner Start Jetty (original configured port=0)
   [junit4]   2> 796326 INFO  (jetty-launcher-3685-thread-1) [    ] o.a.s.c.s.e.JettySolrRunner Trying to start Jetty on port 0 try number 1 ...
   [junit4]   2> 796326 INFO  (jetty-launcher-3685-thread-1) [    ] o.e.j.s.Server jetty-9.4.14.v20181114; built: 2018-11-14T21:20:31.478Z; git: c4550056e785fb5665914545889f21dc136ad9e6; jvm 9.0.4+11
   [junit4]   2> 796326 WARN  (jetty-launcher-3685-thread-2) [    ] o.e.j.s.AbstractConnector Ignoring deprecated socket close linger time
   [junit4]   2> 796327 INFO  (jetty-launcher-3685-thread-2) [    ] o.a.s.c.s.e.JettySolrRunner Start Jetty (original configured port=0)
   [junit4]   2> 796327 INFO  (jetty-launcher-3685-thread-2) [    ] o.a.s.c.s.e.JettySolrRunner Trying to start Jetty on port 0 try number 1 ...
   [junit4]   2> 796327 INFO  (jetty-launcher-3685-thread-2) [    ] o.e.j.s.Server jetty-9.4.14.v20181114; built: 2018-11-14T21:20:31.478Z; git: c4550056e785fb5665914545889f21dc136ad9e6; jvm 9.0.4+11
   [junit4]   2> 796360 INFO  (jetty-launcher-3685-thread-1) [    ] o.e.j.s.session DefaultSessionIdManager workerName=node0
   [junit4]   2> 796360 INFO  (jetty-launcher-3685-thread-1) [    ] o.e.j.s.session No SessionScavenger set, using defaults
   [junit4]   2> 796360 INFO  (jetty-launcher-3685-thread-1) [    ] o.e.j.s.session node0 Scavenging every 660000ms
   [junit4]   2> 796365 INFO  (jetty-launcher-3685-thread-1) [    ] o.e.j.s.h.ContextHandler Started o.e.j.s.ServletContextHandler@39a25d65{/solr,null,AVAILABLE}
   [junit4]   2> 796373 WARN  (jetty-launcher-3685-thread-3) [    ] o.e.j.s.AbstractConnector Ignoring deprecated socket close linger time
   [junit4]   2> 796374 INFO  (jetty-launcher-3685-thread-3) [    ] o.a.s.c.s.e.JettySolrRunner Start Jetty (original configured port=0)
   [junit4]   2> 796374 INFO  (jetty-launcher-3685-thread-3) [    ] o.a.s.c.s.e.JettySolrRunner Trying to start Jetty on port 0 try number 1 ...
   [junit4]   2> 796374 INFO  (jetty-launcher-3685-thread-3) [    ] o.e.j.s.Server jetty-9.4.14.v20181114; built: 2018-11-14T21:20:31.478Z; git: c4550056e785fb5665914545889f21dc136ad9e6; jvm 9.0.4+11
   [junit4]   2> 796381 WARN  (jetty-launcher-3685-thread-4) [    ] o.e.j.s.AbstractConnector Ignoring deprecated socket close linger time
   [junit4]   2> 796382 INFO  (jetty-launcher-3685-thread-4) [    ] o.a.s.c.s.e.JettySolrRunner Start Jetty (original configured port=0)
   [junit4]   2> 796382 INFO  (jetty-launcher-3685-thread-4) [    ] o.a.s.c.s.e.JettySolrRunner Trying to start Jetty on port 0 try number 1 ...
   [junit4]   2> 796382 INFO  (jetty-launcher-3685-thread-4) [    ] o.e.j.s.Server jetty-9.4.14.v20181114; built: 2018-11-14T21:20:31.478Z; git: c4550056e785fb5665914545889f21dc136ad9e6; jvm 9.0.4+11
   [junit4]   2> 796465 INFO  (jetty-launcher-3685-thread-4) [    ] o.e.j.s.session DefaultSessionIdManager workerName=node0
   [junit4]   2> 796465 INFO  (jetty-launcher-3685-thread-4) [    ] o.e.j.s.session No SessionScavenger set, using defaults
   [junit4]   2> 796465 INFO  (jetty-launcher-3685-thread-4) [    ] o.e.j.s.session node0 Scavenging every 600000ms
   [junit4]   2> 796470 INFO  (jetty-launcher-3685-thread-3) [    ] o.e.j.s.session DefaultSessionIdManager workerName=node0
   [junit4]   2> 796470 INFO  (jetty-launcher-3685-thread-3) [    ] o.e.j.s.session No SessionScavenger set, using defaults
   [junit4]   2> 796470 INFO  (jetty-launcher-3685-thread-3) [    ] o.e.j.s.session node0 Scavenging every 660000ms
   [junit4]   2> 796473 INFO  (jetty-launcher-3685-thread-3) [    ] o.e.j.s.h.ContextHandler Started o.e.j.s.ServletContextHandler@679bcc77{/solr,null,AVAILABLE}
   [junit4]   2> 796485 INFO  (jetty-launcher-3685-thread-2) [    ] o.e.j.s.session DefaultSessionIdManager workerName=node0
   [junit4]   2> 796485 INFO  (jetty-launcher-3685-thread-2) [    ] o.e.j.s.session No SessionScavenger set, using defaults
   [junit4]   2> 796485 INFO  (jetty-launcher-3685-thread-2) [    ] o.e.j.s.session node0 Scavenging every 600000ms
   [junit4]   2> 796489 INFO  (jetty-launcher-3685-thread-2) [    ] o.e.j.s.h.ContextHandler Started o.e.j.s.ServletContextHandler@43d4d4d0{/solr,null,AVAILABLE}
   [junit4]   2> 796497 INFO  (jetty-launcher-3685-thread-4) [    ] o.e.j.s.h.ContextHandler Started o.e.j.s.ServletContextHandler@76056e6c{/solr,null,AVAILABLE}
   [junit4]   2> 796498 INFO  (jetty-launcher-3685-thread-1) [    ] o.e.j.s.AbstractConnector Started ServerConnector@2aaf959e{HTTP/1.1,[http/1.1]}{127.0.0.1:35533}
   [junit4]   2> 796498 INFO  (jetty-launcher-3685-thread-1) [    ] o.e.j.s.Server Started @796708ms
   [junit4]   2> 796498 INFO  (jetty-launcher-3685-thread-1) [    ] o.a.s.c.s.e.JettySolrRunner Jetty properties: {hostContext=/solr, hostPort=35533}
   [junit4]   2> 796498 ERROR (jetty-launcher-3685-thread-1) [    ] o.a.s.u.StartupLoggingUtils Missing Java Option solr.log.dir. Logging may be missing or incomplete.
   [junit4]   2> 796498 INFO  (jetty-launcher-3685-thread-1) [    ] o.a.s.s.SolrDispatchFilter Using logger factory org.apache.logging.slf4j.Log4jLoggerFactory
   [junit4]   2> 796499 INFO  (jetty-launcher-3685-thread-1) [    ] o.a.s.s.SolrDispatchFilter  ___      _       Welcome to Apache Solr? version 8.0.0
   [junit4]   2> 796499 INFO  (jetty-launcher-3685-thread-1) [    ] o.a.s.s.SolrDispatchFilter / __| ___| |_ _   Starting in cloud mode on port null
   [junit4]   2> 796499 INFO  (jetty-launcher-3685-thread-1) [    ] o.a.s.s.SolrDispatchFilter \__ \/ _ \ | '_|  Install dir: null
   [junit4]   2> 796499 INFO  (jetty-launcher-3685-thread-1) [    ] o.a.s.s.SolrDispatchFilter |___/\___/_|_|    Start time: 2018-12-03T05:19:22.281128Z
   [junit4]   2> 796525 INFO  (jetty-launcher-3685-thread-2) [    ] o.e.j.s.AbstractConnector Started ServerConnector@48657893{HTTP/1.1,[http/1.1]}{127.0.0.1:34565}
   [junit4]   2> 796525 INFO  (zkConnectionManagerCallback-3694-thread-1) [    ] o.a.s.c.c.ConnectionManager zkClient has connected
   [junit4]   2> 796525 INFO  (jetty-launcher-3685-thread-2) [    ] o.e.j.s.Server Started @796735ms
   [junit4]   2> 796525 INFO  (jetty-launcher-3685-thread-3) [    ] o.e.j.s.AbstractConnector Started ServerConnector@374c280c{HTTP/1.1,[http/1.1]}{127.0.0.1:37559}
   [junit4]   2> 796525 INFO  (jetty-launcher-3685-thread-3) [    ] o.e.j.s.Server Started @796735ms
   [junit4]   2> 796525 INFO  (jetty-launcher-3685-thread-3) [    ] o.a.s.c.s.e.JettySolrRunner Jetty properties: {hostContext=/solr, hostPort=37559}
   [junit4]   2> 796526 ERROR (jetty-launcher-3685-thread-3) [    ] o.a.s.u.StartupLoggingUtils Missing Java Option solr.log.dir. Logging may be missing or incomplete.
   [junit4]   2> 796526 INFO  (jetty-launcher-3685-thread-3) [    ] o.a.s.s.SolrDispatchFilter Using logger factory org.apache.logging.slf4j.Log4jLoggerFactory
   [junit4]   2> 796526 INFO  (jetty-launcher-3685-thread-3) [    ] o.a.s.s.SolrDispatchFilter  ___      _       Welcome to Apache Solr? version 8.0.0
   [junit4]   2> 796526 INFO  (jetty-launcher-3685-thread-3) [    ] o.a.s.s.SolrDispatchFilter / __| ___| |_ _   Starting in cloud mode on port null
   [junit4]   2> 796526 INFO  (jetty-launcher-3685-thread-3) [    ] o.a.s.s.SolrDispatchFilter \__ \/ _ \ | '_|  Install dir: null
   [junit4]   2> 796526 INFO  (jetty-launcher-3685-thread-3) [    ] o.a.s.s.SolrDispatchFilter |___/\___/_|_|    Start time: 2018-12-03T05:19:22.308386Z
   [junit4]   2> 796527 INFO  (jetty-launcher-3685-thread-1) [    ] o.a.s.s.SolrDispatchFilter solr.xml found in ZooKeeper. Loading...
   [junit4]   2> 796525 INFO  (jetty-launcher-3685-thread-2) [    ] o.a.s.c.s.e.JettySolrRunner Jetty properties: {hostContext=/solr, hostPort=34565}
   [junit4]   2> 796542 ERROR (jetty-launcher-3685-thread-2) [    ] o.a.s.u.StartupLoggingUtils Missing Java Option solr.log.dir. Logging may be missing or incomplete.
   [junit4]   2> 796542 INFO  (jetty-launcher-3685-thread-2) [    ] o.a.s.s.SolrDispatchFilter Using logger factory org.apache.logging.slf4j.Log4jLoggerFactory
   [junit4]   2> 796542 INFO  (jetty-launcher-3685-thread-2) [    ] o.a.s.s.SolrDispatchFilter  ___      _       Welcome to Apache Solr? version 8.0.0
   [junit4]   2> 796543 INFO  (jetty-launcher-3685-thread-2) [    ] o.a.s.s.SolrDispatchFilter / __| ___| |_ _   Starting in cloud mode on port null
   [junit4]   2> 796543 INFO  (jetty-launcher-3685-thread-2) [    ] o.a.s.s.SolrDispatchFilter \__ \/ _ \ | '_|  Install dir: null
   [junit4]   2> 796543 INFO  (jetty-launcher-3685-thread-2) [    ] o.a.s.s.SolrDispatchFilter |___/\___/_|_|    Start time: 2018-12-03T05:19:22.325066Z
   [junit4]   2> 796573 INFO  (jetty-launcher-3685-thread-4) [    ] o.e.j.s.AbstractConnector Started ServerConnector@4667291d{HTTP/1.1,[http/1.1]}{127.0.0.1:38489}
   [junit4]   2> 796573 INFO  (jetty-launcher-3685-thread-4) [    ] o.e.j.s.Server Started @796783ms
   [junit4]   2> 796573 INFO  (jetty-launcher-3685-thread-4) [    ] o.a.s.c.s.e.JettySolrRunner Jetty properties: {hostContext=/solr, hostPort=38489}
   [junit4]   2> 796574 ERROR (jetty-launcher-3685-thread-4) [    ] o.a.s.u.StartupLoggingUtils Missing Java Option solr.log.dir. Logging may be missing or incomplete.
   [junit4]   2> 796574 INFO  (jetty-launcher-3685-thread-4) [    ] o.a.s.s.SolrDispatchFilter Using logger factory org.apache.logging.slf4j.Log4jLoggerFactory
   [junit4]   2> 796574 INFO  (jetty-launcher-3685-thread-4) [    ] o.a.s.s.SolrDispatchFilter  ___      _       Welcome to Apache Solr? version 8.0.0
   [junit4]   2> 796574 INFO  (jetty-launcher-3685-thread-4) [    ] o.a.s.s.SolrDispatchFilter / __| ___| |_ _   Starting in cloud mode on port null
   [junit4]   2> 796574 INFO  (jetty-launcher-3685-thread-4) [    ] o.a.s.s.SolrDispatchFilter \__ \/ _ \ | '_|  Install dir: null
   [junit4]   2> 796574 INFO  (jetty-launcher-3685-thread-4) [    ] o.a.s.s.SolrDispatchFilter |___/\___/_|_|    Start time: 2018-12-03T05:19:22.356389Z
   [junit4]   2> 796579 INFO  (zkConnectionManagerCallback-3698-thread-1) [    ] o.a.s.c.c.ConnectionManager zkClient has connected
   [junit4]   2> 796579 INFO  (jetty-launcher-3685-thread-2) [    ] o.a.s.s.SolrDispatchFilter solr.xml found in ZooKeeper. Loading...
   [junit4]   2> 796700 INFO  (zkConnectionManagerCallback-3700-thread-1) [    ] o.a.s.c.c.ConnectionManager zkClient has connected
   [junit4]   2> 796700 INFO  (jetty-launcher-3685-thread-4) [    ] o.a.s.s.SolrDispatchFilter solr.xml found in ZooKeeper. Loading...
   [junit4]   2> 796723 INFO  (jetty-launcher-3685-thread-1) [    ] o.a.s.c.ZkContainer Zookeeper client=127.0.0.1:33699/solr
   [junit4]   2> 796769 INFO  (zkConnectionManagerCallback-3696-thread-1) [    ] o.a.s.c.c.ConnectionManager zkClient has connected
   [junit4]   2> 796770 INFO  (jetty-launcher-3685-thread-3) [    ] o.a.s.s.SolrDispatchFilter solr.xml found in ZooKeeper. Loading...
   [junit4]   2> 796777 INFO  (zkConnectionManagerCallback-3704-thread-1) [    ] o.a.s.c.c.ConnectionManager zkClient has connected
   [junit4]   2> 796890 INFO  (zkConnectionManagerCallback-3706-thread-1) [    ] o.a.s.c.c.ConnectionManager zkClient has connected
   [junit4]   2> 797014 INFO  (jetty-launcher-3685-thread-3) [    ] o.a.s.c.ZkContainer Zookeeper client=127.0.0.1:33699/solr
   [junit4]   2> 797037 INFO  (jetty-launcher-3685-thread-1) [n:127.0.0.1:35533_solr    ] o.a.s.c.OverseerElectionContext I am going to be the leader 127.0.0.1:35533_solr
   [junit4]   2> 797051 INFO  (jetty-launcher-3685-thread-1) [n:127.0.0.1:35533_solr    ] o.a.s.c.Overseer Overseer (id=72128289371062280-127.0.0.1:35533_solr-n_0000000000) starting
   [junit4]   2> 797058 INFO  (jetty-launcher-3685-thread-4) [    ] o.a.s.c.ZkContainer Zookeeper client=127.0.0.1:33699/solr
   [junit4]   2> 797142 INFO  (jetty-launcher-3685-thread-2) [    ] o.a.s.c.ZkContainer Zookeeper client=127.0.0.1:33699/solr
   [junit4]   2> 797197 INFO  (zkConnectionManagerCallback-3713-thread-1) [    ] o.a.s.c.c.ConnectionManager zkClient has connected
   [junit4]   2> 797206 INFO  (zkConnectionManagerCallback-3725-thread-1) [    ] o.a.s.c.c.ConnectionManager zkClient has connected
   [junit4]   2> 797221 INFO  (zkConnectionManagerCallback-3717-thread-1) [    ] o.a.s.c.c.ConnectionManager zkClient has connected
   [junit4]   2> 797227 INFO  (zkConnectionManagerCallback-3727-thread-1) [    ] o.a.s.c.c.ConnectionManager zkClient has connected
   [junit4]   2> 797241 INFO  (zkConnectionManagerCallback-3729-thread-1) [    ] o.a.s.c.c.ConnectionManager zkClient has connected
   [junit4]   2> 797265 INFO  (zkConnectionManagerCallback-3722-thread-1) [    ] o.a.s.c.c.ConnectionManager zkClient has connected
   [junit4]   2> 797278 INFO  (jetty-launcher-3685-thread-1) [n:127.0.0.1:35533_solr    ] o.a.s.c.s.i.ZkClientClusterStateProvider Cluster at 127.0.0.1:33699/solr ready
   [junit4]   2> 797297 INFO  (zkConnectionManagerCallback-3731-thread-1) [    ] o.a.s.c.c.ConnectionManager zkClient has connected
   [junit4]   2> 797297 INFO  (OverseerStateUpdate-72128289371062280-127.0.0.1:35533_solr-n_0000000000) [n:127.0.0.1:35533_solr    ] o.a.s.c.Overseer Starting to work on the main queue : 127.0.0.1:35533_solr
   [junit4]   2> 797302 INFO  (jetty-launcher-3685-thread-3) [n:127.0.0.1:37559_solr    ] o.a.s.c.ZkController Register node as live in ZooKeeper:/live_nodes/127.0.0.1:37559_solr
   [junit4]   2> 797318 INFO  (jetty-launcher-3685-thread-1) [n:127.0.0.1:35533_solr    ] o.a.s.c.ZkController Publish node=127.0.0.1:35533_solr as DOWN
   [junit4]   2> 797319 INFO  (jetty-launcher-3685-thread-1) [n:127.0.0.1:35533_solr    ] o.a.s.c.TransientSolrCoreCacheDefault Allocating transient cache for 2147483647 transient cores
   [junit4]   2> 797319 INFO  (jetty-launcher-3685-thread-1) [n:127.0.0.1:35533_solr    ] o.a.s.c.ZkController Register node as live in ZooKeeper:/live_nodes/127.0.0.1:35533_solr
   [junit4]   2> 797334 INFO  (OverseerStateUpdate-72128289371062280-127.0.0.1:35533_solr-n_0000000000) [n:127.0.0.1:35533_solr    ] o.a.s.c.c.ZkStateReader Updated live nodes from ZooKeeper... (0) -> (1)
   [junit4]   2> 797335 INFO  (jetty-launcher-3685-thread-2) [n:127.0.0.1:34565_solr    ] o.a.s.c.c.ZkStateReader Updated live nodes from ZooKeeper... (0) -> (2)
   [junit4]   2> 797337 INFO  (jetty-launcher-3685-thread-2) [n:127.0.0.1:34565_solr    ] o.a.s.c.ZkController Publish node=127.0.0.1:34565_solr as DOWN
   [junit4]   2> 797338 INFO  (jetty-launcher-3685-thread-2) [n:127.0.0.1:34565_solr    ] o.a.s.c.TransientSolrCoreCacheDefault Allocating transient cache for 2147483647 transient cores
   [junit4]   2> 797338 INFO  (jetty-launcher-3685-thread-2) [n:127.0.0.1:34565_solr    ] o.a.s.c.ZkController Register node as live in ZooKeeper:/live_nodes/127.0.0.1:34565_solr
   [junit4]   2> 797340 INFO  (jetty-launcher-3685-thread-4) [n:127.0.0.1:38489_solr    ] o.a.s.c.c.ZkStateReader Updated live nodes from ZooKeeper... (0) -> (3)
   [junit4]   2> 797342 INFO  (jetty-launcher-3685-thread-4) [n:127.0.0.1:38489_solr    ] o.a.s.c.ZkController Publish node=127.0.0.1:38489_solr as DOWN
   [junit4]   2> 797342 INFO  (jetty-launcher-3685-thread-4) [n:127.0.0.1:38489_solr    ] o.a.s.c.TransientSolrCoreCacheDefault Allocating transient cache for 2147483647 transient cores
   [junit4]   2> 797343 INFO  (jetty-launcher-3685-thread-4) [n:127.0.0.1:38489_solr    ] o.a.s.c.ZkController Register node as live in ZooKeeper:/live_nodes/127.0.0.1:38489_solr
   [junit4]   2> 797364 INFO  (zkCallback-3726-thread-1) [    ] o.a.s.c.c.ZkStateReader Updated live nodes from ZooKeeper... (0) -> (4)
   [junit4]   2> 797373 INFO  (zkCallback-3705-thread-1) [    ] o.a.s.c.c.ZkStateReader Updated live nodes from ZooKeeper... (1) -> (4)
   [junit4]   2> 797385 INFO  (zkCallback-3730-thread-1) [    ] o.a.s.c.c.ZkStateReader Updated live nodes from ZooKeeper... (3) -> (4)
   [junit4]   2> 797401 INFO  (zkConnectionManagerCallback-3740-thread-1) [    ] o.a.s.c.c.ConnectionManager zkClient has connected
   [junit4]   2> 797414 INFO  (jetty-launcher-3685-thread-3) [n:127.0.0.1:37559_solr    ] o.a.s.c.c.ZkStateReader Updated live nodes from ZooKeeper... (0) -> (4)
   [junit4]   2> 797414 INFO  (jetty-launcher-3685-thread-3) [n:127.0.0.1:37559_solr    ] o.a.s.c.s.i.ZkClientClusterStateProvider Cluster at 127.0.0.1:33699/solr ready
   [junit4]   2> 797417 INFO  (jetty-launcher-3685-thread-1) [n:127.0.0.1:35533_solr    ] o.a.s.h.a.MetricsHistoryHandler No .system collection, keeping metrics history in memory.
   [junit4]   2> 797441 INFO  (jetty-launcher-3685-thread-1) [n:127.0.0.1:35533_solr    ] o.a.s.m.r.SolrJmxReporter JMX monitoring for 'solr_35533.solr.node' (registry 'solr.node') enabled at server: com.sun.jmx.mbeanserver.JmxMBeanServer@70ed1e0a
   [junit4]   2> 797442 INFO  (OverseerAutoScalingTriggerThread-72128289371062280-127.0.0.1:35533_solr-n_0000000000) [    ] o.a.s.c.a.NodeLostTrigger NodeLostTrigger .auto_add_replicas - Initial livenodes: []
   [junit4]   2> 797450 INFO  (ScheduledTrigger-3909-thread-2) [    ] o.a.s.c.a.NodeLostTrigger Running NodeLostTrigger: .auto_add_replicas with currently live nodes: 0 and last live nodes: 0
   [junit4]   2> 797450 INFO  (jetty-launcher-3685-thread-1) [n:127.0.0.1:35533_solr    ] o.a.s.m.r.SolrJmxReporter JMX monitoring for 'solr_35533.solr.jvm' (registry 'solr.jvm') enabled at server: com.sun.jmx.mbeanserver.JmxMBeanServer@70ed1e0a
   [junit4]   2> 797450 INFO  (jetty-launcher-3685-thread-1) [n:127.0.0.1:35533_solr    ] o.a.s.m.r.SolrJmxReporter JMX monitoring for 'solr_35533.solr.jetty' (registry 'solr.jetty') enabled at server: com.sun.jmx.mbeanserver.JmxMBeanServer@70ed1e0a
   [junit4]   2> 797451 INFO  (jetty-launcher-3685-thread-1) [n:127.0.0.1:35533_solr    ] o.a.s.c.CorePropertiesLocator Found 0 core definitions underneath /home/jenkins/workspace/Lucene-Solr-master-Linux/solr/build/solr-core/test/J1/temp/solr.update.processor.TimeRoutedAliasUpdateProcessorTest_87AA84094394A25D-001/tempDir-001/node1/.
   [junit4]   2> 797466 INFO  (zkCallback-3721-thread-1) [    ] o.a.s.c.c.ZkStateReader Updated live nodes from ZooKeeper... (0) -> (4)
   [junit4]   2> 797493 INFO  (zkConnectionManagerCallback-3754-thread-1) [    ] o.a.s.c.c.ConnectionManager zkClient has connected
   [junit4]   2> 797494 INFO  (jetty-launcher-3685-thread-2) [n:127.0.0.1:34565_solr    ] o.a.s.c.c.ZkStateReader Updated live nodes from ZooKeeper... (0) -> (4)
   [junit4]   2> 797494 INFO  (jetty-launcher-3685-thread-2) [n:127.0.0.1:34565_solr    ] o.a.s.c.s.i.ZkClientClusterStateProvider Cluster at 127.0.0.1:33699/solr ready
   [junit4]   2> 797517 INFO  (zkCallback-3728-thread-1) [    ] o.a.s.c.c.ZkStateReader Updated live nodes from ZooKeeper... (2) -> (4)
   [junit4]   2> 797520 INFO  (jetty-launcher-3685-thread-3) [n:127.0.0.1:37559_solr    ] o.a.s.h.a.MetricsHistoryHandler No .system collection, keeping metrics history in memory.
   [junit4]   2> 797552 INFO  (zkConnectionManagerCallback-3748-thread-1) [    ] o.a.s.c.c.ConnectionManager zkClient has connected
   [junit4]   2> 797552 INFO  (jetty-launcher-3685-thread-2) [n:127.0.0.1:34565_solr    ] o.a.s.h.a.MetricsHistoryHandler No .system collection, keeping metrics history in memory.
   [junit4]   2> 797567 INFO  (jetty-launcher-3685-thread-4) [n:127.0.0.1:38489_solr    ] o.a.s.c.c.ZkStateReader Updated live nodes from ZooKeeper... (0) -> (4)
   [junit4]   2> 797568 INFO  (jetty-launcher-3685-thread-4) [n:127.0.0.1:38489_solr    ] o.a.s.c.s.i.ZkClientClusterStateProvider Cluster at 127.0.0.1:33699/solr ready
   [junit4]   2> 797574 INFO  (jetty-launcher-3685-thread-3) [n:127.0.0.1:37559_solr    ] o.a.s.m.r.SolrJmxReporter JMX monitoring for 'solr_37559.solr.node' (registry 'solr.node') enabled at server: com.sun.jmx.mbeanserver.JmxMBeanServer@70ed1e0a
   [junit4]   2> 797580 INFO  (jetty-launcher-3685-thread-2) [n:127.0.0.1:34565_solr    ] o.a.s.m.r.SolrJmxReporter JMX monitoring for 'solr_34565.solr.node' (registry 'solr.node') enabled at server: com.sun.jmx.mbeanserver.JmxMBeanServer@70ed1e0a
   [junit4]   2> 797581 INFO  (jetty-launcher-3685-thread-4) [n:127.0.0.1:38489_solr    ] o.a.s.h.a.MetricsHistoryHandler No .system collection, keeping metrics history in memory.
   [junit4]   2> 797599 INFO  (jetty-launcher-3685-thread-3) [n:127.0.0.1:37559_solr    ] o.a.s.m.r.SolrJmxReporter JMX monitoring for 'solr_37559.solr.jvm' (registry 'solr.jvm') enabled at server: com.sun.jmx.mbeanserver.JmxMBeanServer@70ed1e0a
   [junit4]   2> 797599 INFO  (jetty-launcher-3685-thread-3) [n:127.0.0.1:37559_solr    ] o.a.s.m.r.SolrJmxReporter JMX monitoring for 'solr_37559.solr.jetty' (registry 'solr.jetty') enabled at server: com.sun.jmx.mbeanserver.JmxMBeanServer@70ed1e0a
   [junit4]   2> 797599 INFO  (jetty-launcher-3685-thread-3) [n:127.0.0.1:37559_solr    ] o.a.s.c.CorePropertiesLocator Found 0 core definitions underneath /home/jenkins/workspace/Lucene-Solr-master-Linux/solr/build/solr-core/test/J1/temp/solr.update.processor.TimeRoutedAliasUpdateProcessorTest_87AA84094394A25D-001/tempDir-001/node3/.
   [junit4]   2> 797602 INFO  (jetty-launcher-3685-thread-2) [n:127.0.0.1:34565_solr    ] o.a.s.m.r.SolrJmxReporter JMX monitoring for 'solr_34565.solr.jvm' (registry 'solr.jvm') enabled at server: com.sun.jmx.mbeanserver.JmxMBeanServer@70ed1e0a
   [junit4]   2> 797602 INFO  (jetty-launcher-3685-thread-2) [n:127.0.0.1:34565_solr    ] o.a.s.m.r.SolrJmxReporter JMX monitoring for 'solr_34565.solr.jetty' (registry 'solr.jetty') enabled at server: com.sun.jmx.mbeanserver.JmxMBeanServer@70ed1e0a
   [junit4]   2> 797603 INFO  (jetty-launcher-3685-thread-2) [n:127.0.0.1:34565_solr    ] o.a.s.c.CorePropertiesLocator Found 0 core definitions underneath /home/jenkins/workspace/Lucene-Solr-master-Linux/solr/build/solr-core/test/J1/temp/solr.update.processor.TimeRoutedAliasUpdateProcessorTest_87AA84094394A25D-001/tempDir-001/node2/.
   [junit4]   2> 797603 INFO  (jetty-launcher-3685-thread-4) [n:127.0.0.1:38489_solr    ] o.a.s.m.r.SolrJmxReporter JMX monitoring for 'solr_38489.solr.node' (registry 'solr.node') enabled at server: com.sun.jmx.mbeanserver.JmxMBeanServer@70ed1e0a
   [junit4]   2> 797611 INFO  (jetty-launcher-3685-thread-4) [n:127.0.0.1:38489_solr    ] o.a.s.m.r.SolrJmxReporter JMX monitoring for 'solr_38489.solr.jvm' (registry 'solr.jvm') enabled at server: com.sun.jmx.mbeanserver.JmxMBeanServer@70ed1e0a
   [junit4]   2> 797611 INFO  (jetty-launcher-3685-thread-4) [n:127.0.0.1:38489_solr    ] o.a.s.m.r.SolrJmxReporter JMX monitoring for 'solr_38489.solr.jetty' (registry 'solr.jetty') enabled at server: com.sun.jmx.mbeanserver.JmxMBeanServer@70ed1e0a
   [junit4]   2> 797612 INFO  (jetty-launcher-3685-thread-4) [n:127.0.0.1:38489_solr    ] o.a.s.c.CorePropertiesLocator Found 0 core definitions underneath /home/jenkins/workspace/Lucene-Solr-master-Linux/solr/build/solr-core/test/J1/temp/solr.update.processor.TimeRoutedAliasUpdateProcessorTest_87AA84094394A25D-001/tempDir-001/node4/.
   [junit4]   2> 797757 INFO  (zkConnectionManagerCallback-3761-thread-1) [    ] o.a.s.c.c.ConnectionManager zkClient has connected
   [junit4]   2> 797821 INFO  (TEST-TimeRoutedAliasUpdateProcessorTest.testSliceRouting-seed#[87AA84094394A25D]) [    ] o.a.s.c.c.ZkStateReader Updated live nodes from ZooKeeper... (0) -> (4)
   [junit4]   2> 797846 INFO  (TEST-TimeRoutedAliasUpdateProcessorTest.testSliceRouting-seed#[87AA84094394A25D]) [    ] o.a.s.c.s.i.ZkClientClusterStateProvider Cluster at 127.0.0.1:33699/solr ready
   [junit4]   2> 797849 INFO  (TEST-TimeRoutedAliasUpdateProcessorTest.testSliceRouting-seed#[87AA84094394A25D]) [    ] o.a.s.u.p.TimeRoutedAliasUpdateProcessorTest SolrClient: org.apache.solr.client.solrj.impl.CloudSolrClient@a24f821
   [junit4]   2> 797849 INFO  (TEST-TimeRoutedAliasUpdateProcessorTest.testSliceRouting-seed#[87AA84094394A25D]) [    ] o.a.s.u.p.TimeRoutedAliasUpdateProcessorTest ClusterStateProvider 127.0.0.1:33699/solr
   [junit4]   2> 797881 INFO  (zkConnectionManagerCallback-3766-thread-1) [    ] o.a.s.c.c.ConnectionManager zkClient has connected
   [junit4]   2> 797901 INFO  (TEST-TimeRoutedAliasUpdateProcessorTest.testSliceRouting-seed#[87AA84094394A25D]) [    ] o.a.s.c.c.ZkStateReader Updated live nodes from ZooKeeper... (0) -> (4)
   [junit4]   2> 797917 INFO  (TEST-TimeRoutedAliasUpdateProcessorTest.testSliceRouting-seed#[87AA84094394A25D]) [    ] o.a.s.c.s.i.ZkClientClusterStateProvider Cluster at 127.0.0.1:33699/solr ready
   [junit4]   2> 797931 INFO  (qtp424840302-12162) [n:127.0.0.1:37559_solr    ] o.a.s.h.a.ConfigSetsHandler Invoked ConfigSet Action :create with params baseConfigSet=_default&name=testSliceRouting&action=CREATE&wt=javabin&version=2 
   [junit4]   2> 797957 INFO  (OverseerThreadFactory-3911-thread-1-processing-n:127.0.0.1:35533_solr) [n:127.0.0.1:35533_solr    ] o.a.s.c.OverseerConfigSetMessageHandler OverseerConfigSetMessageHandler.processMessage : create , {
   [junit4]   2>   "name":"testSliceRouting",
   [junit4]   2>   "baseConfigSet":"_default",
   [junit4]   2>   "immutable":"false",
   [junit4]   2>   "operation":"configsets:create"}
   [junit4]   2> 797989 INFO  (OverseerThreadFactory-3911-thread-1-processing-n:127.0.0.1:35533_solr) [n:127.0.0.1:35533_solr    ] o.a.s.c.c.ZkConfigManager Copying zk node /configs/_default/protwords.txt to /configs/testSliceRouting/protwords.txt
   [junit4]   2> 798071 INFO  (OverseerThreadFactory-3911-thread-1-processing-n:127.0.0.1:35533_solr) [n:127.0.0.1:35533_solr    ] o.a.s.c.c.ZkConfigManager Copying zk node /configs/_default/managed-schema to /configs/testSliceRouting/managed-schema
   [junit4]   2> 798089 INFO  (OverseerThreadFactory-3911-thread-1-processing-n:127.0.0.1:35533_solr) [n:127.0.0.1:35533_solr    ] o.a.s.c.c.ZkConfigManager Copying zk node /configs/_default/solrconfig.xml to /configs/testSliceRouting/solrconfig.xml
   [junit4]   2> 798109 INFO  (OverseerThreadFactory-3911-thread-1-processing-n:127.0.0.1:35533_solr) [n:127.0.0.1:35533_solr    ] o.a.s.c.c.ZkConfigManager Copying zk node /configs/_default/synonyms.txt to /configs/testSliceRouting/synonyms.txt
   [junit4]   2> 798118 INFO  (OverseerThreadFactory-3911-thread-1-processing-n:127.0.0.1:35533_solr) [n:127.0.0.1:35533_solr    ] o.a.s.c.c.ZkConfigManager Copying zk node /configs/_default/stopwords.txt to /configs/testSliceRouting/stopwords.txt
   [junit4]   2> 798118 INFO  (OverseerThreadFactory-3911-thread-1-processing-n:127.0.0.1:35533_solr) [n:127.0.0.1:35533_solr    ] o.a.s.c.c.ZkConfigManager Copying zk node /configs/_default/lang/contractions_it.txt to /configs/testSliceRouting/lang/contractions_it.txt
   [junit4]   2> 798119 INFO  (OverseerThreadFactory-3911-thread-1-processing-n:127.0.0.1:35533_solr) [n:127.0.0.1:35533_solr    ] o.a.s.c.c.ZkConfigManager Copying zk node /configs/_default/lang/stemdict_nl.txt to /configs/testSliceRouting/lang/stemdict_nl.txt
   [junit4]   2> 798120 INFO  (OverseerThreadFactory-3911-thread-1-processing-n:127.0.0.1:35533_solr) [n:127.0.0.1:35533_solr    ] o.a.s.c.c.ZkConfigManager Copying zk node /configs/_default/lang/stopwords_hy.txt to /configs/testSliceRouting/lang/stopwords_hy.txt
   [junit4]   2> 798121 INFO  (OverseerThreadFactory-3911-thread-1-processing-n:127.0.0.1:35533_solr) [n:127.0.0.1:35533_solr    ] o.a.s.c.c.ZkConfigManager Copying zk node /configs/_default/lang/stopwords_no.txt to /configs/testSliceRouting/lang/stopwords_no.txt
   [junit4]   2> 798121 INFO  (OverseerThreadFactory-3911-thread-1-processing-n:127.0.0.1:35533_solr) [n:127.0.0.1:35533_solr    ] o.a.s.c.c.ZkConfigManager Copying zk node /configs/_default/lang/contractions_ca.txt to /configs/testSliceRouting/lang/contractions_ca.txt
   [junit4]   2> 798122 INFO  (OverseerThreadFactory-3911-thread-1-processing-n:127.0.0.1:35533_solr) [n:127.0.0.1:35533_solr    ] o.a.s.c.c.ZkConfigManager Copying zk node /configs/_default/lang/stopwords_id.txt to /configs/testSliceRouting/lang/stopwords_id.txt
   [junit4]   2> 798123 INFO  (OverseerThreadFactory-3911-thread-1-processing-n:127.0.0.1:35533_solr) [n:127.0.0.1:35533_solr    ] o.a.s.c.c.ZkConfigManager Copying zk node /configs/_default/lang/stopwords_ga.txt to /configs/testSliceRouting/lang/stopwords_ga.txt
   [junit4]   2> 798123 INFO  (OverseerThreadFactory-3911-thread-1-processing-n:127.0.0.1:35533_solr) [n:127.0.0.1:35533_solr    ] o.a.s.c.c.ZkConfigManager Copying zk node /configs/_default/lang/stopwords_hi.txt to /configs/testSliceRouting/lang/stopwords_hi.txt
   [junit4]   2> 798124 INFO  (OverseerThreadFactory-3911-thread-1-processing-n:127.0.0.1:35533_solr) [n:127.0.0.1:35533_solr    ] o.a.s.c.c.ZkConfigManager Copying zk node /configs/_default/lang/stopwords_da.txt to /configs/testSliceRouting/lang/stopwords_da.txt
   [junit4]   2> 798124 INFO  (OverseerThreadFactory-3911-thread-1-processing-n:127.0.0.1:35533_solr) [n:127.0.0.1:35533_solr    ] o.a.s.c.c.ZkConfigManager Copying zk node /configs/_default/lang/stopwords_ja.txt to /configs/testSliceRouting/lang/stopwords_ja.txt
   [junit4]   2> 798125 INFO  (OverseerThreadFactory-3911-thread-1-processing-n:127.0.0.1:35533_solr) [n:127.0.0.1:35533_solr    ] o.a.s.c.c.ZkConfigManager Copying zk node /configs/_default/lang/stopwords_pt.txt to /configs/testSliceRouting/lang/stopwords_pt.txt
   [junit4]   2> 798126 INFO  (OverseerThreadFactory-3911-thread-1-processing-n:127.0.0.1:35533_solr) [n:127.0.0.1:35533_solr    ] o.a.s.c.c.ZkConfigManager Copying zk node /configs/_default/lang/stopwords_hu.txt to /configs/testSliceRouting/lang/stopwords_hu.txt
   [junit4]   2> 798127 INFO  (OverseerThreadFactory-3911-thread-1-processing-n:127.0.0.1:35533_solr) [n:127.0.0.1:35533_solr    ] o.a.s.c.c.ZkConfigManager Copying zk node /configs/_default/lang/stopwords_el.txt to /configs/testSliceRouting/lang/stopwords_el.txt
   [junit4]   2> 798128 INFO  (OverseerThreadFactory-3911-thread-1-processing-n:127.0.0.1:35533_solr) [n:127.0.0.1:35533_solr    ] o.a.s.c.c.ZkConfigManager Copying zk node /configs/_default/lang/stopwords_ru.txt to /configs/testSliceRouting/lang/stopwords_ru.txt
   [junit4]   2> 798128 INFO  (OverseerThreadFactory-3911-thread-1-processing-n:127.0.0.1:35533_solr) [n:127.0.0.1:35533_solr    ] o.a.s.c.c.ZkConfigManager Copying zk node /configs/_default/lang/stopwords_tr.txt to /configs/testSliceRouting/lang/stopwords_tr.txt
   [junit4]   2> 798129 INFO  (OverseerThreadFactory-3911-thread-1-processing-n:127.0.0.1:35533_solr) [n:127.0.0.1:35533_solr    ] o.a.s.c.c.ZkConfigManager Copying zk node /configs/_default/lang/stopwords_ar.txt to /configs/testSliceRouting/lang/stopwords_ar.txt
   [junit4]   2> 798130 INFO  (OverseerThreadFactory-3911-thread-1-processing-n:127.0.0.1:35533_solr) [n:127.0.0.1:35533_solr    ] o.a.s.c.c.ZkConfigManager Copying zk node /configs/_default/lang/userdict_ja.txt to /configs/testSliceRouting/lang/userdict_ja.txt
   [junit4]   2> 798131 INFO  (OverseerThreadFactory-3911-thread-1-processing-n:127.0.0.1:35533_solr) [n:127.0.0.1:35533_solr    ] o.a.s.c.c.ZkConfigManager Copying zk node /configs/_default/lang/stopwords_eu.txt to /configs/testSliceRouting/lang/stopwords_eu.txt
   [junit4]   2> 798131 INFO  (OverseerThreadFactory-3911-thread-1-processing-n:127.0.0.1:35533_solr) [n:127.0.0.1:35533_solr    ] o.a.s.c.c.ZkConfigManager Copying zk node /configs/_default/lang/stopwords_it.txt to /configs/testSliceRouting/lang/stopwords_it.txt
   [junit4]   2> 798132 INFO  (OverseerThreadFactory-3911-thread-1-processing-n:127.0.0.1:35533_solr) [n:127.0.0.1:35533_solr    ] o.a.s.c.c.ZkConfigManager Copying zk node /configs/_default/lang/stopwords_cz.txt to /configs/testSliceRouting/lang/stopwords_cz.txt
   [junit4]   2> 798133 INFO  (OverseerThreadFactory-3911-thread-1-processing-n:127.0.0.1:35533_solr) [n:127.0.0.1:35533_solr    ] o.a.s.c.c.ZkConfigManager Copying zk node /configs/_default/lang/stoptags_ja.txt to /configs/testSliceRouting/lang/stoptags_ja.txt
   [junit4]   2> 798134 INFO  (OverseerThreadFactory-3911-thread-1-processing-n:127.0.0.1:35533_solr) [n:127.0.0.1:35533_solr    ] o.a.s.c.c.ZkConfigManager Copying zk node /configs/_default/lang/contractions_fr.txt to /configs/testSliceRouting/lang/contractions_fr.txt
   [junit4]   2> 798134 INFO  (OverseerThreadFactory-3911-thread-1-processing-n:127.0.0.1:35533_solr) [n:127.0.0.1:35533_solr    ] o.a.s.c.c.ZkConfigManager Copying zk node /configs/_default/lang/stopwords_de.txt to /configs/testSliceRouting/lang/stopwords_de.txt
   [junit4]   2> 798135 INFO  (OverseerThreadFactory-3911-thread-1-processing-n:127.0.0.1:35533_solr) [n:127.0.0.1:35533_solr    ] o.a.s.c.c.ZkConfigManager Copying zk node /configs/_default/lang/stopwords_fa.txt to /configs/testSliceRouting/lang/stopwords_fa.txt
   [junit4]   2> 798136 INFO  (OverseerThreadFactory-3911-thread-1-processing-n:127.0.0.1:35533_solr) [n:127.0.0.1:35533_solr    ] o.a.s.c.c.ZkConfigManager Copying zk node /configs/_default/lang/contractions_ga.txt to /configs/testSliceRouting/lang/contractions_ga.txt
   [junit4]   2> 798136 INFO  (OverseerThreadFactory-3911-thread-1-processing-n:127.0.0.1:35533_solr) [n:127.0.0.1:35533_solr    ] o.a.s.c.c.ZkConfigManager Copying zk node /configs/_default/lang/stopwords_ca.txt to /configs/testSliceRouting/lang/stopwords_ca.txt
   [junit4]   2> 798137 INFO  (OverseerThreadFactory-3911-thread-1-processing-n:127.0.0.1:35533_solr) [n:127.0.0.1:35533_solr    ] o.a.s.c.c.ZkConfigManager Copying zk node /configs/_default/lang/stopwords_nl.txt to /configs/testSliceRouting/lang/stopwords_nl.txt
   [junit4]   2> 798137 INFO  (OverseerThreadFactory-3911-thread-1-processing-n:127.0.0.1:35533_solr) [n:127.0.0.1:35533_solr    ] o.a.s.c.c.ZkConfigManager Copying zk node /configs/_default/lang/stopwords_bg.txt to /configs/testSliceRouting/lang/stopwords_bg.txt
   [junit4]   2> 798138 INFO  (OverseerThreadFactory-3911-thread-1-processing-n:127.0.0.1:35533_solr) [n:127.0.0.1:35533_solr    ] o.a.s.c.c.ZkConfigManager Copying zk node /configs/_default/lang/stopwords_lv.txt to /configs/testSliceRouting/lang/stopwords_lv.txt
   [junit4]   2> 798139 INFO  (OverseerThreadFactory-3911-thread-1-processing-n:127.0.0.1:35533_solr) [n:127.0.0.1:35533_solr    ] o.a.s.c.c.ZkConfigManager Copying zk node /configs/_default/lang/stopwords_en.txt to /configs/testSliceRouting/lang/stopwords_en.txt
   [junit4]   2> 798139 INFO  (OverseerThreadFactory-3911-thread-1-processing-n:127.0.0.1:35533_solr) [n:127.0.0.1:35533_solr    ] o.a.s.c.c.ZkConfigManager Copying zk node /configs/_default/lang/stopwords_es.txt to /configs/testSliceRouting/lang/stopwords_es.txt
   [junit4]   2> 798140 INFO  (OverseerThreadFactory-3911-thread-1-processing-n:127.0.0.1:35533_solr) [n:127.0.0.1:35533_solr    ] o.a.s.c.c.ZkConfigManager Copying zk node /configs/_default/lang/stopwords_th.txt to /configs/testSliceRouting/lang/stopwords_th.txt
   [junit4]   2> 798141 INFO  (OverseerThreadFactory-3911-thread-1-processing-n:127.0.0.1:35533_solr) [n:127.0.0.1:35533_solr    ] o.a.s.c.c.ZkConfigManager Copying zk node /configs/_default/lang/stopwords_ro.txt to /configs/testSliceRouting/lang/stopwords_ro.txt
   [junit4]   2> 798142 INFO  (OverseerThreadFactory-3911-thread-1-processing-n:127.0.0.1:35533_solr) [n:127.0.0.1:35533_solr    ] o.a.s.c.c.ZkConfigManager Copying zk node /configs/_default/lang/stopwords_fr.txt to /configs/testSliceRouting/lang/stopwords_fr.txt
   [junit4]   2> 798142 INFO  (OverseerThreadFactory-3911-thread-1-processing-n:127.0.0.1:35533_solr) [n:127.0.0.1:35533_solr    ] o.a.s.c.c.ZkConfigManager Copying zk node /configs/_default/lang/stopwords_sv.txt to /configs/testSliceRouting/lang/stopwords_sv.txt
   [junit4]   2> 798143 INFO  (OverseerThreadFactory-3911-thread-1-processing-n:127.0.0.1:35533_solr) [n:127.0.0.1:35533_solr    ] o.a.s.c.c.ZkConfigManager Copying zk node /configs/_default/lang/stopwords_fi.txt to /configs/testSliceRouting/lang/stopwords_fi.txt
   [junit4]   2> 798144 INFO  (OverseerThreadFactory-3911-thread-1-processing-n:127.0.0.1:35533_solr) [n:127.0.0.1:35533_solr    ] o.a.s.c.c.ZkConfigManager Copying zk node /configs/_default/lang/hyphenations_ga.txt to /configs/testSliceRouting/lang/hyphenations_ga.txt
   [junit4]   2> 798144 INFO  (OverseerThreadFactory-3911-thread-1-processing-n:127.0.0.1:35533_solr) [n:127.0.0.1:35533_solr    ] o.a.s.c.c.ZkConfigManager Copying zk node /configs/_default/lang/stopwords_gl.txt to /configs/testSliceRouting/lang/stopwords_gl.txt
   [junit4]   2> 798149 INFO  (OverseerThreadFactory-3911-thread-1-processing-n:127.0.0.1:35533_solr) [n:127.0.0.1:35533_solr    ] o.a.s.c.c.ZkConfigManager Copying zk node /configs/_default/params.json to /configs/testSliceRouting/params.json
   [junit4]   2> 798158 INFO  (qtp424840302-12162) [n:127.0.0.1:37559_solr    ] o.a.s.s.HttpSolrCall [admin] webapp=null path=/admin/configs params={baseConfigSet=_default&name=testSliceRouting&action=CREATE&wt=javabin&version=2} status=0 QTime=227
   [junit4]   2> 798160 INFO  (qtp424840302-12163) [n:127.0.0.1:37559_solr    ] o.a.s.h.a.CollectionsHandler Invoked Collection Action :create with params collection.configName=testSliceRouting&name=testSliceRouting&nrtReplicas=1&action=CREATE&numShards=1&wt=javabin&version=2 and sendToOCPQueue=true
   [junit4]   2> 798225 INFO  (OverseerThreadFactory-3911-thread-2-processing-n:127.0.0.1:35533_solr) [n:127.0.0.1:35533_solr    ] o.a.s.c.a.c.CreateCollectionCmd Create collection testSliceRouting
   [junit4]   2> 798228 INFO  (OverseerCollectionConfigSetProcessor-72128289371062280-127.0.0.1:35533_solr-n_0000000000) [n:127.0.0.1:35533_solr    ] o.a.s.c.OverseerTaskQueue Response ZK path: /overseer/collection-queue-work/qnr-0000000000 doesn't exist.  Requestor may have disconnected from ZooKeeper
   [junit4]   2> 798434 INFO  (qtp424840302-12162) [n:127.0.0.1:37559_solr    ] o.a.s.s.HttpSolrCall [admin] webapp=null path=/admin/metrics params={prefix=CONTAINER.fs.usableSpace,CONTAINER.fs.totalSpace,CORE.coreName&wt=javabin&version=2&group=solr.node,solr.core} status=0 QTime=0
   [junit4]   2> 798435 INFO  (qtp424840302-12155) [n:127.0.0.1:37559_solr    ] o.a.s.s.HttpSolrCall [admin] webapp=null path=/admin/metrics params={prefix=CONTAINER.fs.usableSpace,CONTAINER.fs.totalSpace,CORE.coreName&wt=javabin&version=2&group=solr.node,solr.core} status=0 QTime=0
   [junit4]   2> 798439 INFO  (qtp424840302-12162) [n:127.0.0.1:37559_solr    ] o.a.s.s.HttpSolrCall [admin] webapp=null path=/admin/metrics params={prefix=CONTAINER.fs.usableSpace,CONTAINER.fs.totalSpace,CORE.coreName&wt=javabin&version=2&group=solr.node,solr.core} status=0 QTime=0
   [junit4]   2> 798443 INFO  (qtp424840302-12155) [n:127.0.0.1:37559_solr    ] o.a.s.s.HttpSolrCall [admin] webapp=null path=/admin/metrics params={prefix=CONTAINER.fs.usableSpace,CONTAINER.fs.totalSpace,CORE.coreName&wt=javabin&version=2&group=solr.node,solr.core} status=0 QTime=0
   [junit4]   2> 798447 INFO  (qtp424840302-12162) [n:127.0.0.1:37559_solr    ] o.a.s.s.HttpSolrCall [admin] webapp=null path=/admin/metrics params={prefix=CONTAINER.fs.usableSpace,CONTAINER.fs.totalSpace,CORE.coreName&wt=javabin&version=2&group=solr.node,solr.core} status=0 QTime=0
   [junit4]   2> 798452 INFO  (ScheduledTrigger-3909-thread-2) [    ] o.a.s.c.a.NodeLostTrigger Running NodeLostTrigger: .auto_add_replicas with currently live nodes: 4 and last live nodes: 0
   [junit4]   2> 798457 INFO  (qtp1148501855-12168) [n:127.0.0.1:34565_solr    ] o.a.s.s.HttpSolrCall [admin] webapp=null path=/admin/metrics params={prefix=CONTAINER.fs.usableSpace,CONTAINER.fs.totalSpace,CORE.coreName&wt=javabin&version=2&group=solr.node,solr.core} status=0 QTime=0
   [junit4]   2> 798460 INFO  (qtp1148501855-12169) [n:127.0.0.1:34565_solr    ] o.a.s.s.HttpSolrCall [admin] webapp=null path=/admin/metrics params={prefix=CONTAINER.fs.usableSpace,CONTAINER.fs.totalSpace,CORE.coreName&wt=javabin&version=2&group=solr.node,solr.core} status=0 QTime=0
   [junit4]   2> 798461 INFO  (qtp1148501855-12167) [n:127.0.0.1:34565_solr    ] o.a.s.s.HttpSolrCall [admin] webapp=null path=/admin/metrics params={prefix=CONTAINER.fs.usableSpace,CONTAINER.fs.totalSpace,CORE.coreName&wt=javabin&version=2&group=solr.node,solr.core} status=0 QTime=0
   [junit4]   2> 798462 INFO  (qtp1148501855-12168) [n:127.0.0.1:34565_solr    ] o.a.s.s.HttpSolrCall [admin] webapp=null path=/admin/metrics params={prefix=CONTAINER.fs.usableSpace,CONTAINER.fs.totalSpace,CORE.coreName&wt=javabin&version=2&group=solr.node,solr.core} status=0 QTime=0
   [junit4]   2> 798462 INFO  (qtp1148501855-12169) [n:127.0.0.1:34565_solr    ] o.a.s.s.HttpSolrCall [admin] webapp=null path=/admin/metrics params={prefix=CONTAINER.fs.usableSpace,CONTAINER.fs.totalSpace,CORE.coreName&wt=javabin&version=2&group=solr.node,solr.core} status=0 QTime=0
   [junit4]   2> 798474 INFO  (qtp1929450361-12140) [n:127.0.0.1:35533_solr    ] o.a.s.s.HttpSolrCall [admin] webapp=null path=/admin/metrics params={prefix=CONTAINER.fs.usableSpace,CONTAINER.fs.totalSpace,CORE.coreName&wt=javabin&version=2&group=solr.node,solr.core} status=0 QTime=0
   [junit4]   2> 798480 INFO  (qtp1929450361-12141) [n:127.0.0.1:35533_solr    ] o.a.s.s.HttpSolrCall [admin] webapp=null path=/admin/metrics params={prefix=CONTAINER.fs.usableSpace,CONTAINER.fs.totalSpace,CORE.coreName&wt=javabin&version=2&group=solr.node,solr.core} status=0 QTime=0
   [junit4]   2> 798480 INFO  (qtp1929450361-12139) [n:127.0.0.1:35533_solr    ] o.a.s.s.HttpSolrCall [admin] webapp=null path=/admin/metrics params={prefix=CONTAINER.fs.usableSpace,CONTAINER.fs.totalSpace,CORE.coreName&wt=javabin&version=2&group=solr.node,solr.core} status=0 QTime=0
   [junit4]   2> 798482 INFO  (qtp1929450361-12140) [n:127.0.0.1:35533_solr    ] o.a.s.s.HttpSolrCall [admin] webapp=null path=/admin/metrics params={prefix=CONTAINER.fs.usableSpace,CONTAINER.fs.totalSpace,CORE.coreName&wt=javabin&version=2&group=solr.node,solr.core} status=0 QTime=0
   [junit4]   2> 798482 INFO  (qtp1929450361-12141) [n:127.0.0.1:35533_solr    ] o.a.s.s.HttpSolrCall [admin] webapp=null path=/admin/metrics params={prefix=CONTAINER.fs.usableSpace,CONTAINER.fs.totalSpace,CORE.coreName&wt=javabin&version=2&group=solr.node,solr.core} status=0 QTime=0
   [junit4]   2> 798486 INFO  (qtp295818707-12160) [n:127.0.0.1:38489_solr    ] o.a.s.s.HttpSolrCall [admin] webapp=null path=/admin/metrics params={prefix=CONTAINER.fs.usableSpace,CONTAINER.fs.totalSpace,CORE.coreName&wt=javabin&version=2&group=solr.node,solr.core} status=0 QTime=0
   [junit4]   2> 798487 INFO  (qtp295818707-12161) [n:127.0.0.1:38489_solr    ] o.a.s.s.HttpSolrCall [admin] webapp=null path=/admin/metrics params={prefix=CONTAINER.fs.usableSpace,CONTAINER.fs.totalSpace,CORE.coreName&wt=javabin&version=2&group=solr.node,solr.core} status=0 QTime=0
   [junit4]   2> 798488 INFO  (qtp295818707-12159) [n:127.0.0.1:38489_solr    ] o.a.s.s.HttpSolrCall [admin] webapp=null path=/admin/metrics params={prefix=CONTAINER.fs.usableSpace,CONTAINER.fs.totalSpace,CORE.coreName&wt=javabin&version=2&group=solr.node,solr.core} status=0 QTime=0
   [junit4]   2> 798494 INFO  (qtp295818707-12160) [n:127.0.0.1:38489_solr    ] o.a.s.s.HttpSolrCall [admin] webapp=null path=/admin/metrics params={prefix=CONTAINER.fs.usableSpace,CONTAINER.fs.totalSpace,CORE.coreName&wt=javabin&version=2&group=solr.node,solr.core} status=0 QTime=0
   [junit4]   2> 798494 INFO  (qtp295818707-12161) [n:127.0.0.1:38489_solr    ] o.a.s.s.HttpSolrCall [admin] webapp=null path=/admin/metrics params={prefix=CONTAINER.fs.usableSpace,CONTAINER.fs.totalSpace,CORE.coreName&wt=javabin&version=2&group=solr.node,solr.core} status=0 QTime=0
   [junit4]   2> 798497 INFO  (OverseerStateUpdate-72128289371062280-127.0.0.1:35533_solr-n_0000000000) [n:127.0.0.1:35533_solr    ] o.a.s.c.o.SliceMutator createReplica() {
   [junit4]   2>   "operation":"ADDREPLICA",
   [junit4]   2>   "collection":"testSliceRouting",
   [junit4]   2>   "shard":"shard1",
   [junit4]   2>   "core":"testSliceRouting_shard1_replica_n1",
   [junit4]   2>   "state":"down",
   [junit4]   2>   "base_url":"http://127.0.0.1:38489/solr",
   [junit4]   2>   "type":"NRT",
   [junit4]   2>   "waitForFinalState":"false"} 
   [junit4]   2> 798699 INFO  (qtp295818707-12159) [n:127.0.0.1:38489_solr    x:testSliceRouting_shard1_replica_n1] o.a.s.h.a.CoreAdminOperation core create command qt=/admin/cores&coreNodeName=core_node2&collection.configName=testSliceRouting&newCollection=true&name=testSliceRouting_shard1_replica_n1&action=CREATE&numShards=1&collection=testSliceRouting&shard=shard1&wt=javabin&version=2&replicaType=NRT
   [junit4]   2> 799453 INFO  (ScheduledTrigger-3909-thread-1) [    ] o.a.s.c.a.NodeLostTrigger Running NodeLostTrigger: .auto_add_replicas with currently live nodes: 4 and last live nodes: 4
   [junit4]   2> 799706 INFO  (qtp295818707-12159) [n:127.0.0.1:38489_solr c:testSliceRouting s:shard1 r:core_node2 x:testSliceRouting_shard1_replica_n1] o.a.s.c.RequestParams conf resource params.json loaded . version : 0 
   [junit4]   2> 799707 INFO  (qtp295818707-12159) [n:127.0.0.1:38489_solr c:testSliceRouting s:shard1 r:core_node2 x:testSliceRouting_shard1_replica_n1] o.a.s.c.RequestParams request params refreshed to version 0
   [junit4]   2> 799707 WARN  (qtp295818707-12159) [n:127.0.0.1:38489_solr c:testSliceRouting s:shard1 r:core_node2 x:testSliceRouting_shard1_replica_n1] o.a.s.c.SolrConfig Couldn't add files from /home/jenkins/workspace/Lucene-Solr-master-Linux/solr/build/solr-core/test/J1/temp/solr.update.processor.TimeRoutedAliasUpdateProcessorTest_87AA84094394A25D-001/tempDir-001/node4/testSliceRouting_shard1_replica_n1/../../../../contrib/extraction/lib filtered by .*\.jar to classpath: /home/jenkins/workspace/Lucene-Solr-master-Linux/solr/build/solr-core/test/J1/temp/solr.update.processor.TimeRoutedAliasUpdateProcessorTest_87AA84094394A25D-001/tempDir-001/node4/testSliceRouting_shard1_replica_n1/../../../../contrib/extraction/lib
   [junit4]   2> 799707 WARN  (qtp295818707-12159) [n:127.0.0.1:38489_solr c:testSliceRouting s:shard1 r:core_node2 x:testSliceRouting_shard1_replica_n1] o.a.s.c.SolrConfig Couldn't add files from /home/jenkins/workspace/Lucene-Solr-master-Linux/solr/build/solr-core/test/J1/temp/solr.update.processor.TimeRoutedAliasUpdateProcessorTest_87AA84094394A25D-001/tempDir-001/node4/testSliceRouting_shard1_replica_n1/../../../../dist filtered by solr-cell-\d.*\.jar to classpath: /home/jenkins/workspace/Lucene-Solr-master-Linux/solr/build/solr-core/test/J1/temp/solr.update.processor.TimeRoutedAliasUpdateProcessorTest_87AA84094394A25D-001/tempDir-001/node4/testSliceRouting_shard1_replica_n1/../../../../dist
   [junit4]   2> 799707 WARN  (qtp295818707-12159) [n:127.0.0.1:38489_solr c:testSliceRouting s:shard1 r:core_node2 x:testSliceRouting_shard1_replica_n1] o.a.s.c.SolrConfig Couldn't add files from /home/jenkins/workspace/Lucene-Solr-master-Linux/solr/build/solr-core/test/J1/temp/solr.update.processor.TimeRoutedAliasUpdateProcessorTest_87AA84094394A25D-001/tempDir-001/node4/testSliceRouting_shard1_replica_n1/../../../../contrib/clustering/lib filtered by .*\.jar to classpath: /home/jenkins/workspace/Lucene-Solr-master-Linux/solr/build/solr-core/test/J1/temp/solr.update.processor.TimeRoutedAliasUpdateProcessorTest_87AA84094394A25D-001/tempDir-001/node4/testSliceRouting_shard1_replica_n1/../../../../contrib/clustering/lib
   [junit4]   2> 799707 WARN  (qtp295818707-12159) [n:127.0.0.1:38489_solr c:testSliceRouting s:shard1 r:core_node2 x:testSliceRouting_shard1_replica_n1] o.a.s.c.SolrConfig Couldn't add files from /home/jenkins/workspace/Lucene-Solr-master-Linux/solr/build/solr-core/test/J1/temp/solr.update.processor.TimeRoutedAliasUpdateProcessorTest_87AA84094394A25D-001/tempDir-001/node4/testSliceRouting_shard1_replica_n1/../../../../dist filtered by solr-clustering-\d.*\.jar to classpath: /home/jenkins/workspace/Lucene-Solr-master-Linux/solr/build/solr-core/test/J1/temp/solr.update.processor.TimeRoutedAliasUpdateProcessorTest_87AA84094394A25D-001/tempDir-001/node4/testSliceRouting_shard1_replica_n1/../../../../dist
   [junit4]   2> 799708 WARN  (qtp295818707-12159) [n:127.0.0.1:38489_solr c:testSliceRouting s:shard1 r:core_node2 x:testSliceRouting_shard1_replica_n1] o.a.s.c.SolrConfig Couldn't add files from /home/jenkins/workspace/Lucene-Solr-master-Linux/solr/build/solr-core/test/J1/temp/solr.update.processor.TimeRoutedAliasUpdateProcessorTest_87AA84094394A25D-001/tempDir-001/node4/testSliceRouting_shard1_replica_n1/../../../../contrib/langid/lib filtered by .*\.jar to classpath: /home/jenkins/workspace/Lucene-Solr-master-Linux/solr/build/solr-core/test/J1/temp/solr.update.processor.TimeRoutedAliasUpdateProcessorTest_87AA84094394A25D-001/tempDir-001/node4/testSliceRouting_shard1_replica_n1/../../../../contrib/langid/lib
   [junit4]   2> 799708 WARN  (qtp295818707-12159) [n:127.0.0.1:38489_solr c:testSliceRouting s:shard1 r:core_node2 x:testSliceRouting_shard1_replica_n1] o.a.s.c.SolrConfig Couldn't add files from /home/jenkins/workspace/Lucene-Solr-master-Linux/solr/build/solr-core/test/J1/temp/solr.update.processor.TimeRoutedAliasUpdateProcessorTest_87AA84094394A25D-001/tempDir-001/node4/testSliceRouting_shard1_replica_n1/../../../../dist filtered by solr-langid-\d.*\.jar to classpath: /home/jenkins/workspace/Lucene-Solr-master-Linux/solr/build/solr-core/test/J1/temp/solr.update.processor.TimeRoutedAliasUpdateProcessorTest_87AA84094394A25D-001/tempDir-001/node4/testSliceRouting_shard1_replica_n1/../../../../dist
   [junit4]   2> 799708 WARN  (qtp295818707-12159) [n:127.0.0.1:38489_solr c:testSliceRouting s:shard1 r:core_node2 x:testSliceRouting_shard1_replica_n1] o.a.s.c.SolrConfig Couldn't add files from /home/jenkins/workspace/Lucene-Solr-master-Linux/solr/build/solr-core/test/J1/temp/solr.update.processor.TimeRoutedAliasUpdateProcessorTest_87AA84094394A25D-001/tempDir-001/node4/testSliceRouting_shard1_replica_n1/../../../../contrib/velocity/lib filtered by .*\.jar to classpath: /home/jenkins/workspace/Lucene-Solr-master-Linux/solr/build/solr-core/test/J1/temp/solr.update.processor.TimeRoutedAliasUpdateProcessorTest_87AA84094394A25D-001/tempDir-001/node4/testSliceRouting_shard1_replica_n1/../../../../contrib/velocity/lib
   [junit4]   2> 799708 WARN  (qtp295818707-12159) [n:127.0.0.1:38489_solr c:testSliceRouting s:shard1 r:core_node2 x:testSliceRouting_shard1_replica_n1] o.a.s.c.SolrConfig Couldn't add files from /home/jenkins/workspace/Lucene-Solr-master-Linux/solr/build/solr-core/test/J1/temp/solr.update.processor.TimeRoutedAliasUpdateProcessorTest_87AA84094394A25D-001/tempDir-001/node4/testSliceRouting_shard1_replica_n1/../../../../dist filtered by solr-velocity-\d.*\.jar to classpath: /home/jenkins/workspace/Lucene-Solr-master-Linux/solr/build/solr-core/test/J1/temp/solr.update.processor.TimeRoutedAliasUpdateProcessorTest_87AA84094394A25D-001/tempDir-001/node4/testSliceRouting_shard1_replica_n1/../../../../dist
   [junit4]   2> 799708 WARN  (qtp295818707-12159) [n:127.0.0.1:38489_solr c:testSliceRouting s:shard1 r:core_node2 x:testSliceRouting_shard1_replica_n1] o.a.s.c.SolrConfig Couldn't add files from /home/jenkins/workspace/Lucene-Solr-master-Linux/solr/build/solr-core/test/J1/temp/solr.update.processor.TimeRoutedAliasUpdateProcessorTest_87AA84094394A25D-001/tempDir-001/node4/testSliceRouting_shard1_replica_n1/../../../../dist filtered by solr-ltr-\d.*\.jar to classpath: /home/jenkins/workspace/Lucene-Solr-master-Linux/solr/build/solr-core/test/J1/temp/solr.update.processor.TimeRoutedAliasUpdateProcessorTest_87AA84094394A25D-001/tempDir-001/node4/testSliceRouting_shard1_replica_n1/../../../../dist
   [junit4]   2> 799714 INFO  (qtp295818707-12159) [n:127.0.0.1:38489_solr c:testSliceRouting s:shard1 r:core_node2 x:testSliceRouting_shard1_replica_n1] o.a.s.c.SolrConfig Using Lucene MatchVersion: 8.0.0
   [junit4]   2> 799732 INFO  (qtp295818707-12159) [n:127.0.0.1:38489_solr c:testSliceRouting s:shard1 r:core_node2 x:testSliceRouting_shard1_replica_n1] o.a.s.s.IndexSchema [testSliceRouting_shard1_replica_n1] Schema name=default-config
   [junit4]   2> 799868 INFO  (qtp295818707-12159) [n:127.0.0.1:38489_solr c:testSliceRouting s:shard1 r:core_node2 x:testSliceRouting_shard1_replica_n1] o.a.s.s.IndexSchema Loaded schema default-config/1.6 with uniqueid field id
   [junit4]   2> 799950 INFO  (qtp295818707-12159) [n:127.0.0.1:38489_solr c:testSliceRouting s:shard1 r:core_node2 x:testSliceRouting_shard1_replica_n1] o.a.s.c.CoreContainer Creating SolrCore 'testSliceRouting_shard1_replica_n1' using configuration from collection testSliceRouting, trusted=true
   [junit4]   2> 799950 INFO  (qtp295818707-12159) [n:127.0.0.1:38489_solr c:testSliceRouting s:shard1 r:core_node2 x:testSliceRouting_shard1_replica_n1] o.a.s.m.r.SolrJmxReporter JMX monitoring for 'solr_38489.solr.core.testSliceRouting.shard1.replica_n1' (registry 'solr.core.testSliceRouting.shard1.replica_n1') enabled at server: com.sun.jmx.mbeanserver.JmxMBeanServer@70ed1e0a
   [junit4]   2> 799950 INFO  (qtp295818707-12159) [n:127.0.0.1:38489_solr c:testSliceRouting s:shard1 r:core_node2 x:testSliceRouting_shard1_replica_n1] o.a.s.c.SolrCore [[testSliceRouting_shard1_replica_n1] ] Opening new SolrCore at [/home/jenkins/workspace/Lucene-Solr-master-Linux/solr/build/solr-core/test/J1/temp/solr.update.processor.TimeRoutedAliasUpdateProcessorTest_87AA84094394A25D-001/tempDir-001/node4/testSliceRouting_shard1_replica_n1], dataDir=[/home/jenkins/workspace/Lucene-Solr-master-Linux/solr/build/solr-core/test/J1/temp/solr.update.processor.TimeRoutedAliasUpdateProcessorTest_87AA84094394A25D-001/tempDir-001/node4/./testSliceRouting_shard1_replica_n1/data/]
   [junit4]   2> 799973 INFO  (qtp295818707-12159) [n:127.0.0.1:38489_solr c:testSliceRouting s:shard1 r:core_node2 x:testSliceRouting_shard1_replica_n1] o.a.s.r.XSLTResponseWriter xsltCacheLifetimeSeconds=5
   [junit4]   2> 800218 INFO  (qtp295818707-12159) [n:127.0.0.1:38489_solr c:testSliceRouting s:shard1 r:core_node2 x:testSliceRouting_shard1_replica_n1] o.a.s.u.UpdateHandler Using UpdateLog implementation: org.apache.solr.update.UpdateLog
   [junit4]   2> 800218 INFO  (qtp295818707-12159) [n:127.0.0.1:38489_solr c:testSliceRouting s:shard1 r:core_node2 x:testSliceRouting_shard1_replica_n1] o.a.s.u.UpdateLog Initializing UpdateLog: dataDir= defaultSyncLevel=FLUSH numRecordsToKeep=100 maxNumLogsToKeep=10 numVersionBuckets=65536
   [junit4]   2> 800219 INFO  (qtp295818707-12159) [n:127.0.0.1:38489_solr c:testSliceRouting s:shard1 r:core_node2 x:testSliceRouting_shard1_replica_n1] o.a.s.u.CommitTracker Hard AutoCommit: if uncommitted for 15000ms; 
   [junit4]   2> 800219 INFO  (qtp295818707-12159) [n:127.0.0.1:38489_solr c:testSliceRouting s:shard1 r:core_node2 x:testSliceRouting_shard1_replica_n1] o.a.s.u.CommitTracker Soft AutoCommit: disabled
   [junit4]   2> 800230 INFO  (qtp295818707-12159) [n:127.0.0.1:38489_solr c:testSliceRouting s:shard1 r:core_node2 x:testSliceRouting_shard1_replica_n1] o.a.s.s.SolrIndexSearcher Opening [Searcher@66691d22[testSliceRouting_shard1_replica_n1] main]
   [junit4]   2> 800245 INFO  (qtp295818707-12159) [n:127.0.0.1:38489_solr c:testSliceRouting s:shard1 r:core_node2 x:testSliceRouting_shard1_replica_n1] o.a.s.r.ManagedResourceStorage Configured ZooKeeperStorageIO with znodeBase: /configs/testSliceRouting
   [junit4]   2> 800249 INFO  (qtp295818707-12159) [n:127.0.0.1:38489_solr c:testSliceRouting s:shard1 r:core_node2 x:testSliceRouting_shard1_replica_n1] o.a.s.r.ManagedResourceStorage Loaded null at path _rest_managed.json using ZooKeeperStorageIO:path=/configs/testSliceRouting
   [junit4]   2> 800249 INFO  (qtp295818707-12159) [n:127.0.0.1:38489_solr c:testSliceRouting s:shard1 r:core_node2 x:testSliceRouting_shard1_replica_n1] o.a.s.s.ZkIndexSchemaReader Creating ZooKeeper watch for the managed schema at /configs/testSliceRouting/managed-schema
   [junit4]   2> 800257 INFO  (qtp295818707-12159) [n:127.0.0.1:38489_solr c:testSliceRouting s:shard1 r:core_node2 x:testSliceRouting_shard1_replica_n1] o.a.s.s.ZkIndexSchemaReader Current schema version 0 is already the latest
   [junit4]   2> 800258 INFO  (qtp295818707-12159) [n:127.0.0.1:38489_solr c:testSliceRouting s:shard1 r:core_node2 x:testSliceRouting_shard1_replica_n1] o.a.s.h.c.SpellCheckComponent Initializing spell checkers
   [junit4]   2> 800258 INFO  (qtp295818707-12159) [n:127.0.0.1:38489_solr c:testSliceRouting s:shard1 r:core_node2 x:testSliceRouting_shard1_replica_n1] o.a.s.s.DirectSolrSpellChecker init: {name=default,field=_text_,classname=solr.DirectSolrSpellChecker,distanceMeasure=internal,accuracy=0.5,maxEdits=2,minPrefix=1,maxInspections=5,minQueryLength=4,maxQueryFrequency=0.01}
   [junit4]   2> 800259 INFO  (qtp295818707-12159) [n:127.0.0.1:38489_solr c:testSliceRouting s:shard1 r:core_node2 x:testSliceRouting_shard1_replica_n1] o.a.s.h.ReplicationHandler Commits will be reserved for 10000ms.
   [junit4]   2> 800259 INFO  (qtp295818707-12159) [n:127.0.0.1:38489_solr c:testSliceRouting s:shard1 r:core_node2 x:testSliceRouting_shard1_replica_n1] o.a.s.u.UpdateLog Could not find max version in index or recent updates, using new clock 1618806692685807616
   [junit4]   2> 800265 INFO  (searcherExecutor-3928-thread-1-processing-n:127.0.0.1:38489_solr x:testSliceRouting_shard1_replica_n1 c:testSliceRouting s:shard1 r:core_node2) [n:127.0.0.1:38489_solr c:testSliceRouting s:shard1 r:core_node2 x:testSliceRouting_shard1_replica_n1] o.a.s.c.QuerySenderListener QuerySenderListener sending requests to Searcher@66691d22[testSliceRouting_shard1_replica_n1] main{ExitableDirectoryReader(UninvertingDirectoryReader())}
   [junit4]   2> 800265 INFO  (searcherExecutor-3928-thread-1-processing-n:127.0.0.1:38489_solr x:testSliceRouting_shard1_replica_n1 c:testSliceRouting s:shard1 r:core_node2) [n:127.0.0.1:38489_solr c:testSliceRouting s:shard1 r:core_node2 x:testSliceRouting_shard1_replica_n1] o.a.s.c.QuerySenderListener QuerySenderListener done.
   [junit4]   2> 800265 INFO  (searcherExecutor-3928-thread-1-processing-n:127.0.0.1:38489_solr x:testSliceRouting_shard1_replica_n1 c:testSliceRouting s:shard1 r:core_node2) [n:127.0.0.1:38489_solr c:testSliceRouting s:shard1 r:core_node2 x:testSliceRouting_shard1_replica_n1] o.a.s.h.c.SpellCheckComponent Loading spell index for spellchecker: default
   [junit4]   2> 800266 INFO  (searcherExecutor-3928-thread-1-processing-n:127.0.0.1:38489_solr x:testSliceRouting_shard1_replica_n1 c:testSliceRouting s:shard1 r:core_node2) [n:127.0.0.1:38489_solr c:testSliceRouting s:shard1 r:core_node2 x:testSliceRouting_shard1_replica_n1] o.a.s.c.SolrCore [testSliceRouting_shard1_replica_n1] Registered new searcher Searcher@66691d22[testSliceRouting_shard1_replica_n1] main{ExitableDirectoryReader(UninvertingDirectoryReader())}
   [junit4]   2> 800313 INFO  (qtp295818707-12159) [n:127.0.0.1:38489_solr c:testSliceRouting s:shard1 r:core_node2 x:testSliceRouting_shard1_replica_n1] o.a.s.c.ZkShardTerms Successful update of terms at /collections/testSliceRouting/terms/shard1 to Terms{values={core_node2=0}, version=0}
   [junit4]   2> 800314 INFO  (qtp295818707-12159) [n:127.0.0.1:38489_solr c:testSliceRouting s:shard1 r:core_node2 x:testSliceRouting_shard1_replica_n1] o.a.s.c.ShardLeaderElectionContextBase make sure parent is created /collections/testSliceRouting/leaders/shard1
   [junit4]   2> 800346 INFO  (qtp295818707-12159) [n:127.0.0.1:38489_solr c:testSliceRouting s:shard1 r:core_node2 x:testSliceRouting_shard1_replica_n1] o.a.s.c.ShardLeaderElectionContext Enough replicas found to continue.
   [junit4]   2> 800346 INFO  (qtp295818707-12159) [n:127.0.0.1:38489_solr c:testSliceRouting s:shard1 r:core_node2 x:testSliceRouting_shard1_replica_n1] o.a.s.c.ShardLeaderElectionContext I may be the new leader - try and sync
   [junit4]   2> 800346 INFO  (qtp295818707-12159) [n:127.0.0.1:38489_solr c:testSliceRouting s:shard1 r:core_node2 x:testSliceRouting_shard1_replica_n1] o.a.s.c.SyncStrategy Sync replicas to http://127.0.0.1:38489/solr/testSliceRouting_shard1_replica_n1/
   [junit4]   2> 800346 INFO  (qtp295818707-12159) [n:127.0.0.1:38489_solr c:testSliceRouting s:shard1 r:core_node2 x:testSliceRouting_shard1_replica_n1] o.a.s.c.SyncStrategy Sync Success - now sync replicas to me
   [junit4]   2> 800346 INFO  (qtp295818707-12159) [n:127.0.0.1:38489_solr c:testSliceRouting s:shard1 r:core_node2 x:testSliceRouting_shard1_replica_n1] o.a.s.c.SyncStrategy http://127.0.0.1:38489/solr/testSliceRouting_shard1_replica_n1/ has no replicas
   [junit4]   2> 800346 INFO  (qtp295818707-12159) [n:127.0.0.1:38489_solr c:testSliceRouting s:shard1 r:core_node2 x:testSliceRouting_shard1_replica_n1] o.a.s.c.ShardLeaderElectionContextBase Creating leader registration node /collections/testSliceRouting/leaders/shard1/leader after winning as /collections/testSliceRouting/leader_elect/shard1/election/72128289371062287-core_node2-n_0000000000
   [junit4]   2> 800347 INFO  (qtp295818707-12159) [n:127.0.0.1:38489_solr c:testSliceRouting s:shard1 r:core_node2 x:testSliceRouting_shard1_replica_n1] o.a.s.c.ShardLeaderElectionContext I am the new leader: http://127.0.0.1:38489/solr/testSliceRouting_shard1_replica_n1/ shard1
   [junit4]   2> 800457 INFO  (ScheduledTrigger-3909-thread-1) [    ] o.a.s.c.a.NodeLostTrigger Running NodeLostTrigger: .auto_add_replicas with currently live nodes: 4 and last live nodes: 4
   [junit4]   2> 800497 INFO  (zkCallback-3730-thread-1) [    ] o.a.s.c.c.ZkStateReader A cluster state change: [WatchedEvent state:SyncConnected type:NodeDataChanged path:/collections/testSliceRouting/state.json] for collection [testSliceRouting] has occurred - updating... (live nodes size: [4])
   [junit4]   2> 800501 INFO  (zkCallback-3730-thread-2) [    ] o.a.s.c.c.ZkStateReader A cluster state change: [WatchedEvent state:SyncConnected type:NodeDataChanged path:/collections/testSliceRouting/state.json] for collection [testSliceRouting] has occurred - updating... (live nodes size: [4])
   [junit4]   2> 800512 INFO  (qtp295818707-12159) [n:127.0.0.1:38489_solr c:testSliceRouting s:shard1 r:core_node2 x:testSliceRouting_shard1_replica_n1] o.a.s.c.ZkController I am the leader, no recovery necessary
   [junit4]   2> 800565 INFO  (qtp295818707-12159) [n:127.0.0.1:38489_solr c:testSliceRouting s:shard1 r:core_node2 x:testSliceRouting_shard1_replica_n1] o.a.s.s.HttpSolrCall [admin] webapp=null path=/admin/cores params={qt=/admin/cores&coreNodeName=core_node2&collection.configName=testSliceRouting&newCollection=true&name=testSliceRouting_shard1_replica_n1&action=CREATE&numShards=1&collection=testSliceRouting&shard=shard1&wt=javabin&version=2&replicaType=NRT} status=0 QTime=1866
   [junit4]   2> 800617 INFO  (qtp424840302-12163) [n:127.0.0.1:37559_solr    ] o.a.s.h.a.CollectionsHandler Wait for new collection to be active for at most 45 seconds. Check all shard replicas
   [junit4]   2> 800641 INFO  (zkCallback-3726-thread-1) [    ] o.a.s.c.c.ZkStateReader A cluster state change: [WatchedEvent state:SyncConnected type:NodeDataChanged path:/collections/testSliceRouting/state.json] for collection [testSliceRouting] has occurred - updating... (live nodes size: [4])
   [junit4]   2> 800643 INFO  (zkCallback-3730-thread-1) [    ] o.a.s.c.c.ZkStateReader A cluster state change: [WatchedEvent state:SyncConnected type:NodeDataChanged path:/collections/testSliceRouting/state.json] for collection [testSliceRouting] has occurred - updating... (live nodes size: [4])
   [junit4]   2> 800643 INFO  (zkCallback-3730-thread-2) [    ] o.a.s.c.c.ZkStateReader A cluster state change: [WatchedEvent state:SyncConnected type:NodeDataChanged path:/collections/testSliceRouting/state.json] for collection [testSliceRouting] has occurred - updating... (live nodes size: [4])
   [junit4]   2> 800643 INFO  (zkCallback-3730-thread-3) [    ] o.a.s.c.c.ZkStateReader A cluster state change: [WatchedEvent state:SyncConnected type:NodeDataChanged path:/collections/testSliceRouting/state.json] for collection [testSliceRouting] has occurred - updating... (live nodes size: [4])
   [junit4]   2> 800646 INFO  (qtp424840302-12163) [n:127.0.0.1:37559_solr    ] o.a.s.s.HttpSolrCall [admin] webapp=null path=/admin/collections params={collection.configName=testSliceRouting&name=testSliceRouting&nrtReplicas=1&action=CREATE&numShards=1&wt=javabin&version=2} status=0 QTime=2486
   [junit4]   2> 800692 DEBUG (qtp295818707-12161) [n:127.0.0.1:38489_solr c:testSliceRouting s:shard1 r:core_node2 x:testSliceRouting_shard1_replica_n1] o.a.s.u.p.TrackingUpdateProcessorFactory Init URP, group 'testSliceRouting'
   [junit4]   2> 800711 INFO  (qtp295818707-12161) [n:127.0.0.1:38489_solr c:testSliceRouting s:shard1 r:core_node2 x:testSliceRouting_shard1_replica_n1] o.a.s.h.SolrConfigHandler Executed config commands successfully and persisted to ZK [{"set-user-property":{"update.autoCreateFields":false}}, {"add-updateprocessor":{
   [junit4]   2>     "name":"tolerant",
   [junit4]   2>     "class":"solr.TolerantUpdateProcessorFactory"}}, {"add-updateprocessor":{
   [junit4]   2>     "name":"tracking-testSliceRouting",
   [junit4]   2>     "class":"solr.TrackingUpdateProcessorFactory",
   [junit4]   2>     "group":"testSliceRouting"}}, {"add-updateprocessor":{
   [junit4]   2>     "name":"inc",
   [junit4]   2>     "class":"org.apache.solr.update.processor.TimeRoutedAliasUpdateProcessorTest$IncrementURPFactory",
   [junit4]   2>     "fieldName":"integer_i"}}]
   [junit4]   2> 800712 INFO  (qtp295818707-12161) [n:127.0.0.1:38489_solr c:testSliceRouting s:shard1 r:core_node2 x:testSliceRouting_shard1_replica_n1] o.a.s.h.SolrConfigHandler Waiting up to 30 secs for 1 replicas to set the property overlay to be of version 0 for collection testSliceRouting
   [junit4]   2> 800729 INFO  (solrHandlerExecutor-3933-thread-1-processing-n:127.0.0.1:38489_solr x:testSliceRouting_shard1_replica_n1 c:testSliceRouting s:shard1 r:core_node2) [n:127.0.0.1:38489_solr c:testSliceRouting s:shard1 r:core_node2 x:testSliceRouting_shard1_replica_n1] o.a.s.h.SolrConfigHandler Time elapsed : 0 secs, maxWait 30
   [junit4]   2> 800737 INFO  (Thread-2645) [    ] o.a.s.c.SolrCore config update listener called for core testSliceRouting_shard1_replica_n1
   [junit4]   2> 800752 INFO  (Thread-2645) [    ] o.a.s.c.SolrCore core reload testSliceRouting_shard1_replica_n1
   [junit4]   2> 800825 INFO  (Thread-2645) [    ] o.a.s.c.RequestParams conf resource params.json loaded . version : 0 
   [junit4]   2> 800825 INFO  (Thread-2645) [    ] o.a.s.c.RequestParams request params refreshed to version 0
   [junit4]   2> 800826 WARN  (Thread-2645) [    ] o.a.s.c.SolrConfig Couldn't add files from /home/jenkins/workspace/Lucene-Solr-master-Linux/solr/build/solr-core/test/J1/temp/solr.update.processor.TimeRoutedAliasUpdateProcessorTest_87AA84094394A25D-001/tempDir-001/node4/testSliceRouting_shard1_replica_n1/../../../../contrib/extraction/lib filtered by .*\.jar to classpath: /home/jenkins/workspace/Lucene-Solr-master-Linux/solr/build/solr-core/test/J1/temp/solr.update.processor.TimeRoutedAliasUpdateProcessorTest_87AA84094394A25D-001/tempDir-001/node4/testSliceRouting_shard1_replica_n1/../../../../contrib/extraction/lib
   [junit4]   2> 800826 WARN  (Thread-2645) [    ] o.a.s.c.SolrConfig Couldn't add files from /home/jenkins/workspace/Lucene-Solr-master-Linux/solr/build/solr-core/test/J1/temp/solr.update.processor.TimeRoutedAliasUpdateProcessorTest_87AA84094394A25D-001/tempDir-001/node4/testSliceRouting_shard1_replica_n1/../../../../dist filtered by solr-cell-\d.*\.jar to classpath: /home/jenkins/workspace/Lucene-Solr-master-Linux/solr/build/solr-core/test/J1/temp/solr.update.processor.TimeRoutedAliasUpdateProcessorTest_87AA84094394A25D-001/tempDir-001/node4/testSliceRouting_shard1_replica_n1/../../../../dist
   [junit4]   2> 800826 WARN  (Thread-2645) [    ] o.a.s.c.SolrConfig Couldn't add files from /home/jenkins/workspace/Lucene-Solr-master-Linux/solr/build/solr-core/test/J1/temp/solr.update.processor.TimeRoutedAliasUpdateProcessorTest_87AA84094394A25D-001/tempDir-001/node4/testSliceRouting_shard1_replica_n1/../../../../contrib/clustering/lib filtered by .*\.jar to classpath: /home/jenkins/workspace/Lucene-Solr-master-Linux/solr/build/solr-core/test/J1/temp/solr.update.processor.TimeRoutedAliasUpdateProcessorTest_87AA84094394A25D-001/tempDir-001/node4/testSliceRouting_shard1_replica_n1/../../../../contrib/clustering/lib
   [junit4]   2> 800827 WARN  (Thread-2645) [    ] o.a.s.c.SolrConfig Couldn't add files from /home/jenkins/workspace/Lucene-Solr-master-Linux/solr/build/solr-core/test/J1/temp/solr.update.processor.TimeRoutedAliasUpdateProcessorTest_87AA84094394A25D-001/tempDir-001/node4/testSliceRouting_shard1_replica_n1/../../../../dist filtered by solr-clustering-\d.*\.jar to classpath: /home/jenkins/workspace/Lucene-Solr-master-Linux/solr/build/solr-core/test/J1/temp/solr.update.processor.TimeRoutedAliasUpdateProcessorTest_87AA84094394A25D-001/tempDir-001/node4/testSliceRouting_shard1_replica_n1/../../../../dist
   [junit4]   2> 800827 WARN  (Thread-2645) [    ] o.a.s.c.SolrConfig Couldn't add files from /home/jenkins/workspace/Lucene-Solr-master-Linux/solr/build/solr-core/test/J1/temp/solr.update.processor.TimeRoutedAliasUpdateProcessorTest_87AA84094394A25D-001/tempDir-001/node4/testSliceRouting_shard1_replica_n1/../../../../contrib/langid/lib filtered by .*\.jar to classpath: /home/jenkins/workspace/Lucene-Solr-master-Linux/solr/build/solr-core/test/J1/temp/solr.update.processor.TimeRoutedAliasUpdateProcessorTest_87AA84094394A25D-001/tempDir-001/node4/testSliceRouting_shard1_replica_n1/../../../../contrib/langid/lib
   [junit4]   2> 800827 WARN  (Thread-2645) [    ] o.a.s.c.SolrConfig Couldn't add files from /home/jenkins/workspace/Lucene-Solr-master-Linux/solr/build/solr-core/test/J1/temp/solr.update.processor.TimeRoutedAliasUpdateProcessorTest_87AA84094394A25D-001/tempDir-001/node4/testSliceRouting_shard1_replica_n1/../../../../dist filtered by solr-langid-\d.*\.jar to classpath: /home/jenkins/workspace/Lucene-Solr-master-Linux/solr/build/solr-core/test/J1/temp/solr.update.processor.TimeRoutedAliasUpdateProcessorTest_87AA84094394A25D-001/tempDir-001/node4/testSliceRouting_shard1_replica_n1/../../../../dist
   [junit4]   2> 800827 WARN  (Thread-2645) [    ] o.a.s.c.SolrConfig Couldn't add files from /home/jenkins/workspace/Lucene-Solr-master-Linux/solr/build/solr-core/test/J1/temp/solr.update.processor.TimeRoutedAliasUpdateProcessorTest_87AA84094394A25D-001/tempDir-001/node4/testSliceRouting_shard1_replica_n1/../../../../contrib/velocity/lib filtered by .*\.jar to classpath: /home/jenkins/workspace/Lucene-Solr-master-Linux/solr/build/solr-core/test/J1/temp/solr.update.processor.TimeRoutedAliasUpdateProcessorTest_87AA84094394A25D-001/tempDir-001/node4/testSliceRouting_shard1_replica_n1/../../../../contrib/velocity/lib
   [junit4]   2> 800827 WARN  (Thread-2645) [    ] o.a.s.c.SolrConfig Couldn't add files from /home/jenkins/workspace/Lucene-Solr-master-Linux/solr/build/solr-core/test/J1/temp/solr.update.processor.TimeRoutedAliasUpdateProcessorTest_87AA84094394A25D-001/tempDir-001/node4/testSliceRouting_shard1_replica_n1/../../../../dist filtered by solr-velocity-\d.*\.jar to classpath: /home/jenkins/workspace/Lucene-Solr-master-Linux/solr/build/solr-core/test/J1/temp/solr.update.processor.TimeRoutedAliasUpdateProcessorTest_87AA84094394A25D-001/tempDir-001/node4/testSliceRouting_shard1_replica_n1/../../../../dist
   [junit4]   2> 800827 WARN  (Thread-2645) [    ] o.a.s.c.SolrConfig Couldn't add files from /home/jenkins/workspace/Lucene-Solr-master-Linux/solr/build/solr-core/test/J1/temp/solr.update.processor.TimeRoutedAliasUpdateProcessorTest_87AA84094394A25D-001/tempDir-001/node4/testSliceRouting_shard1_replica_n1/../../../../dist filtered by solr-ltr-\d.*\.jar to classpath: /home/jenkins/workspace/Lucene-Solr-master-Linux/solr/build/solr-core/test/J1/temp/solr.update.processor.TimeRoutedAliasUpdateProcessorTest_87AA84094394A25D-001/tempDir-001/node4/testSliceRouting_shard1_replica_n1/../../../../dist
   [junit4]   2> 800837 INFO  (Thread-2645) [    ] o.a.s.c.SolrConfig Using Lucene MatchVersion: 8.0.0
   [junit4]   2> 800850 INFO  (qtp295818707-12160) [n:127.0.0.1:38489_solr c:testSliceRouting s:shard1 r:core_node2 x:testSliceRouting_shard1_replica_n1] o.a.s.h.SolrConfigHandler expecting overlay version 0 but my version is -1
   [junit4]   2> 800857 INFO  (qtp295818707-12160) [n:127.0.0.1:38489_solr c:testSliceRouting s:shard1 r:core_node2 x:testSliceRouting_shard1_replica_n1] o.a.s.c.S.Request [testSliceRouting_shard1_replica_n1]  webapp=/solr path=/config/znodeVersion params={overlay=0&wt=javabin&version=2} status=0 QTime=7
   [junit4]   2> 800861 INFO  (SolrConfigHandler-refreshconf) [    ] o.a.s.h.SolrConfigHandler Another reload is in progress . Not doing anything
   [junit4]   2> 800865 INFO  (solrHandlerExecutor-3933-thread-1-processing-n:127.0.0.1:38489_solr x:testSliceRouting_shard1_replica_n1 c:testSliceRouting s:shard1 r:core_node2) [n:127.0.0.1:38489_solr c:testSliceRouting s:shard1 r:core_node2 x:testSliceRouting_shard1_replica_n1] o.a.s.h.SolrConfigHandler Could not get expectedVersion 0 from http://127.0.0.1:38489/solr/testSliceRouting_shard1_replica_n1/ for prop overlay   after 1 attempts
   [junit4]   2> 800865 INFO  (solrHandlerExecutor-3933-thread-1-processing-n:127.0.0.1:38489_solr x:testSliceRouting_shard1_replica_n1 c:testSliceRouting s:shard1 r:core_node2) [n:127.0.0.1:38489_solr c:testSliceRouting s:shard1 r:core_node2 x:testSliceRouting_shard1_replica_n1] o.a.s.h.SolrConfigHandler Time elapsed : 0 secs, maxWait 30
   [junit4]   2> 800891 INFO  (Thread-2645) [    ] o.a.s.s.IndexSchema [testSliceRouting_shard1_replica_n1] Schema name=default-config
   [junit4]   2> 800978 INFO  (qtp295818707-12159) [n:127.0.0.1:38489_solr c:testSliceRouting s:shard1 r:core_node2 x:testSliceRouting_shard1_replica_n1] o.a.s.h.SolrConfigHandler expecting overlay version 0 but my version is -1
   [junit4]   2> 800985 INFO  (qtp295818707-12159) [n:127.0.0.1:38489_solr c:testSliceRouting s:shard1 r:core_node2 x:testSliceRouting_shard1_replica_n1] o.a.s.c.S.Request [testSliceRouting_shard1_replica_n1]  webapp=/solr path=/config/znodeVersion params={overlay=0&wt=javabin&version=2} status=0 QTime=7
   [junit4]   2> 800989 INFO  (SolrConfigHandler-refreshconf) [    ] o.a.s.h.SolrConfigHandler Another reload is in progress . Not doing anything
   [junit4]   2> 800989 INFO  (solrHandlerExecutor-3933-thread-1-processing-n:127.0.0.1:38489_solr x:testSliceRouting_shard1_replica_n1 c:testSliceRouting s:shard1 r:core_node2) [n:127.0.0.1:38489_solr c:testSliceRouting s:shard1 r:core_node2 x:testSliceRouting_shard1_replica_n1] o.a.s.h.SolrConfigHandler Could not get expectedVersion 0 from http://127.0.0.1:38489/solr/testSliceRouting_shard1_replica_n1/ for prop overlay   after 2 attempts
   [junit4]   2> 800989 INFO  (solrHandlerExecutor-3933-thread-1-processing-n:127.0.0.1:38489_solr x:testSliceRouting_shard1_replica_n1 c:testSliceRouting s:shard1 r:core_node2) [n:127.0.0.1:38489_solr c:testSliceRouting s:shard1 r:core_node2 x:testSliceRouting_shard1_replica_n1] o.a.s.h.SolrConfigHandler Time elapsed : 0 secs, maxWait 30
   [junit4]   2> 801097 INFO  (qtp295818707-12160) [n:127.0.0.1:38489_solr c:testSliceRouting s:shard1 r:core_node2 x:testSliceRouting_shard1_replica_n1] o.a.s.h.SolrConfigHandler expecting overlay version 0 but my version is -1
   [junit4]   2> 801105 INFO  (qtp295818707-12160) [n:127.0.0.1:38489_solr c:testSliceRouting s:shard1 r:core_node2 x:testSliceRouting_shard1_replica_n1] o.a.s.c.S.Request [testSliceRouting_shard1_replica_n1]  webapp=/solr path=/config/znodeVersion params={overlay=0&wt=javabin&version=2} status=0 QTime=7
   [junit4]   2> 801109 INFO  (SolrConfigHandler-refreshconf) [    ] o.a.s.h.SolrConfigHandler Another reload is in progress . Not doing anything
   [junit4]   2> 801109 INFO  (solrHandlerExecutor-3933-thread-1-processing-n:127.0.0.1:38489_solr x:testSliceRouting_shard1_replica_n1 c:testSliceRouting s:shard1 r:core_node2) [n:127.0.0.1:38489_solr c:testSliceRouting s:shard1 r:core_node2 x:testSliceRouting_shard1_replica_n1] o.a.s.h.SolrConfigHandler Could not get expectedVersion 0 from http://127.0.0.1:38489/solr/testSliceRouting_shard1_replica_n1/ for prop overlay   after 3 attempts
   [junit4]   2> 801109 INFO  (solrHandlerExecutor-3933-thread-1-processing-n:127.0.0.1:38489_solr x:testSliceRouting_shard1_replica_n1 c:testSliceRouting s:shard1 r:core_node2) [n:127.0.0.1:38489_solr c:testSliceRouting s:shard1 r:core_node2 x:testSliceRouting_shard1_replica_n1] o.a.s.h.SolrConfigHandler Time elapsed : 0 secs, maxWait 30
   [junit4]   2> 801229 INFO  (qtp295818707-12159) [n:127.0.0.1:38489_solr c:testSliceRouting s:shard1 r:core_node2 x:testSliceRouting_shard1_replica_n1] o.a.s.h.SolrConfigHandler expecting overlay version 0 but my version is -1
   [junit4]   2> 801230 INFO  (qtp295818707-12159) [n:127.0.0.1:38489_solr c:testSliceRouting s:shard1 r:core_node2 x:testSliceRouting_shard1_replica_n1] o.a.s.c.S.Request [testSliceRouting_shard1_replica_n1]  webapp=/solr path=/config/znodeVersion params={overlay=0&wt=javabin&version=2} status=0 QTime=0
   [junit4]   2> 801230 INFO  (SolrConfigHandler-refreshconf) [    ] o.a.s.h.SolrConfigHandler Another reload is in progress . Not doing anything
   [junit4]   2> 801234 INFO  (solrHandlerExecutor-3933-thread-1-processing-n:127.0.0.1:38489_solr x:testSliceRouting_shard1_replica_n1 c:testSliceRouting s:shard1 r:core_node2) [n:127.0.0.1:38489_solr c:testSliceRouting s:shard1 r:core_node2 x:testSliceRouting_shard1_replica_n1] o.a.s.h.SolrConfigHandler Could not get expectedVersion 0 from http://127.0.0.1:38489/solr/testSliceRouting_shard1_replica_n1/ for prop overlay   after 4 attempts
   [junit4]   2> 801234 INFO  (solrHandlerExecutor-3933-thread-1-processing-n:127.0.0.1:38489_solr x:testSliceRouting_shard1_replica_n1 c:testSliceRouting s:shard1 r:core_node2) [n:127.0.0.1:38489_solr c:testSliceRouting s:shard1 r:core_node2 x:testSliceRouting_shard1_replica_n1] o.a.s.h.SolrConfigHandler Time elapsed : 0 secs, maxWait 30
   [junit4]   2> 801263 INFO  (Thread-2645) [    ] o.a.s.s.IndexSchema Loaded schema default-config/1.6 with uniqueid field id
   [junit4]   2> 801343 INFO  (qtp295818707-12160) [n:127.0.0.1:38489_solr c:testSliceRouting s:shard1 r:core_node2 x:testSliceRouting_shard1_replica_n1] o.a.s.h.SolrConfigHandler expecting overlay version 0 but my version is -1
   [junit4]   2> 801343 INFO  (qtp295818707-12160) [n:127.0.0.1:38489_solr c:testSliceRouting s:shard1 r:core_node2 x:testSliceRouting_shard1_replica_n1] o.a.s.c.S.Request [testSliceRouting_shard1_replica_n1]  webapp=/solr path=/config/znodeVersion params={overlay=0&wt=javabin&version=2} status=0 QTime=0
   [junit4]   2> 801343 INFO  (SolrConfigHandler-refreshconf) [    ] o.a.s.h.SolrConfigHandler Another reload is in progress . Not doing anything
   [junit4]   2> 801345 INFO  (solrHandlerExecutor-3933-thread-1-processing-n:127.0.0.1:38489_solr x:testSliceRouting_shard1_replica_n1 c:testSliceRouting s:shard1 r:core_node2) [n:127.0.0.1:38489_solr c:testSliceRouting s:shard1 r:core_node2 x:testSliceRouting_shard1_replica_n1] o.a.s.h.SolrConfigHandler Could not get expectedVersion 0 from http://127.0.0.1:38489/solr/testSliceRouting_shard1_replica_n1/ for prop overlay   after 5 attempts
   [junit4]   2> 801345 INFO  (solrHandlerExecutor-3933-thread-1-processing-n:127.0.0.1:38489_solr x:testSliceRouting_shard1_replica_n1 c:testSliceRouting s:shard1 r:core_node2) [n:127.0.0.1:38489_solr c:testSliceRouting s:shard1 r:core_node2 x:testSliceRouting_shard1_replica_n1] o.a.s.h.SolrConfigHandler Time elapsed : 0 secs, maxWait 30
   [junit4]   2> 801454 INFO  (qtp295818707-12159) [n:127.0.0.1:38489_solr c:testSliceRouting s:shard1 r:core_node2 x:testSliceRouting_shard1_replica_n1] o.a.s.h.SolrConfigHandler expecting overlay version 0 but my version is -1
   [junit4]   2> 801461 INFO  (qtp295818707-12159) [n:127.0.0.1:38489_solr c:testSliceRouting s:shard1 r:core_node2 x:testSliceRouting_shard1_replica_n1] o.a.s.c.S.Request [testSliceRouting_shard1_replica_n1]  webapp=/solr path=/config/znodeVersion params={overlay=0&wt=javabin&version=2} status=0 QTime=6
   [junit4]   2> 801461 INFO  (SolrConfigHandler-refreshconf) [    ] o.a.s.h.SolrConfigHandler Another reload is in progress . Not doing anything
   [junit4]   2> 801461 INFO  (ScheduledTrigger-3909-thread-1) [    ] o.a.s.c.a.NodeLostTrigger Running NodeLostTrigger: .auto_add_replicas with currently live nodes: 4 and last live nodes: 4
   [junit4]   2> 801465 INFO  (solrHandlerExecutor-3933-thread-1-processing-n:127.0.0.1:38489_solr x:testSliceRouting_shard1_replica_n1 c:testSliceRouting s:shard1 r:core_node2) [n:127.0.0.1:38489_solr c:testSliceRouting s:shard1 r:core_node2 x:testSliceRouting_shard1_replica_n1] 

[...truncated too long message...]

ric reporters for registry=solr.jetty, tag=null
   [junit4]   2> 822685 INFO  (jetty-closer-3889-thread-4) [    ] o.a.s.m.r.SolrJmxReporter Closing reporter [org.apache.solr.metrics.reporters.SolrJmxReporter@403e459f: rootName = solr_44413, domain = solr.jetty, service url = null, agent id = null] for registry solr.jetty / com.codahale.metrics.MetricRegistry@858c64
   [junit4]   2> 822685 INFO  (jetty-closer-3889-thread-4) [    ] o.a.s.m.SolrMetricManager Closing metric reporters for registry=solr.cluster, tag=null
   [junit4]   2> 822688 INFO  (zkCallback-3944-thread-1) [    ] o.a.s.c.c.ZkStateReader Updated live nodes from ZooKeeper... (4) -> (2)
   [junit4]   2> 822705 INFO  (zkCallback-3928-thread-2) [    ] o.a.s.c.c.ZkStateReader Updated live nodes from ZooKeeper... (3) -> (2)
   [junit4]   2> 822705 WARN  (NIOServerCxn.Factory:0.0.0.0/0.0.0.0:0) [    ] o.a.z.s.NIOServerCnxn Unable to read additional data from client sessionid 0x100404c688c000e, likely client has closed socket
   [junit4]   2> 822709 INFO  (zkCallback-3928-thread-1) [    ] o.a.s.c.c.ZkStateReader Updated live nodes from ZooKeeper... (2) -> (1)
   [junit4]   2> 822729 INFO  (zkCallback-3928-thread-3) [    ] o.a.s.c.OverseerElectionContext I am going to be the leader 127.0.0.1:44413_solr
   [junit4]   2> 822733 INFO  (zkCallback-3954-thread-1) [    ] o.a.s.c.c.ZkStateReader Updated live nodes from ZooKeeper... (2) -> (1)
   [junit4]   2> 822748 INFO  (jetty-closer-3889-thread-3) [    ] o.e.j.s.AbstractConnector Stopped ServerConnector@2bb06dd6{HTTP/1.1,[http/1.1]}{127.0.0.1:0}
   [junit4]   2> 822782 INFO  (jetty-closer-3889-thread-3) [    ] o.e.j.s.h.ContextHandler Stopped o.e.j.s.ServletContextHandler@2ca7d393{/solr,null,UNAVAILABLE}
   [junit4]   2> 822793 INFO  (jetty-closer-3889-thread-3) [    ] o.e.j.s.session node0 Stopped scavenging
   [junit4]   2> 822803 INFO  (jetty-closer-3889-thread-1) [    ] o.e.j.s.AbstractConnector Stopped ServerConnector@4c6e6402{HTTP/1.1,[http/1.1]}{127.0.0.1:0}
   [junit4]   2> 822809 INFO  (jetty-closer-3889-thread-1) [    ] o.e.j.s.h.ContextHandler Stopped o.e.j.s.ServletContextHandler@4bcefed8{/solr,null,UNAVAILABLE}
   [junit4]   2> 822821 INFO  (jetty-closer-3889-thread-1) [    ] o.e.j.s.session node0 Stopped scavenging
   [junit4]   2> 822822 INFO  (jetty-closer-3889-thread-2) [    ] o.e.j.s.AbstractConnector Stopped ServerConnector@324df484{HTTP/1.1,[http/1.1]}{127.0.0.1:0}
   [junit4]   2> 822831 INFO  (jetty-closer-3889-thread-2) [    ] o.e.j.s.h.ContextHandler Stopped o.e.j.s.ServletContextHandler@134d00bd{/solr,null,UNAVAILABLE}
   [junit4]   2> 822853 INFO  (jetty-closer-3889-thread-2) [    ] o.e.j.s.session node0 Stopped scavenging
   [junit4]   2> 822861 INFO  (jetty-closer-3889-thread-4) [    ] o.e.j.s.AbstractConnector Stopped ServerConnector@367b0682{HTTP/1.1,[http/1.1]}{127.0.0.1:0}
   [junit4]   2> 822889 INFO  (jetty-closer-3889-thread-4) [    ] o.e.j.s.h.ContextHandler Stopped o.e.j.s.ServletContextHandler@70ae8ed8{/solr,null,UNAVAILABLE}
   [junit4]   2> 822895 INFO  (jetty-closer-3889-thread-4) [    ] o.e.j.s.session node0 Stopped scavenging
   [junit4]   2> 822915 INFO  (TEST-TimeRoutedAliasUpdateProcessorTest.testParse-seed#[87AA84094394A25D]) [    ] o.a.s.c.ZkTestServer Shutting down ZkTestServer.
   [junit4]   2> 822920 WARN  (NIOServerCxn.Factory:0.0.0.0/0.0.0.0:0) [    ] o.a.z.s.NIOServerCnxn Unable to read additional data from client sessionid 0x100404c688c0000, likely client has closed socket
   [junit4]   2> 822931 WARN  (ZkTestServer Run Thread) [    ] o.a.s.c.ZkTestServer Watch limit violations: 
   [junit4]   2> Maximum concurrent create/delete watches above limit:
   [junit4]   2> 
   [junit4]   2> 	9	/solr/aliases.json
   [junit4]   2> 	9	/solr/clusterprops.json
   [junit4]   2> 	4	/solr/security.json
   [junit4]   2> 
   [junit4]   2> Maximum concurrent data watches above limit:
   [junit4]   2> 
   [junit4]   2> 	9	/solr/clusterstate.json
   [junit4]   2> 	2	/solr/overseer_elect/election/72128290953625614-127.0.0.1:44625_solr-n_0000000001
   [junit4]   2> 
   [junit4]   2> Maximum concurrent children watches above limit:
   [junit4]   2> 
   [junit4]   2> 	9	/solr/live_nodes
   [junit4]   2> 	9	/solr/collections
   [junit4]   2> 
   [junit4]   2> 822962 ERROR (TEST-TimeRoutedAliasUpdateProcessorTest.testParse-seed#[87AA84094394A25D]) [    ] o.a.z.s.ZooKeeperServer ZKShutdownHandler is not registered, so ZooKeeper server won't take any action on ERROR or SHUTDOWN server state changes
   [junit4]   2> 822983 INFO  (TEST-TimeRoutedAliasUpdateProcessorTest.testParse-seed#[87AA84094394A25D]) [    ] o.a.s.c.ZkTestServer parse host and port list: 127.0.0.1:40613
   [junit4]   2> 822983 INFO  (TEST-TimeRoutedAliasUpdateProcessorTest.testParse-seed#[87AA84094394A25D]) [    ] o.a.s.c.ZkTestServer connecting to 127.0.0.1 40613
   [junit4]   2> 822984 INFO  (TEST-TimeRoutedAliasUpdateProcessorTest.testParse-seed#[87AA84094394A25D]) [    ] o.a.s.SolrTestCaseJ4 ###Ending testParse
   [junit4]   2> NOTE: leaving temporary files on disk at: /home/jenkins/workspace/Lucene-Solr-master-Linux/solr/build/solr-core/test/J1/temp/solr.update.processor.TimeRoutedAliasUpdateProcessorTest_87AA84094394A25D-001
   [junit4]   2> Dec 03, 2018 5:19:48 AM com.carrotsearch.randomizedtesting.ThreadLeakControl checkThreadLeaks
   [junit4]   2> WARNING: Will linger awaiting termination of 1 leaked thread(s).
   [junit4]   2> NOTE: test params are: codec=Asserting(Lucene80): {}, docValues:{}, maxPointsInLeafNode=1531, maxMBSortInHeap=6.222785846063654, sim=Asserting(org.apache.lucene.search.similarities.AssertingSimilarity@37f22b1d), locale=fr-FR, timezone=Pacific/Efate
   [junit4]   2> NOTE: Linux 4.15.0-39-generic amd64/Oracle Corporation 9.0.4 (64-bit)/cpus=8,threads=1,free=142246624,total=536870912
   [junit4]   2> NOTE: All tests run in this JVM: [TermVectorComponentTest, ShowFileRequestHandlerTest, TestTrackingShardHandlerFactory, TestInfoStreamLogging, TestPhraseSuggestions, AliasIntegrationTest, TestNumericTokenStream, TestUniqueKeyFieldResource, RecoveryAfterSoftCommitTest, ScheduledMaintenanceTriggerTest, TemplateUpdateProcessorTest, TestStandardQParsers, ConfigureRecoveryStrategyTest, CursorMarkTest, TlogReplayBufferedWhileIndexingTest, ClassificationUpdateProcessorTest, TestSlowCompositeReaderWrapper, IndexSizeTriggerTest, ConjunctionSolrSpellCheckerTest, TestSimExecutePlanAction, OutOfBoxZkACLAndCredentialsProvidersTest, TestManagedResourceStorage, PluginInfoTest, DistribDocExpirationUpdateProcessorTest, TestDistributedMap, TestDistributedSearch, TestCursorMarkWithoutUniqueKey, TestLegacyFieldReuse, TestExpandComponent, IndexBasedSpellCheckerTest, VersionInfoTest, HdfsBasicDistributedZkTest, EnumFieldTest, TestChildDocTransformer, ConcurrentDeleteAndCreateCollectionTest, FastVectorHighlighterTest, PreAnalyzedFieldManagedSchemaCloudTest, ConnectionReuseTest, HttpPartitionTest, TestXmlQParser, DistributedExpandComponentTest, CloudMLTQParserTest, RestartWhileUpdatingTest, SpellPossibilityIteratorTest, ReturnFieldsTest, SubstringBytesRefFilterTest, TestSimPolicyCloud, AutoscalingHistoryHandlerTest, TestImpersonationWithHadoopAuth, TestCorePropertiesReload, DeleteShardTest, TestStressCloudBlindAtomicUpdates, TestAtomicUpdateErrorCases, CreateCollectionCleanupTest, InfoHandlerTest, ExitableDirectoryReaderTest, TaggerTest, MinimalSchemaTest, TestRandomFaceting, MetricsHistoryIntegrationTest, TestManagedSynonymGraphFilterFactory, TestInitQParser, TestFieldCollectionResource, SolrPluginUtilsTest, TestObjectReleaseTracker, ShufflingReplicaListTransformerTest, TestGeoJSONResponseWriter, TestUtilizeNode, OverseerModifyCollectionTest, TestSimpleQParserPlugin, TestRuleBasedAuthorizationPlugin, TestOverriddenPrefixQueryForCustomFieldType, CollectionTooManyReplicasTest, TestCloudDeleteByQuery, TestShortCircuitedRequests, TestSolrCloudWithDelegationTokens, TestCloudRecovery2, DistributedSuggestComponentTest, DistributedUpdateProcessorTest, SuggesterTest, HdfsRestartWhileUpdatingTest, CacheHeaderTest, TestSweetSpotSimilarityFactory, TestAnalyzedSuggestions, TestCloudPivotFacet, PeerSyncWithIndexFingerprintCachingTest, SuggestComponentContextFilterQueryTest, BasicFunctionalityTest, TestMissingGroups, TestHdfsBackupRestoreCore, VMParamsZkACLAndCredentialsProvidersTest, PropertiesRequestHandlerTest, ConcurrentCreateRoutedAliasTest, TestHighlightDedupGrouping, ShardSplitTest, TestRawTransformer, TestSolrDeletionPolicy1, TestSQLHandlerNonCloud, TestMacros, TestIntervalFaceting, FullSolrCloudDistribCmdsTest, TimeRoutedAliasUpdateProcessorTest]
   [junit4] Completed [336/837 (1!)] on J1 in 28.14s, 4 tests, 1 error, 1 skipped <<< FAILURES!

[...truncated 44219 lines...]
[repro] Jenkins log URL: https://jenkins.thetaphi.de/job/Lucene-Solr-master-Linux/23289/consoleText

[repro] Revision: b6b9f9554e6a30d92afd2b277554e1d1f81ede5d

[repro] Ant options: "-Dargs=-XX:+UseCompressedOops -XX:+UseG1GC"
[repro] Repro line:  ant test  -Dtestcase=TimeRoutedAliasUpdateProcessorTest -Dtests.method=testPreemptiveCreation -Dtests.seed=87AA84094394A25D -Dtests.multiplier=3 -Dtests.slow=true -Dtests.locale=fr-FR -Dtests.timezone=Pacific/Efate -Dtests.asserts=true -Dtests.file.encoding=US-ASCII

[repro] ant clean

[...truncated 6 lines...]
[repro] Test suites by module:
[repro]    solr/core
[repro]       TimeRoutedAliasUpdateProcessorTest
[repro] ant compile-test

[...truncated 3579 lines...]
[repro] ant test-nocompile -Dtests.dups=5 -Dtests.maxfailures=5 -Dtests.class="*.TimeRoutedAliasUpdateProcessorTest" -Dtests.showOutput=onerror "-Dargs=-XX:+UseCompressedOops -XX:+UseG1GC" -Dtests.seed=87AA84094394A25D -Dtests.multiplier=3 -Dtests.slow=true -Dtests.locale=fr-FR -Dtests.timezone=Pacific/Efate -Dtests.asserts=true -Dtests.file.encoding=US-ASCII

[...truncated 90 lines...]
[repro] Failures:
[repro]   0/5 failed: org.apache.solr.update.processor.TimeRoutedAliasUpdateProcessorTest
[repro] Exiting with code 0

[...truncated 40 lines...]