You are viewing a plain text version of this content. The canonical link for it is here.
Posted to builds@beam.apache.org by Apache Jenkins Server <je...@builds.apache.org> on 2023/02/13 21:06:07 UTC

Build failed in Jenkins: beam_PostCommit_Java_Nexmark_Dataflow_V2 #2508

See <https://ci-beam.apache.org/job/beam_PostCommit_Java_Nexmark_Dataflow_V2/2508/display/redirect?page=changes>

Changes:

[noreply] Add WatchFilePattern  (#25393)

[noreply] Support gauge metrics in portable mode (#25396)


------------------------------------------
[...truncated 53.69 KB...]
Installing collected packages: pip, setuptools, wheel
  Attempting uninstall: pip
    Found existing installation: pip 20.0.2
    Uninstalling pip-20.0.2:
      Successfully uninstalled pip-20.0.2
  Attempting uninstall: setuptools
    Found existing installation: setuptools 44.0.0
    Uninstalling setuptools-44.0.0:
      Successfully uninstalled setuptools-44.0.0
Successfully installed pip-23.0 setuptools-67.2.0 wheel-0.38.4
Collecting beautifulsoup4<5.0,>=4.9.0
  Using cached beautifulsoup4-4.11.2-py3-none-any.whl (129 kB)
Collecting pyyaml<6.0.0,>=3.12
  Using cached PyYAML-5.4.1-cp38-cp38-manylinux1_x86_64.whl (662 kB)
Collecting tenacity<6.0,>=5.0.2
  Using cached tenacity-5.1.5-py2.py3-none-any.whl (34 kB)
Collecting soupsieve>1.2
  Using cached soupsieve-2.3.2.post1-py3-none-any.whl (37 kB)
Collecting six>=1.9.0
  Using cached six-1.16.0-py2.py3-none-any.whl (11 kB)
Installing collected packages: soupsieve, six, pyyaml, tenacity, beautifulsoup4
Successfully installed beautifulsoup4-4.11.2 pyyaml-5.4.1 six-1.16.0 soupsieve-2.3.2.post1 tenacity-5.1.5
Executing python <https://ci-beam.apache.org/job/beam_PostCommit_Java_Nexmark_Dataflow_V2/ws/src/sdks/java/container/license_scripts/pull_licenses_java.py> --license_index=<https://ci-beam.apache.org/job/beam_PostCommit_Java_Nexmark_Dataflow_V2/ws/src/sdks/java/container/build/reports/dependency-license/index.json>        --output_dir=<https://ci-beam.apache.org/job/beam_PostCommit_Java_Nexmark_Dataflow_V2/ws/src/sdks/java/container/build/target/java_third_party_licenses>        --dep_url_yaml=<https://ci-beam.apache.org/job/beam_PostCommit_Java_Nexmark_Dataflow_V2/ws/src/sdks/java/container/license_scripts/dep_urls_java.yaml>        --manual_license_path=<https://ci-beam.apache.org/job/beam_PostCommit_Java_Nexmark_Dataflow_V2/ws/src/sdks/java/container/license_scripts/manual_licenses>
INFO:root:Pulling license for 124 dependencies using 16 threads.
INFO:root:Replaced local file URL with file://<https://ci-beam.apache.org/job/beam_PostCommit_Java_Nexmark_Dataflow_V2/ws/src/sdks/java/container/license_scripts/manual_licenses/xz/COPYING> for xz-1.5
Traceback (most recent call last):
  File "<https://ci-beam.apache.org/job/beam_PostCommit_Java_Nexmark_Dataflow_V2/ws/src/sdks/java/container/license_scripts/pull_licenses_java.py",> line 58, in pull_from_url
    url_read = urlopen(Request(url, headers={
  File "/usr/lib/python3.8/urllib/request.py", line 222, in urlopen
    return opener.open(url, data, timeout)
  File "/usr/lib/python3.8/urllib/request.py", line 531, in open
    response = meth(req, response)
  File "/usr/lib/python3.8/urllib/request.py", line 640, in http_response
    response = self.parent.error(
  File "/usr/lib/python3.8/urllib/request.py", line 569, in error
    return self._call_chain(*args)
  File "/usr/lib/python3.8/urllib/request.py", line 502, in _call_chain
    result = func(*args)
  File "/usr/lib/python3.8/urllib/request.py", line 649, in http_error_default
    raise HTTPError(req.full_url, code, msg, hdrs, fp)
urllib.error.HTTPError: HTTP Error 404: Not Found
ERROR:root:Invalid url for zstd-jni-1.5.2-5: https://opensource.org/licenses/BSD-2-Clause. Retrying...
Traceback (most recent call last):
  File "<https://ci-beam.apache.org/job/beam_PostCommit_Java_Nexmark_Dataflow_V2/ws/src/sdks/java/container/license_scripts/pull_licenses_java.py",> line 58, in pull_from_url
    url_read = urlopen(Request(url, headers={
  File "/usr/lib/python3.8/urllib/request.py", line 222, in urlopen
    return opener.open(url, data, timeout)
  File "/usr/lib/python3.8/urllib/request.py", line 531, in open
    response = meth(req, response)
  File "/usr/lib/python3.8/urllib/request.py", line 640, in http_response
    response = self.parent.error(
  File "/usr/lib/python3.8/urllib/request.py", line 569, in error
    return self._call_chain(*args)
  File "/usr/lib/python3.8/urllib/request.py", line 502, in _call_chain
    result = func(*args)
  File "/usr/lib/python3.8/urllib/request.py", line 649, in http_error_default
    raise HTTPError(req.full_url, code, msg, hdrs, fp)
urllib.error.HTTPError: HTTP Error 404: Not Found
ERROR:root:Invalid url for zstd-jni-1.5.2-5: https://opensource.org/licenses/BSD-2-Clause. Retrying...
Traceback (most recent call last):
  File "<https://ci-beam.apache.org/job/beam_PostCommit_Java_Nexmark_Dataflow_V2/ws/src/sdks/java/container/license_scripts/pull_licenses_java.py",> line 58, in pull_from_url
    url_read = urlopen(Request(url, headers={
  File "/usr/lib/python3.8/urllib/request.py", line 222, in urlopen
    return opener.open(url, data, timeout)
  File "/usr/lib/python3.8/urllib/request.py", line 531, in open
    response = meth(req, response)
  File "/usr/lib/python3.8/urllib/request.py", line 640, in http_response
    response = self.parent.error(
  File "/usr/lib/python3.8/urllib/request.py", line 569, in error
    return self._call_chain(*args)
  File "/usr/lib/python3.8/urllib/request.py", line 502, in _call_chain
    result = func(*args)
  File "/usr/lib/python3.8/urllib/request.py", line 649, in http_error_default
    raise HTTPError(req.full_url, code, msg, hdrs, fp)
urllib.error.HTTPError: HTTP Error 404: Not Found
ERROR:root:Invalid url for zstd-jni-1.5.2-5: https://opensource.org/licenses/BSD-2-Clause. Retrying...
Traceback (most recent call last):
  File "<https://ci-beam.apache.org/job/beam_PostCommit_Java_Nexmark_Dataflow_V2/ws/src/sdks/java/container/license_scripts/pull_licenses_java.py",> line 58, in pull_from_url
    url_read = urlopen(Request(url, headers={
  File "/usr/lib/python3.8/urllib/request.py", line 222, in urlopen
    return opener.open(url, data, timeout)
  File "/usr/lib/python3.8/urllib/request.py", line 531, in open
    response = meth(req, response)
  File "/usr/lib/python3.8/urllib/request.py", line 640, in http_response
    response = self.parent.error(
  File "/usr/lib/python3.8/urllib/request.py", line 569, in error
    return self._call_chain(*args)
  File "/usr/lib/python3.8/urllib/request.py", line 502, in _call_chain
    result = func(*args)
  File "/usr/lib/python3.8/urllib/request.py", line 649, in http_error_default
    raise HTTPError(req.full_url, code, msg, hdrs, fp)
urllib.error.HTTPError: HTTP Error 404: Not Found
ERROR:root:Invalid url for zstd-jni-1.5.2-5: https://opensource.org/licenses/BSD-2-Clause. Retrying...

> Task :sdks:java:extensions:sql:compileJava

> Task :sdks:java:container:pullLicenses FAILED
Traceback (most recent call last):
  File "<https://ci-beam.apache.org/job/beam_PostCommit_Java_Nexmark_Dataflow_V2/ws/src/sdks/java/container/license_scripts/pull_licenses_java.py",> line 58, in pull_from_url
    url_read = urlopen(Request(url, headers={
  File "/usr/lib/python3.8/urllib/request.py", line 222, in urlopen
    return opener.open(url, data, timeout)
  File "/usr/lib/python3.8/urllib/request.py", line 531, in open
    response = meth(req, response)
  File "/usr/lib/python3.8/urllib/request.py", line 640, in http_response
    response = self.parent.error(
  File "/usr/lib/python3.8/urllib/request.py", line 569, in error
    return self._call_chain(*args)
  File "/usr/lib/python3.8/urllib/request.py", line 502, in _call_chain
    result = func(*args)
  File "/usr/lib/python3.8/urllib/request.py", line 649, in http_error_default
    raise HTTPError(req.full_url, code, msg, hdrs, fp)
urllib.error.HTTPError: HTTP Error 404: Not Found
ERROR:root:Invalid url for zstd-jni-1.5.2-5: https://opensource.org/licenses/BSD-2-Clause. Retrying...
Traceback (most recent call last):
  File "<https://ci-beam.apache.org/job/beam_PostCommit_Java_Nexmark_Dataflow_V2/ws/src/sdks/java/container/license_scripts/pull_licenses_java.py",> line 58, in pull_from_url
    url_read = urlopen(Request(url, headers={
  File "/usr/lib/python3.8/urllib/request.py", line 222, in urlopen
    return opener.open(url, data, timeout)
  File "/usr/lib/python3.8/urllib/request.py", line 531, in open
    response = meth(req, response)
  File "/usr/lib/python3.8/urllib/request.py", line 640, in http_response
    response = self.parent.error(
  File "/usr/lib/python3.8/urllib/request.py", line 569, in error
    return self._call_chain(*args)
  File "/usr/lib/python3.8/urllib/request.py", line 502, in _call_chain
    result = func(*args)
  File "/usr/lib/python3.8/urllib/request.py", line 649, in http_error_default
    raise HTTPError(req.full_url, code, msg, hdrs, fp)
urllib.error.HTTPError: HTTP Error 404: Not Found
ERROR:root:Invalid url for zstd-jni-1.5.2-5: https://opensource.org/licenses/BSD-2-Clause. Retrying...
Traceback (most recent call last):
  File "<https://ci-beam.apache.org/job/beam_PostCommit_Java_Nexmark_Dataflow_V2/ws/src/sdks/java/container/license_scripts/pull_licenses_java.py",> line 58, in pull_from_url
    url_read = urlopen(Request(url, headers={
  File "/usr/lib/python3.8/urllib/request.py", line 222, in urlopen
    return opener.open(url, data, timeout)
  File "/usr/lib/python3.8/urllib/request.py", line 531, in open
    response = meth(req, response)
  File "/usr/lib/python3.8/urllib/request.py", line 640, in http_response
    response = self.parent.error(
  File "/usr/lib/python3.8/urllib/request.py", line 569, in error
    return self._call_chain(*args)
  File "/usr/lib/python3.8/urllib/request.py", line 502, in _call_chain
    result = func(*args)
  File "/usr/lib/python3.8/urllib/request.py", line 649, in http_error_default
    raise HTTPError(req.full_url, code, msg, hdrs, fp)
urllib.error.HTTPError: HTTP Error 404: Not Found
ERROR:root:Invalid url for zstd-jni-1.5.2-5: https://opensource.org/licenses/BSD-2-Clause. Retrying...
Traceback (most recent call last):
  File "<https://ci-beam.apache.org/job/beam_PostCommit_Java_Nexmark_Dataflow_V2/ws/src/sdks/java/container/license_scripts/pull_licenses_java.py",> line 58, in pull_from_url
    url_read = urlopen(Request(url, headers={
  File "/usr/lib/python3.8/urllib/request.py", line 222, in urlopen
    return opener.open(url, data, timeout)
  File "/usr/lib/python3.8/urllib/request.py", line 531, in open
    response = meth(req, response)
  File "/usr/lib/python3.8/urllib/request.py", line 640, in http_response
    response = self.parent.error(
  File "/usr/lib/python3.8/urllib/request.py", line 569, in error
    return self._call_chain(*args)
  File "/usr/lib/python3.8/urllib/request.py", line 502, in _call_chain
    result = func(*args)
  File "/usr/lib/python3.8/urllib/request.py", line 649, in http_error_default
    raise HTTPError(req.full_url, code, msg, hdrs, fp)
urllib.error.HTTPError: HTTP Error 404: Not Found
ERROR:root:Invalid url for zstd-jni-1.5.2-5: https://opensource.org/licenses/BSD-2-Clause. Retrying...
Traceback (most recent call last):
  File "<https://ci-beam.apache.org/job/beam_PostCommit_Java_Nexmark_Dataflow_V2/ws/src/sdks/java/container/license_scripts/pull_licenses_java.py",> line 58, in pull_from_url
    url_read = urlopen(Request(url, headers={
  File "/usr/lib/python3.8/urllib/request.py", line 222, in urlopen
    return opener.open(url, data, timeout)
  File "/usr/lib/python3.8/urllib/request.py", line 531, in open
    response = meth(req, response)
  File "/usr/lib/python3.8/urllib/request.py", line 640, in http_response
    response = self.parent.error(
  File "/usr/lib/python3.8/urllib/request.py", line 569, in error
    return self._call_chain(*args)
  File "/usr/lib/python3.8/urllib/request.py", line 502, in _call_chain
    result = func(*args)
  File "/usr/lib/python3.8/urllib/request.py", line 649, in http_error_default
    raise HTTPError(req.full_url, code, msg, hdrs, fp)
urllib.error.HTTPError: HTTP Error 404: Not Found
ERROR:root:Invalid url for zstd-jni-1.5.2-5: https://opensource.org/licenses/BSD-2-Clause after 9 retries.
ERROR:root:['zstd-jni-1.5.2-5']
ERROR:root:**************************************** Licenses were not able to be pulled automatically for some dependencies. Please search source code of the dependencies on the internet and add "license" and "notice" (if available) field to <https://ci-beam.apache.org/job/beam_PostCommit_Java_Nexmark_Dataflow_V2/ws/src/sdks/java/container/license_scripts/dep_urls_java.yaml> for each missing license. Dependency List: [zstd-jni-1.5.2-5]
INFO:root:pull_licenses_java.py failed. It took 44.161115 seconds with 16 threads.
Traceback (most recent call last):
  File "<https://ci-beam.apache.org/job/beam_PostCommit_Java_Nexmark_Dataflow_V2/ws/src/sdks/java/container/license_scripts/pull_licenses_java.py",> line 326, in <module>
    raise RuntimeError('{n} error(s) occurred.'.format(n=len(error_msg)),
RuntimeError: ('1 error(s) occurred.', ['**************************************** Licenses were not able to be pulled automatically for some dependencies. Please search source code of the dependencies on the internet and add "license" and "notice" (if available) field to <https://ci-beam.apache.org/job/beam_PostCommit_Java_Nexmark_Dataflow_V2/ws/src/sdks/java/container/license_scripts/dep_urls_java.yaml> for each missing license. Dependency List: [zstd-jni-1.5.2-5]'])

> Task :sdks:java:container:goPrepare UP-TO-DATE

> Task :sdks:java:container:goBuild
/home/jenkins/go/bin/go1.19.3 build -o ./build/target/linux_amd64/boot boot.go boot_test.go

> Task :sdks:java:container:java8:copySdkHarnessLauncher
Execution optimizations have been disabled for task ':sdks:java:container:java8:copySdkHarnessLauncher' to ensure correctness due to the following reasons:
  - Gradle detected a problem with the following location: '<https://ci-beam.apache.org/job/beam_PostCommit_Java_Nexmark_Dataflow_V2/ws/src/sdks/java/container/build/target'.> Reason: Task ':sdks:java:container:java8:copySdkHarnessLauncher' uses this output of task ':sdks:java:container:downloadCloudProfilerAgent' without declaring an explicit or implicit dependency. This can lead to incorrect results being produced, depending on what order the tasks are executed. Please refer to https://docs.gradle.org/7.5.1/userguide/validation_problems.html#implicit_dependency for more details about this problem.
  - Gradle detected a problem with the following location: '<https://ci-beam.apache.org/job/beam_PostCommit_Java_Nexmark_Dataflow_V2/ws/src/sdks/java/container/build/target'.> Reason: Task ':sdks:java:container:java8:copySdkHarnessLauncher' uses this output of task ':sdks:java:container:pullLicenses' without declaring an explicit or implicit dependency. This can lead to incorrect results being produced, depending on what order the tasks are executed. Please refer to https://docs.gradle.org/7.5.1/userguide/validation_problems.html#implicit_dependency for more details about this problem.

> Task :sdks:java:extensions:sql:compileJava
Note: Some input files use or override a deprecated API.
Note: Recompile with -Xlint:deprecation for details.
Note: Some input files use unchecked or unsafe operations.
Note: Recompile with -Xlint:unchecked for details.

> Task :sdks:java:extensions:sql:classes
> Task :sdks:java:extensions:sql:jar
> Task :sdks:java:extensions:sql:zetasql:compileJava FROM-CACHE
> Task :sdks:java:extensions:sql:zetasql:classes UP-TO-DATE
> Task :sdks:java:extensions:sql:zetasql:jar
> Task :sdks:java:testing:nexmark:compileJava
Note: Some input files use or override a deprecated API.
Note: Recompile with -Xlint:deprecation for details.
Note: Some input files use unchecked or unsafe operations.
Note: Recompile with -Xlint:unchecked for details.

> Task :sdks:java:testing:nexmark:classes
> Task :sdks:java:testing:nexmark:jar

FAILURE: Build failed with an exception.

* What went wrong:
Execution failed for task ':sdks:java:container:pullLicenses'.
> Process 'command './license_scripts/license_script.sh'' finished with non-zero exit value 1

* Try:
> Run with --stacktrace option to get the stack trace.
> Run with --info or --debug option to get more log output.

* Get more help at https://help.gradle.org

Deprecated Gradle features were used in this build, making it incompatible with Gradle 8.0.

You can use '--warning-mode all' to show the individual deprecation warnings and determine if they come from your own scripts or plugins.

See https://docs.gradle.org/7.5.1/userguide/command_line_interface.html#sec:command_line_warnings

Execution optimizations have been disabled for 1 invalid unit(s) of work during this build to ensure correctness.
Please consult deprecation warnings for more details.

BUILD FAILED in 3m 9s
131 actionable tasks: 88 executed, 39 from cache, 4 up-to-date

Publishing build scan...
https://gradle.com/s/y6uoajei7ghaa

Build step 'Invoke Gradle script' changed build result to FAILURE
Build step 'Invoke Gradle script' marked build as failure

---------------------------------------------------------------------
To unsubscribe, e-mail: builds-unsubscribe@beam.apache.org
For additional commands, e-mail: builds-help@beam.apache.org


Jenkins build is back to normal : beam_PostCommit_Java_Nexmark_Dataflow_V2 #2512

Posted by Apache Jenkins Server <je...@builds.apache.org>.
See <https://ci-beam.apache.org/job/beam_PostCommit_Java_Nexmark_Dataflow_V2/2512/display/redirect?page=changes>


---------------------------------------------------------------------
To unsubscribe, e-mail: builds-unsubscribe@beam.apache.org
For additional commands, e-mail: builds-help@beam.apache.org


Build failed in Jenkins: beam_PostCommit_Java_Nexmark_Dataflow_V2 #2511

Posted by Apache Jenkins Server <je...@builds.apache.org>.
See <https://ci-beam.apache.org/job/beam_PostCommit_Java_Nexmark_Dataflow_V2/2511/display/redirect>

Changes:


------------------------------------------
[...truncated 53.94 KB...]
Traceback (most recent call last):
  File "<https://ci-beam.apache.org/job/beam_PostCommit_Java_Nexmark_Dataflow_V2/ws/src/sdks/java/container/license_scripts/pull_licenses_java.py",> line 58, in pull_from_url
    url_read = urlopen(Request(url, headers={
  File "/usr/lib/python3.8/urllib/request.py", line 222, in urlopen
    return opener.open(url, data, timeout)
  File "/usr/lib/python3.8/urllib/request.py", line 531, in open
    response = meth(req, response)
  File "/usr/lib/python3.8/urllib/request.py", line 640, in http_response
    response = self.parent.error(
  File "/usr/lib/python3.8/urllib/request.py", line 569, in error
    return self._call_chain(*args)
  File "/usr/lib/python3.8/urllib/request.py", line 502, in _call_chain
    result = func(*args)
  File "/usr/lib/python3.8/urllib/request.py", line 649, in http_error_default
    raise HTTPError(req.full_url, code, msg, hdrs, fp)
urllib.error.HTTPError: HTTP Error 404: Not Found
ERROR:root:Invalid url for zstd-jni-1.5.2-5: https://opensource.org/licenses/BSD-2-Clause. Retrying...
Traceback (most recent call last):
  File "<https://ci-beam.apache.org/job/beam_PostCommit_Java_Nexmark_Dataflow_V2/ws/src/sdks/java/container/license_scripts/pull_licenses_java.py",> line 58, in pull_from_url
    url_read = urlopen(Request(url, headers={
  File "/usr/lib/python3.8/urllib/request.py", line 222, in urlopen
    return opener.open(url, data, timeout)
  File "/usr/lib/python3.8/urllib/request.py", line 531, in open
    response = meth(req, response)
  File "/usr/lib/python3.8/urllib/request.py", line 640, in http_response
    response = self.parent.error(
  File "/usr/lib/python3.8/urllib/request.py", line 569, in error
    return self._call_chain(*args)
  File "/usr/lib/python3.8/urllib/request.py", line 502, in _call_chain
    result = func(*args)
  File "/usr/lib/python3.8/urllib/request.py", line 649, in http_error_default
    raise HTTPError(req.full_url, code, msg, hdrs, fp)
urllib.error.HTTPError: HTTP Error 404: Not Found
ERROR:root:Invalid url for zstd-jni-1.5.2-5: https://opensource.org/licenses/BSD-2-Clause. Retrying...
Traceback (most recent call last):
  File "<https://ci-beam.apache.org/job/beam_PostCommit_Java_Nexmark_Dataflow_V2/ws/src/sdks/java/container/license_scripts/pull_licenses_java.py",> line 58, in pull_from_url
    url_read = urlopen(Request(url, headers={
  File "/usr/lib/python3.8/urllib/request.py", line 222, in urlopen
    return opener.open(url, data, timeout)
  File "/usr/lib/python3.8/urllib/request.py", line 531, in open
    response = meth(req, response)
  File "/usr/lib/python3.8/urllib/request.py", line 640, in http_response
    response = self.parent.error(
  File "/usr/lib/python3.8/urllib/request.py", line 569, in error
    return self._call_chain(*args)
  File "/usr/lib/python3.8/urllib/request.py", line 502, in _call_chain
    result = func(*args)
  File "/usr/lib/python3.8/urllib/request.py", line 649, in http_error_default
    raise HTTPError(req.full_url, code, msg, hdrs, fp)
urllib.error.HTTPError: HTTP Error 404: Not Found
ERROR:root:Invalid url for zstd-jni-1.5.2-5: https://opensource.org/licenses/BSD-2-Clause. Retrying...
Traceback (most recent call last):
  File "<https://ci-beam.apache.org/job/beam_PostCommit_Java_Nexmark_Dataflow_V2/ws/src/sdks/java/container/license_scripts/pull_licenses_java.py",> line 58, in pull_from_url
    url_read = urlopen(Request(url, headers={
  File "/usr/lib/python3.8/urllib/request.py", line 222, in urlopen
    return opener.open(url, data, timeout)
  File "/usr/lib/python3.8/urllib/request.py", line 531, in open
    response = meth(req, response)
  File "/usr/lib/python3.8/urllib/request.py", line 640, in http_response
    response = self.parent.error(
  File "/usr/lib/python3.8/urllib/request.py", line 569, in error
    return self._call_chain(*args)
  File "/usr/lib/python3.8/urllib/request.py", line 502, in _call_chain
    result = func(*args)
  File "/usr/lib/python3.8/urllib/request.py", line 649, in http_error_default
    raise HTTPError(req.full_url, code, msg, hdrs, fp)
urllib.error.HTTPError: HTTP Error 404: Not Found
ERROR:root:Invalid url for zstd-jni-1.5.2-5: https://opensource.org/licenses/BSD-2-Clause. Retrying...
Traceback (most recent call last):
  File "<https://ci-beam.apache.org/job/beam_PostCommit_Java_Nexmark_Dataflow_V2/ws/src/sdks/java/container/license_scripts/pull_licenses_java.py",> line 58, in pull_from_url
    url_read = urlopen(Request(url, headers={
  File "/usr/lib/python3.8/urllib/request.py", line 222, in urlopen
    return opener.open(url, data, timeout)
  File "/usr/lib/python3.8/urllib/request.py", line 531, in open
    response = meth(req, response)
  File "/usr/lib/python3.8/urllib/request.py", line 640, in http_response
    response = self.parent.error(
  File "/usr/lib/python3.8/urllib/request.py", line 569, in error
    return self._call_chain(*args)
  File "/usr/lib/python3.8/urllib/request.py", line 502, in _call_chain
    result = func(*args)
  File "/usr/lib/python3.8/urllib/request.py", line 649, in http_error_default
    raise HTTPError(req.full_url, code, msg, hdrs, fp)
urllib.error.HTTPError: HTTP Error 404: Not Found
ERROR:root:Invalid url for zstd-jni-1.5.2-5: https://opensource.org/licenses/BSD-2-Clause. Retrying...

> Task :sdks:java:testing:nexmark:compileJava
Note: Some input files use or override a deprecated API.
Note: Recompile with -Xlint:deprecation for details.
Note: Some input files use unchecked or unsafe operations.
Note: Recompile with -Xlint:unchecked for details.

> Task :sdks:java:testing:nexmark:classes
> Task :sdks:java:testing:nexmark:jar

> Task :sdks:java:container:pullLicenses
Traceback (most recent call last):
  File "<https://ci-beam.apache.org/job/beam_PostCommit_Java_Nexmark_Dataflow_V2/ws/src/sdks/java/container/license_scripts/pull_licenses_java.py",> line 58, in pull_from_url
    url_read = urlopen(Request(url, headers={
  File "/usr/lib/python3.8/urllib/request.py", line 222, in urlopen
    return opener.open(url, data, timeout)
  File "/usr/lib/python3.8/urllib/request.py", line 531, in open
    response = meth(req, response)
  File "/usr/lib/python3.8/urllib/request.py", line 640, in http_response
    response = self.parent.error(
  File "/usr/lib/python3.8/urllib/request.py", line 569, in error
    return self._call_chain(*args)
  File "/usr/lib/python3.8/urllib/request.py", line 502, in _call_chain
    result = func(*args)
  File "/usr/lib/python3.8/urllib/request.py", line 649, in http_error_default
    raise HTTPError(req.full_url, code, msg, hdrs, fp)
urllib.error.HTTPError: HTTP Error 404: Not Found
ERROR:root:Invalid url for zstd-jni-1.5.2-5: https://opensource.org/licenses/BSD-2-Clause. Retrying...
Traceback (most recent call last):
  File "<https://ci-beam.apache.org/job/beam_PostCommit_Java_Nexmark_Dataflow_V2/ws/src/sdks/java/container/license_scripts/pull_licenses_java.py",> line 58, in pull_from_url
    url_read = urlopen(Request(url, headers={
  File "/usr/lib/python3.8/urllib/request.py", line 222, in urlopen
    return opener.open(url, data, timeout)
  File "/usr/lib/python3.8/urllib/request.py", line 531, in open
    response = meth(req, response)
  File "/usr/lib/python3.8/urllib/request.py", line 640, in http_response
    response = self.parent.error(
  File "/usr/lib/python3.8/urllib/request.py", line 569, in error
    return self._call_chain(*args)
  File "/usr/lib/python3.8/urllib/request.py", line 502, in _call_chain
    result = func(*args)
  File "/usr/lib/python3.8/urllib/request.py", line 649, in http_error_default
    raise HTTPError(req.full_url, code, msg, hdrs, fp)
urllib.error.HTTPError: HTTP Error 404: Not Found
ERROR:root:Invalid url for zstd-jni-1.5.2-5: https://opensource.org/licenses/BSD-2-Clause. Retrying...
Traceback (most recent call last):
  File "<https://ci-beam.apache.org/job/beam_PostCommit_Java_Nexmark_Dataflow_V2/ws/src/sdks/java/container/license_scripts/pull_licenses_java.py",> line 58, in pull_from_url
    url_read = urlopen(Request(url, headers={
  File "/usr/lib/python3.8/urllib/request.py", line 222, in urlopen
    return opener.open(url, data, timeout)
  File "/usr/lib/python3.8/urllib/request.py", line 531, in open
    response = meth(req, response)
  File "/usr/lib/python3.8/urllib/request.py", line 640, in http_response
    response = self.parent.error(
  File "/usr/lib/python3.8/urllib/request.py", line 569, in error
    return self._call_chain(*args)
  File "/usr/lib/python3.8/urllib/request.py", line 502, in _call_chain
    result = func(*args)
  File "/usr/lib/python3.8/urllib/request.py", line 649, in http_error_default
    raise HTTPError(req.full_url, code, msg, hdrs, fp)
urllib.error.HTTPError: HTTP Error 404: Not Found
ERROR:root:Invalid url for zstd-jni-1.5.2-5: https://opensource.org/licenses/BSD-2-Clause. Retrying...
Traceback (most recent call last):
  File "<https://ci-beam.apache.org/job/beam_PostCommit_Java_Nexmark_Dataflow_V2/ws/src/sdks/java/container/license_scripts/pull_licenses_java.py",> line 58, in pull_from_url
    url_read = urlopen(Request(url, headers={
  File "/usr/lib/python3.8/urllib/request.py", line 222, in urlopen
    return opener.open(url, data, timeout)
  File "/usr/lib/python3.8/urllib/request.py", line 531, in open
    response = meth(req, response)
  File "/usr/lib/python3.8/urllib/request.py", line 640, in http_response
    response = self.parent.error(
  File "/usr/lib/python3.8/urllib/request.py", line 569, in error
    return self._call_chain(*args)
  File "/usr/lib/python3.8/urllib/request.py", line 502, in _call_chain
    result = func(*args)
  File "/usr/lib/python3.8/urllib/request.py", line 649, in http_error_default
    raise HTTPError(req.full_url, code, msg, hdrs, fp)
urllib.error.HTTPError: HTTP Error 404: Not Found
ERROR:root:Invalid url for zstd-jni-1.5.2-5: https://opensource.org/licenses/BSD-2-Clause after 9 retries.
ERROR:root:['zstd-jni-1.5.2-5']
ERROR:root:**************************************** Licenses were not able to be pulled automatically for some dependencies. Please search source code of the dependencies on the internet and add "license" and "notice" (if available) field to <https://ci-beam.apache.org/job/beam_PostCommit_Java_Nexmark_Dataflow_V2/ws/src/sdks/java/container/license_scripts/dep_urls_java.yaml> for each missing license. Dependency List: [zstd-jni-1.5.2-5]
INFO:root:pull_licenses_java.py failed. It took 43.953996 seconds with 16 threads.
Traceback (most recent call last):
  File "<https://ci-beam.apache.org/job/beam_PostCommit_Java_Nexmark_Dataflow_V2/ws/src/sdks/java/container/license_scripts/pull_licenses_java.py",> line 326, in <module>
    raise RuntimeError('{n} error(s) occurred.'.format(n=len(error_msg)),
RuntimeError: ('1 error(s) occurred.', ['**************************************** Licenses were not able to be pulled automatically for some dependencies. Please search source code of the dependencies on the internet and add "license" and "notice" (if available) field to <https://ci-beam.apache.org/job/beam_PostCommit_Java_Nexmark_Dataflow_V2/ws/src/sdks/java/container/license_scripts/dep_urls_java.yaml> for each missing license. Dependency List: [zstd-jni-1.5.2-5]'])

> Task :sdks:java:container:pullLicenses FAILED
> Task :sdks:java:container:goPrepare UP-TO-DATE

> Task :sdks:java:container:goBuild
/home/jenkins/go/bin/go1.19.3 build -o ./build/target/linux_amd64/boot boot.go boot_test.go

> Task :sdks:java:container:java8:copySdkHarnessLauncher
Execution optimizations have been disabled for task ':sdks:java:container:java8:copySdkHarnessLauncher' to ensure correctness due to the following reasons:
  - Gradle detected a problem with the following location: '<https://ci-beam.apache.org/job/beam_PostCommit_Java_Nexmark_Dataflow_V2/ws/src/sdks/java/container/build/target'.> Reason: Task ':sdks:java:container:java8:copySdkHarnessLauncher' uses this output of task ':sdks:java:container:downloadCloudProfilerAgent' without declaring an explicit or implicit dependency. This can lead to incorrect results being produced, depending on what order the tasks are executed. Please refer to https://docs.gradle.org/7.5.1/userguide/validation_problems.html#implicit_dependency for more details about this problem.
  - Gradle detected a problem with the following location: '<https://ci-beam.apache.org/job/beam_PostCommit_Java_Nexmark_Dataflow_V2/ws/src/sdks/java/container/build/target'.> Reason: Task ':sdks:java:container:java8:copySdkHarnessLauncher' uses this output of task ':sdks:java:container:pullLicenses' without declaring an explicit or implicit dependency. This can lead to incorrect results being produced, depending on what order the tasks are executed. Please refer to https://docs.gradle.org/7.5.1/userguide/validation_problems.html#implicit_dependency for more details about this problem.

> Task :release:go-licenses:java:dockerRun
go: downloading github.com/golang/protobuf v1.5.2
go: downloading google.golang.org/grpc v1.51.0
go: downloading google.golang.org/protobuf v1.28.1
go: downloading golang.org/x/sys v0.2.0
go: downloading golang.org/x/net v0.2.0
go: downloading google.golang.org/genproto v0.0.0-20221118155620-16455021b5e6
go: downloading golang.org/x/text v0.4.0
go: added github.com/apache/beam/sdks/v2 v2.44.0
go: added github.com/golang/protobuf v1.5.2
go: added golang.org/x/net v0.2.0
go: added golang.org/x/sys v0.2.0
go: added golang.org/x/text v0.4.0
go: added google.golang.org/genproto v0.0.0-20221118155620-16455021b5e6
go: added google.golang.org/grpc v1.51.0
go: added google.golang.org/protobuf v1.28.1
+ go-licenses save github.com/apache/beam/sdks/v2/java/container --save_path=/output/licenses
W0214 14:34:00.123270      36 library.go:101] "golang.org/x/sys/unix" contains non-Go code that can't be inspected for further dependencies:
/go/pkg/mod/golang.org/x/sys@v0.2.0/unix/asm_linux_amd64.s
+ go-licenses csv github.com/apache/beam/sdks/v2/java/container
+ tee /output/licenses/list.csv
W0214 14:34:04.069781      84 library.go:101] "golang.org/x/sys/unix" contains non-Go code that can't be inspected for further dependencies:
/go/pkg/mod/golang.org/x/sys@v0.2.0/unix/asm_linux_amd64.s
github.com/apache/beam/sdks/v2/go/pkg/beam,https://github.com/apache/beam/blob/sdks/v2.44.0/sdks/go/README.md,Apache-2.0
github.com/apache/beam/sdks/v2/java/container,https://github.com/apache/beam/blob/sdks/v2.44.0/sdks/LICENSE,Apache-2.0
github.com/golang/protobuf,https://github.com/golang/protobuf/blob/v1.5.2/LICENSE,BSD-3-Clause
golang.org/x/net,https://cs.opensource.google/go/x/net/+/v0.2.0:LICENSE,BSD-3-Clause
golang.org/x/sys/unix,https://cs.opensource.google/go/x/sys/+/v0.2.0:LICENSE,BSD-3-Clause
golang.org/x/text,https://cs.opensource.google/go/x/text/+/v0.4.0:LICENSE,BSD-3-Clause
google.golang.org/genproto/googleapis/rpc/status,https://github.com/googleapis/go-genproto/blob/16455021b5e6/LICENSE,Apache-2.0
google.golang.org/grpc,https://github.com/grpc/grpc-go/blob/v1.51.0/LICENSE,Apache-2.0
google.golang.org/protobuf,https://github.com/protocolbuffers/protobuf-go/blob/v1.28.1/LICENSE,BSD-3-Clause
+ chmod -R a+w /output/licenses

> Task :release:go-licenses:java:createLicenses
> Task :sdks:java:container:java8:copyGolangLicenses

FAILURE: Build failed with an exception.

* What went wrong:
Execution failed for task ':sdks:java:container:pullLicenses'.
> Process 'command './license_scripts/license_script.sh'' finished with non-zero exit value 1

* Try:
> Run with --stacktrace option to get the stack trace.
> Run with --info or --debug option to get more log output.

* Get more help at https://help.gradle.org

Deprecated Gradle features were used in this build, making it incompatible with Gradle 8.0.

You can use '--warning-mode all' to show the individual deprecation warnings and determine if they come from your own scripts or plugins.

See https://docs.gradle.org/7.5.1/userguide/command_line_interface.html#sec:command_line_warnings

Execution optimizations have been disabled for 1 invalid unit(s) of work during this build to ensure correctness.
Please consult deprecation warnings for more details.

BUILD FAILED in 1m 38s
131 actionable tasks: 87 executed, 40 from cache, 4 up-to-date

Publishing build scan...
https://gradle.com/s/mrckwu2vvzei4

Build step 'Invoke Gradle script' changed build result to FAILURE
Build step 'Invoke Gradle script' marked build as failure

---------------------------------------------------------------------
To unsubscribe, e-mail: builds-unsubscribe@beam.apache.org
For additional commands, e-mail: builds-help@beam.apache.org


Build failed in Jenkins: beam_PostCommit_Java_Nexmark_Dataflow_V2 #2510

Posted by Apache Jenkins Server <je...@builds.apache.org>.
See <https://ci-beam.apache.org/job/beam_PostCommit_Java_Nexmark_Dataflow_V2/2510/display/redirect?page=changes>

Changes:

[noreply] Remove python 3.6 references (#25445)


------------------------------------------
[...truncated 53.46 KB...]
Traceback (most recent call last):
  File "<https://ci-beam.apache.org/job/beam_PostCommit_Java_Nexmark_Dataflow_V2/ws/src/sdks/java/container/license_scripts/pull_licenses_java.py",> line 58, in pull_from_url
    url_read = urlopen(Request(url, headers={
  File "/usr/lib/python3.8/urllib/request.py", line 222, in urlopen
    return opener.open(url, data, timeout)
  File "/usr/lib/python3.8/urllib/request.py", line 531, in open
    response = meth(req, response)
  File "/usr/lib/python3.8/urllib/request.py", line 640, in http_response
    response = self.parent.error(
  File "/usr/lib/python3.8/urllib/request.py", line 569, in error
    return self._call_chain(*args)
  File "/usr/lib/python3.8/urllib/request.py", line 502, in _call_chain
    result = func(*args)
  File "/usr/lib/python3.8/urllib/request.py", line 649, in http_error_default
    raise HTTPError(req.full_url, code, msg, hdrs, fp)
urllib.error.HTTPError: HTTP Error 404: Not Found
ERROR:root:Invalid url for zstd-jni-1.5.2-5: https://opensource.org/licenses/BSD-2-Clause. Retrying...
Traceback (most recent call last):
  File "<https://ci-beam.apache.org/job/beam_PostCommit_Java_Nexmark_Dataflow_V2/ws/src/sdks/java/container/license_scripts/pull_licenses_java.py",> line 58, in pull_from_url
    url_read = urlopen(Request(url, headers={
  File "/usr/lib/python3.8/urllib/request.py", line 222, in urlopen
    return opener.open(url, data, timeout)
  File "/usr/lib/python3.8/urllib/request.py", line 531, in open
    response = meth(req, response)
  File "/usr/lib/python3.8/urllib/request.py", line 640, in http_response
    response = self.parent.error(
  File "/usr/lib/python3.8/urllib/request.py", line 569, in error
    return self._call_chain(*args)
  File "/usr/lib/python3.8/urllib/request.py", line 502, in _call_chain
    result = func(*args)
  File "/usr/lib/python3.8/urllib/request.py", line 649, in http_error_default
    raise HTTPError(req.full_url, code, msg, hdrs, fp)
urllib.error.HTTPError: HTTP Error 404: Not Found
ERROR:root:Invalid url for zstd-jni-1.5.2-5: https://opensource.org/licenses/BSD-2-Clause. Retrying...
Traceback (most recent call last):
  File "<https://ci-beam.apache.org/job/beam_PostCommit_Java_Nexmark_Dataflow_V2/ws/src/sdks/java/container/license_scripts/pull_licenses_java.py",> line 58, in pull_from_url
    url_read = urlopen(Request(url, headers={
  File "/usr/lib/python3.8/urllib/request.py", line 222, in urlopen
    return opener.open(url, data, timeout)
  File "/usr/lib/python3.8/urllib/request.py", line 531, in open
    response = meth(req, response)
  File "/usr/lib/python3.8/urllib/request.py", line 640, in http_response
    response = self.parent.error(
  File "/usr/lib/python3.8/urllib/request.py", line 569, in error
    return self._call_chain(*args)
  File "/usr/lib/python3.8/urllib/request.py", line 502, in _call_chain
    result = func(*args)
  File "/usr/lib/python3.8/urllib/request.py", line 649, in http_error_default
    raise HTTPError(req.full_url, code, msg, hdrs, fp)
urllib.error.HTTPError: HTTP Error 404: Not Found
ERROR:root:Invalid url for zstd-jni-1.5.2-5: https://opensource.org/licenses/BSD-2-Clause. Retrying...
Traceback (most recent call last):
  File "<https://ci-beam.apache.org/job/beam_PostCommit_Java_Nexmark_Dataflow_V2/ws/src/sdks/java/container/license_scripts/pull_licenses_java.py",> line 58, in pull_from_url
    url_read = urlopen(Request(url, headers={
  File "/usr/lib/python3.8/urllib/request.py", line 222, in urlopen
    return opener.open(url, data, timeout)
  File "/usr/lib/python3.8/urllib/request.py", line 531, in open
    response = meth(req, response)
  File "/usr/lib/python3.8/urllib/request.py", line 640, in http_response
    response = self.parent.error(
  File "/usr/lib/python3.8/urllib/request.py", line 569, in error
    return self._call_chain(*args)
  File "/usr/lib/python3.8/urllib/request.py", line 502, in _call_chain
    result = func(*args)
  File "/usr/lib/python3.8/urllib/request.py", line 649, in http_error_default
    raise HTTPError(req.full_url, code, msg, hdrs, fp)
urllib.error.HTTPError: HTTP Error 404: Not Found
ERROR:root:Invalid url for zstd-jni-1.5.2-5: https://opensource.org/licenses/BSD-2-Clause. Retrying...
Traceback (most recent call last):
  File "<https://ci-beam.apache.org/job/beam_PostCommit_Java_Nexmark_Dataflow_V2/ws/src/sdks/java/container/license_scripts/pull_licenses_java.py",> line 58, in pull_from_url
    url_read = urlopen(Request(url, headers={
  File "/usr/lib/python3.8/urllib/request.py", line 222, in urlopen
    return opener.open(url, data, timeout)
  File "/usr/lib/python3.8/urllib/request.py", line 531, in open
    response = meth(req, response)
  File "/usr/lib/python3.8/urllib/request.py", line 640, in http_response
    response = self.parent.error(
  File "/usr/lib/python3.8/urllib/request.py", line 569, in error
    return self._call_chain(*args)
  File "/usr/lib/python3.8/urllib/request.py", line 502, in _call_chain
    result = func(*args)
  File "/usr/lib/python3.8/urllib/request.py", line 649, in http_error_default
    raise HTTPError(req.full_url, code, msg, hdrs, fp)
urllib.error.HTTPError: HTTP Error 404: Not Found
ERROR:root:Invalid url for zstd-jni-1.5.2-5: https://opensource.org/licenses/BSD-2-Clause. Retrying...

> Task :sdks:java:testing:nexmark:compileJava
Note: Some input files use or override a deprecated API.
Note: Recompile with -Xlint:deprecation for details.
Note: Some input files use unchecked or unsafe operations.
Note: Recompile with -Xlint:unchecked for details.

> Task :sdks:java:testing:nexmark:classes
> Task :sdks:java:testing:nexmark:jar

> Task :sdks:java:container:pullLicenses
Traceback (most recent call last):
  File "<https://ci-beam.apache.org/job/beam_PostCommit_Java_Nexmark_Dataflow_V2/ws/src/sdks/java/container/license_scripts/pull_licenses_java.py",> line 58, in pull_from_url
    url_read = urlopen(Request(url, headers={
  File "/usr/lib/python3.8/urllib/request.py", line 222, in urlopen
    return opener.open(url, data, timeout)
  File "/usr/lib/python3.8/urllib/request.py", line 531, in open
    response = meth(req, response)
  File "/usr/lib/python3.8/urllib/request.py", line 640, in http_response
    response = self.parent.error(
  File "/usr/lib/python3.8/urllib/request.py", line 569, in error
    return self._call_chain(*args)
  File "/usr/lib/python3.8/urllib/request.py", line 502, in _call_chain
    result = func(*args)
  File "/usr/lib/python3.8/urllib/request.py", line 649, in http_error_default
    raise HTTPError(req.full_url, code, msg, hdrs, fp)
urllib.error.HTTPError: HTTP Error 404: Not Found
ERROR:root:Invalid url for zstd-jni-1.5.2-5: https://opensource.org/licenses/BSD-2-Clause. Retrying...
Traceback (most recent call last):
  File "<https://ci-beam.apache.org/job/beam_PostCommit_Java_Nexmark_Dataflow_V2/ws/src/sdks/java/container/license_scripts/pull_licenses_java.py",> line 58, in pull_from_url
    url_read = urlopen(Request(url, headers={
  File "/usr/lib/python3.8/urllib/request.py", line 222, in urlopen
    return opener.open(url, data, timeout)
  File "/usr/lib/python3.8/urllib/request.py", line 531, in open
    response = meth(req, response)
  File "/usr/lib/python3.8/urllib/request.py", line 640, in http_response
    response = self.parent.error(
  File "/usr/lib/python3.8/urllib/request.py", line 569, in error
    return self._call_chain(*args)
  File "/usr/lib/python3.8/urllib/request.py", line 502, in _call_chain
    result = func(*args)
  File "/usr/lib/python3.8/urllib/request.py", line 649, in http_error_default
    raise HTTPError(req.full_url, code, msg, hdrs, fp)
urllib.error.HTTPError: HTTP Error 404: Not Found
ERROR:root:Invalid url for zstd-jni-1.5.2-5: https://opensource.org/licenses/BSD-2-Clause. Retrying...
Traceback (most recent call last):
  File "<https://ci-beam.apache.org/job/beam_PostCommit_Java_Nexmark_Dataflow_V2/ws/src/sdks/java/container/license_scripts/pull_licenses_java.py",> line 58, in pull_from_url
    url_read = urlopen(Request(url, headers={
  File "/usr/lib/python3.8/urllib/request.py", line 222, in urlopen
    return opener.open(url, data, timeout)
  File "/usr/lib/python3.8/urllib/request.py", line 531, in open
    response = meth(req, response)
  File "/usr/lib/python3.8/urllib/request.py", line 640, in http_response
    response = self.parent.error(
  File "/usr/lib/python3.8/urllib/request.py", line 569, in error
    return self._call_chain(*args)
  File "/usr/lib/python3.8/urllib/request.py", line 502, in _call_chain
    result = func(*args)
  File "/usr/lib/python3.8/urllib/request.py", line 649, in http_error_default
    raise HTTPError(req.full_url, code, msg, hdrs, fp)
urllib.error.HTTPError: HTTP Error 404: Not Found
ERROR:root:Invalid url for zstd-jni-1.5.2-5: https://opensource.org/licenses/BSD-2-Clause. Retrying...
Traceback (most recent call last):
  File "<https://ci-beam.apache.org/job/beam_PostCommit_Java_Nexmark_Dataflow_V2/ws/src/sdks/java/container/license_scripts/pull_licenses_java.py",> line 58, in pull_from_url
    url_read = urlopen(Request(url, headers={
  File "/usr/lib/python3.8/urllib/request.py", line 222, in urlopen
    return opener.open(url, data, timeout)
  File "/usr/lib/python3.8/urllib/request.py", line 531, in open
    response = meth(req, response)
  File "/usr/lib/python3.8/urllib/request.py", line 640, in http_response
    response = self.parent.error(
  File "/usr/lib/python3.8/urllib/request.py", line 569, in error
    return self._call_chain(*args)
  File "/usr/lib/python3.8/urllib/request.py", line 502, in _call_chain
    result = func(*args)
  File "/usr/lib/python3.8/urllib/request.py", line 649, in http_error_default
    raise HTTPError(req.full_url, code, msg, hdrs, fp)
urllib.error.HTTPError: HTTP Error 404: Not Found
ERROR:root:Invalid url for zstd-jni-1.5.2-5: https://opensource.org/licenses/BSD-2-Clause after 9 retries.
ERROR:root:['zstd-jni-1.5.2-5']
ERROR:root:**************************************** Licenses were not able to be pulled automatically for some dependencies. Please search source code of the dependencies on the internet and add "license" and "notice" (if available) field to <https://ci-beam.apache.org/job/beam_PostCommit_Java_Nexmark_Dataflow_V2/ws/src/sdks/java/container/license_scripts/dep_urls_java.yaml> for each missing license. Dependency List: [zstd-jni-1.5.2-5]
INFO:root:pull_licenses_java.py failed. It took 43.482855 seconds with 16 threads.
Traceback (most recent call last):
  File "<https://ci-beam.apache.org/job/beam_PostCommit_Java_Nexmark_Dataflow_V2/ws/src/sdks/java/container/license_scripts/pull_licenses_java.py",> line 326, in <module>
    raise RuntimeError('{n} error(s) occurred.'.format(n=len(error_msg)),
RuntimeError: ('1 error(s) occurred.', ['**************************************** Licenses were not able to be pulled automatically for some dependencies. Please search source code of the dependencies on the internet and add "license" and "notice" (if available) field to <https://ci-beam.apache.org/job/beam_PostCommit_Java_Nexmark_Dataflow_V2/ws/src/sdks/java/container/license_scripts/dep_urls_java.yaml> for each missing license. Dependency List: [zstd-jni-1.5.2-5]'])

> Task :sdks:java:container:pullLicenses FAILED
> Task :sdks:java:container:goPrepare UP-TO-DATE

> Task :sdks:java:container:goBuild
/home/jenkins/go/bin/go1.19.3 build -o ./build/target/linux_amd64/boot boot.go boot_test.go

> Task :sdks:java:container:java8:copySdkHarnessLauncher
Execution optimizations have been disabled for task ':sdks:java:container:java8:copySdkHarnessLauncher' to ensure correctness due to the following reasons:
  - Gradle detected a problem with the following location: '<https://ci-beam.apache.org/job/beam_PostCommit_Java_Nexmark_Dataflow_V2/ws/src/sdks/java/container/build/target'.> Reason: Task ':sdks:java:container:java8:copySdkHarnessLauncher' uses this output of task ':sdks:java:container:downloadCloudProfilerAgent' without declaring an explicit or implicit dependency. This can lead to incorrect results being produced, depending on what order the tasks are executed. Please refer to https://docs.gradle.org/7.5.1/userguide/validation_problems.html#implicit_dependency for more details about this problem.
  - Gradle detected a problem with the following location: '<https://ci-beam.apache.org/job/beam_PostCommit_Java_Nexmark_Dataflow_V2/ws/src/sdks/java/container/build/target'.> Reason: Task ':sdks:java:container:java8:copySdkHarnessLauncher' uses this output of task ':sdks:java:container:pullLicenses' without declaring an explicit or implicit dependency. This can lead to incorrect results being produced, depending on what order the tasks are executed. Please refer to https://docs.gradle.org/7.5.1/userguide/validation_problems.html#implicit_dependency for more details about this problem.

> Task :release:go-licenses:java:dockerRun
go: downloading github.com/golang/protobuf v1.5.2
go: downloading golang.org/x/sys v0.2.0
go: downloading google.golang.org/grpc v1.51.0
go: downloading google.golang.org/protobuf v1.28.1
go: downloading golang.org/x/net v0.2.0
go: downloading google.golang.org/genproto v0.0.0-20221118155620-16455021b5e6
go: downloading golang.org/x/text v0.4.0
go: added github.com/apache/beam/sdks/v2 v2.44.0
go: added github.com/golang/protobuf v1.5.2
go: added golang.org/x/net v0.2.0
go: added golang.org/x/sys v0.2.0
go: added golang.org/x/text v0.4.0
go: added google.golang.org/genproto v0.0.0-20221118155620-16455021b5e6
go: added google.golang.org/grpc v1.51.0
go: added google.golang.org/protobuf v1.28.1
+ go-licenses save github.com/apache/beam/sdks/v2/java/container --save_path=/output/licenses
W0214 08:34:01.355577      38 library.go:101] "golang.org/x/sys/unix" contains non-Go code that can't be inspected for further dependencies:
/go/pkg/mod/golang.org/x/sys@v0.2.0/unix/asm_linux_amd64.s
+ go-licenses csv github.com/apache/beam/sdks/v2/java/container
+ tee /output/licenses/list.csv
W0214 08:34:05.382345      84 library.go:101] "golang.org/x/sys/unix" contains non-Go code that can't be inspected for further dependencies:
/go/pkg/mod/golang.org/x/sys@v0.2.0/unix/asm_linux_amd64.s
github.com/apache/beam/sdks/v2/go/pkg/beam,https://github.com/apache/beam/blob/sdks/v2.44.0/sdks/go/README.md,Apache-2.0
github.com/apache/beam/sdks/v2/java/container,https://github.com/apache/beam/blob/sdks/v2.44.0/sdks/LICENSE,Apache-2.0
github.com/golang/protobuf,https://github.com/golang/protobuf/blob/v1.5.2/LICENSE,BSD-3-Clause
golang.org/x/net,https://cs.opensource.google/go/x/net/+/v0.2.0:LICENSE,BSD-3-Clause
golang.org/x/sys/unix,https://cs.opensource.google/go/x/sys/+/v0.2.0:LICENSE,BSD-3-Clause
golang.org/x/text,https://cs.opensource.google/go/x/text/+/v0.4.0:LICENSE,BSD-3-Clause
google.golang.org/genproto/googleapis/rpc/status,https://github.com/googleapis/go-genproto/blob/16455021b5e6/LICENSE,Apache-2.0
google.golang.org/grpc,https://github.com/grpc/grpc-go/blob/v1.51.0/LICENSE,Apache-2.0
google.golang.org/protobuf,https://github.com/protocolbuffers/protobuf-go/blob/v1.28.1/LICENSE,BSD-3-Clause
+ chmod -R a+w /output/licenses

> Task :release:go-licenses:java:createLicenses
> Task :sdks:java:container:java8:copyGolangLicenses

FAILURE: Build failed with an exception.

* What went wrong:
Execution failed for task ':sdks:java:container:pullLicenses'.
> Process 'command './license_scripts/license_script.sh'' finished with non-zero exit value 1

* Try:
> Run with --stacktrace option to get the stack trace.
> Run with --info or --debug option to get more log output.

* Get more help at https://help.gradle.org

Deprecated Gradle features were used in this build, making it incompatible with Gradle 8.0.

You can use '--warning-mode all' to show the individual deprecation warnings and determine if they come from your own scripts or plugins.

See https://docs.gradle.org/7.5.1/userguide/command_line_interface.html#sec:command_line_warnings

Execution optimizations have been disabled for 1 invalid unit(s) of work during this build to ensure correctness.
Please consult deprecation warnings for more details.

BUILD FAILED in 1m 36s
131 actionable tasks: 87 executed, 40 from cache, 4 up-to-date

Publishing build scan...
https://gradle.com/s/flqxacwzz5qtg

Build step 'Invoke Gradle script' changed build result to FAILURE
Build step 'Invoke Gradle script' marked build as failure

---------------------------------------------------------------------
To unsubscribe, e-mail: builds-unsubscribe@beam.apache.org
For additional commands, e-mail: builds-help@beam.apache.org


Build failed in Jenkins: beam_PostCommit_Java_Nexmark_Dataflow_V2 #2509

Posted by Apache Jenkins Server <je...@builds.apache.org>.
See <https://ci-beam.apache.org/job/beam_PostCommit_Java_Nexmark_Dataflow_V2/2509/display/redirect?page=changes>

Changes:

[xqhu] Ignore flags for beam_sql magic

[xqhu] Raise the error when some functions are misused

[xqhu] change how to import

[noreply] Validate that GBK coders are always set correctly. (#25394)

[noreply] Fix tox error running hdfsIntegrationTest (#25446)

[noreply] Adding support for DLQ for ZetaSQL (#25426)


------------------------------------------
[...truncated 54.39 KB...]
  File "/usr/lib/python3.8/urllib/request.py", line 222, in urlopen
    return opener.open(url, data, timeout)
  File "/usr/lib/python3.8/urllib/request.py", line 531, in open
    response = meth(req, response)
  File "/usr/lib/python3.8/urllib/request.py", line 640, in http_response
    response = self.parent.error(
  File "/usr/lib/python3.8/urllib/request.py", line 569, in error
    return self._call_chain(*args)
  File "/usr/lib/python3.8/urllib/request.py", line 502, in _call_chain
    result = func(*args)
  File "/usr/lib/python3.8/urllib/request.py", line 649, in http_error_default
    raise HTTPError(req.full_url, code, msg, hdrs, fp)
urllib.error.HTTPError: HTTP Error 404: Not Found
ERROR:root:Invalid url for zstd-jni-1.5.2-5: https://opensource.org/licenses/BSD-2-Clause. Retrying...
INFO:root:Replaced local file URL with file://<https://ci-beam.apache.org/job/beam_PostCommit_Java_Nexmark_Dataflow_V2/ws/src/sdks/java/container/license_scripts/manual_licenses/xz/COPYING> for xz-1.5
Traceback (most recent call last):
  File "<https://ci-beam.apache.org/job/beam_PostCommit_Java_Nexmark_Dataflow_V2/ws/src/sdks/java/container/license_scripts/pull_licenses_java.py",> line 58, in pull_from_url
    url_read = urlopen(Request(url, headers={
  File "/usr/lib/python3.8/urllib/request.py", line 222, in urlopen
    return opener.open(url, data, timeout)
  File "/usr/lib/python3.8/urllib/request.py", line 531, in open
    response = meth(req, response)
  File "/usr/lib/python3.8/urllib/request.py", line 640, in http_response
    response = self.parent.error(
  File "/usr/lib/python3.8/urllib/request.py", line 569, in error
    return self._call_chain(*args)
  File "/usr/lib/python3.8/urllib/request.py", line 502, in _call_chain
    result = func(*args)
  File "/usr/lib/python3.8/urllib/request.py", line 649, in http_error_default
    raise HTTPError(req.full_url, code, msg, hdrs, fp)
urllib.error.HTTPError: HTTP Error 404: Not Found
ERROR:root:Invalid url for zstd-jni-1.5.2-5: https://opensource.org/licenses/BSD-2-Clause. Retrying...
Traceback (most recent call last):
  File "<https://ci-beam.apache.org/job/beam_PostCommit_Java_Nexmark_Dataflow_V2/ws/src/sdks/java/container/license_scripts/pull_licenses_java.py",> line 58, in pull_from_url
    url_read = urlopen(Request(url, headers={
  File "/usr/lib/python3.8/urllib/request.py", line 222, in urlopen
    return opener.open(url, data, timeout)
  File "/usr/lib/python3.8/urllib/request.py", line 531, in open
    response = meth(req, response)
  File "/usr/lib/python3.8/urllib/request.py", line 640, in http_response
    response = self.parent.error(
  File "/usr/lib/python3.8/urllib/request.py", line 569, in error
    return self._call_chain(*args)
  File "/usr/lib/python3.8/urllib/request.py", line 502, in _call_chain
    result = func(*args)
  File "/usr/lib/python3.8/urllib/request.py", line 649, in http_error_default
    raise HTTPError(req.full_url, code, msg, hdrs, fp)
urllib.error.HTTPError: HTTP Error 404: Not Found
ERROR:root:Invalid url for zstd-jni-1.5.2-5: https://opensource.org/licenses/BSD-2-Clause. Retrying...
Traceback (most recent call last):
  File "<https://ci-beam.apache.org/job/beam_PostCommit_Java_Nexmark_Dataflow_V2/ws/src/sdks/java/container/license_scripts/pull_licenses_java.py",> line 58, in pull_from_url
    url_read = urlopen(Request(url, headers={
  File "/usr/lib/python3.8/urllib/request.py", line 222, in urlopen
    return opener.open(url, data, timeout)
  File "/usr/lib/python3.8/urllib/request.py", line 531, in open
    response = meth(req, response)
  File "/usr/lib/python3.8/urllib/request.py", line 640, in http_response
    response = self.parent.error(
  File "/usr/lib/python3.8/urllib/request.py", line 569, in error
    return self._call_chain(*args)
  File "/usr/lib/python3.8/urllib/request.py", line 502, in _call_chain
    result = func(*args)
  File "/usr/lib/python3.8/urllib/request.py", line 649, in http_error_default
    raise HTTPError(req.full_url, code, msg, hdrs, fp)
urllib.error.HTTPError: HTTP Error 404: Not Found
ERROR:root:Invalid url for zstd-jni-1.5.2-5: https://opensource.org/licenses/BSD-2-Clause. Retrying...
Traceback (most recent call last):
  File "<https://ci-beam.apache.org/job/beam_PostCommit_Java_Nexmark_Dataflow_V2/ws/src/sdks/java/container/license_scripts/pull_licenses_java.py",> line 58, in pull_from_url
    url_read = urlopen(Request(url, headers={
  File "/usr/lib/python3.8/urllib/request.py", line 222, in urlopen
    return opener.open(url, data, timeout)
  File "/usr/lib/python3.8/urllib/request.py", line 531, in open
    response = meth(req, response)
  File "/usr/lib/python3.8/urllib/request.py", line 640, in http_response
    response = self.parent.error(
  File "/usr/lib/python3.8/urllib/request.py", line 569, in error
    return self._call_chain(*args)
  File "/usr/lib/python3.8/urllib/request.py", line 502, in _call_chain
    result = func(*args)
  File "/usr/lib/python3.8/urllib/request.py", line 649, in http_error_default
    raise HTTPError(req.full_url, code, msg, hdrs, fp)
urllib.error.HTTPError: HTTP Error 404: Not Found
ERROR:root:Invalid url for zstd-jni-1.5.2-5: https://opensource.org/licenses/BSD-2-Clause. Retrying...

> Task :sdks:java:testing:nexmark:compileJava
Note: Some input files use or override a deprecated API.
Note: Recompile with -Xlint:deprecation for details.
Note: Some input files use unchecked or unsafe operations.
Note: Recompile with -Xlint:unchecked for details.

> Task :sdks:java:testing:nexmark:classes
> Task :sdks:java:testing:nexmark:jar

> Task :sdks:java:container:pullLicenses
Traceback (most recent call last):
  File "<https://ci-beam.apache.org/job/beam_PostCommit_Java_Nexmark_Dataflow_V2/ws/src/sdks/java/container/license_scripts/pull_licenses_java.py",> line 58, in pull_from_url
    url_read = urlopen(Request(url, headers={
  File "/usr/lib/python3.8/urllib/request.py", line 222, in urlopen
    return opener.open(url, data, timeout)
  File "/usr/lib/python3.8/urllib/request.py", line 531, in open
    response = meth(req, response)
  File "/usr/lib/python3.8/urllib/request.py", line 640, in http_response
    response = self.parent.error(
  File "/usr/lib/python3.8/urllib/request.py", line 569, in error
    return self._call_chain(*args)
  File "/usr/lib/python3.8/urllib/request.py", line 502, in _call_chain
    result = func(*args)
  File "/usr/lib/python3.8/urllib/request.py", line 649, in http_error_default
    raise HTTPError(req.full_url, code, msg, hdrs, fp)
urllib.error.HTTPError: HTTP Error 404: Not Found
ERROR:root:Invalid url for zstd-jni-1.5.2-5: https://opensource.org/licenses/BSD-2-Clause. Retrying...
Traceback (most recent call last):
  File "<https://ci-beam.apache.org/job/beam_PostCommit_Java_Nexmark_Dataflow_V2/ws/src/sdks/java/container/license_scripts/pull_licenses_java.py",> line 58, in pull_from_url
    url_read = urlopen(Request(url, headers={
  File "/usr/lib/python3.8/urllib/request.py", line 222, in urlopen
    return opener.open(url, data, timeout)
  File "/usr/lib/python3.8/urllib/request.py", line 531, in open
    response = meth(req, response)
  File "/usr/lib/python3.8/urllib/request.py", line 640, in http_response
    response = self.parent.error(
  File "/usr/lib/python3.8/urllib/request.py", line 569, in error
    return self._call_chain(*args)
  File "/usr/lib/python3.8/urllib/request.py", line 502, in _call_chain
    result = func(*args)
  File "/usr/lib/python3.8/urllib/request.py", line 649, in http_error_default
    raise HTTPError(req.full_url, code, msg, hdrs, fp)
urllib.error.HTTPError: HTTP Error 404: Not Found
ERROR:root:Invalid url for zstd-jni-1.5.2-5: https://opensource.org/licenses/BSD-2-Clause. Retrying...
Traceback (most recent call last):
  File "<https://ci-beam.apache.org/job/beam_PostCommit_Java_Nexmark_Dataflow_V2/ws/src/sdks/java/container/license_scripts/pull_licenses_java.py",> line 58, in pull_from_url
    url_read = urlopen(Request(url, headers={
  File "/usr/lib/python3.8/urllib/request.py", line 222, in urlopen
    return opener.open(url, data, timeout)
  File "/usr/lib/python3.8/urllib/request.py", line 531, in open
    response = meth(req, response)
  File "/usr/lib/python3.8/urllib/request.py", line 640, in http_response
    response = self.parent.error(
  File "/usr/lib/python3.8/urllib/request.py", line 569, in error
    return self._call_chain(*args)
  File "/usr/lib/python3.8/urllib/request.py", line 502, in _call_chain
    result = func(*args)
  File "/usr/lib/python3.8/urllib/request.py", line 649, in http_error_default
    raise HTTPError(req.full_url, code, msg, hdrs, fp)
urllib.error.HTTPError: HTTP Error 404: Not Found
ERROR:root:Invalid url for zstd-jni-1.5.2-5: https://opensource.org/licenses/BSD-2-Clause. Retrying...
Traceback (most recent call last):
  File "<https://ci-beam.apache.org/job/beam_PostCommit_Java_Nexmark_Dataflow_V2/ws/src/sdks/java/container/license_scripts/pull_licenses_java.py",> line 58, in pull_from_url
    url_read = urlopen(Request(url, headers={
  File "/usr/lib/python3.8/urllib/request.py", line 222, in urlopen
    return opener.open(url, data, timeout)
  File "/usr/lib/python3.8/urllib/request.py", line 531, in open
    response = meth(req, response)
  File "/usr/lib/python3.8/urllib/request.py", line 640, in http_response
    response = self.parent.error(
  File "/usr/lib/python3.8/urllib/request.py", line 569, in error
    return self._call_chain(*args)
  File "/usr/lib/python3.8/urllib/request.py", line 502, in _call_chain
    result = func(*args)
  File "/usr/lib/python3.8/urllib/request.py", line 649, in http_error_default
    raise HTTPError(req.full_url, code, msg, hdrs, fp)
urllib.error.HTTPError: HTTP Error 404: Not Found
ERROR:root:Invalid url for zstd-jni-1.5.2-5: https://opensource.org/licenses/BSD-2-Clause after 9 retries.
ERROR:root:['zstd-jni-1.5.2-5']
ERROR:root:**************************************** Licenses were not able to be pulled automatically for some dependencies. Please search source code of the dependencies on the internet and add "license" and "notice" (if available) field to <https://ci-beam.apache.org/job/beam_PostCommit_Java_Nexmark_Dataflow_V2/ws/src/sdks/java/container/license_scripts/dep_urls_java.yaml> for each missing license. Dependency List: [zstd-jni-1.5.2-5]
INFO:root:pull_licenses_java.py failed. It took 43.424389 seconds with 16 threads.
Traceback (most recent call last):
  File "<https://ci-beam.apache.org/job/beam_PostCommit_Java_Nexmark_Dataflow_V2/ws/src/sdks/java/container/license_scripts/pull_licenses_java.py",> line 326, in <module>
    raise RuntimeError('{n} error(s) occurred.'.format(n=len(error_msg)),
RuntimeError: ('1 error(s) occurred.', ['**************************************** Licenses were not able to be pulled automatically for some dependencies. Please search source code of the dependencies on the internet and add "license" and "notice" (if available) field to <https://ci-beam.apache.org/job/beam_PostCommit_Java_Nexmark_Dataflow_V2/ws/src/sdks/java/container/license_scripts/dep_urls_java.yaml> for each missing license. Dependency List: [zstd-jni-1.5.2-5]'])

> Task :sdks:java:container:pullLicenses FAILED
> Task :sdks:java:container:goPrepare UP-TO-DATE

> Task :sdks:java:container:goBuild
/home/jenkins/go/bin/go1.19.3 build -o ./build/target/linux_amd64/boot boot.go boot_test.go

> Task :release:go-licenses:java:dockerRun
go: downloading github.com/golang/protobuf v1.5.2
go: downloading google.golang.org/grpc v1.51.0
go: downloading google.golang.org/protobuf v1.28.1
go: downloading golang.org/x/sys v0.2.0

> Task :sdks:java:container:java8:copySdkHarnessLauncher
Execution optimizations have been disabled for task ':sdks:java:container:java8:copySdkHarnessLauncher' to ensure correctness due to the following reasons:
  - Gradle detected a problem with the following location: '<https://ci-beam.apache.org/job/beam_PostCommit_Java_Nexmark_Dataflow_V2/ws/src/sdks/java/container/build/target'.> Reason: Task ':sdks:java:container:java8:copySdkHarnessLauncher' uses this output of task ':sdks:java:container:downloadCloudProfilerAgent' without declaring an explicit or implicit dependency. This can lead to incorrect results being produced, depending on what order the tasks are executed. Please refer to https://docs.gradle.org/7.5.1/userguide/validation_problems.html#implicit_dependency for more details about this problem.
  - Gradle detected a problem with the following location: '<https://ci-beam.apache.org/job/beam_PostCommit_Java_Nexmark_Dataflow_V2/ws/src/sdks/java/container/build/target'.> Reason: Task ':sdks:java:container:java8:copySdkHarnessLauncher' uses this output of task ':sdks:java:container:pullLicenses' without declaring an explicit or implicit dependency. This can lead to incorrect results being produced, depending on what order the tasks are executed. Please refer to https://docs.gradle.org/7.5.1/userguide/validation_problems.html#implicit_dependency for more details about this problem.

> Task :release:go-licenses:java:dockerRun
go: downloading golang.org/x/net v0.2.0
go: downloading google.golang.org/genproto v0.0.0-20221118155620-16455021b5e6
go: downloading golang.org/x/text v0.4.0
go: added github.com/apache/beam/sdks/v2 v2.44.0
go: added github.com/golang/protobuf v1.5.2
go: added golang.org/x/net v0.2.0
go: added golang.org/x/sys v0.2.0
go: added golang.org/x/text v0.4.0
go: added google.golang.org/genproto v0.0.0-20221118155620-16455021b5e6
go: added google.golang.org/grpc v1.51.0
go: added google.golang.org/protobuf v1.28.1
+ go-licenses save github.com/apache/beam/sdks/v2/java/container --save_path=/output/licenses
W0214 02:34:00.439239      37 library.go:101] "golang.org/x/sys/unix" contains non-Go code that can't be inspected for further dependencies:
/go/pkg/mod/golang.org/x/sys@v0.2.0/unix/asm_linux_amd64.s
+ go-licenses csv github.com/apache/beam/sdks/v2/java/container
+ tee /output/licenses/list.csv
W0214 02:34:04.534388      83 library.go:101] "golang.org/x/sys/unix" contains non-Go code that can't be inspected for further dependencies:
/go/pkg/mod/golang.org/x/sys@v0.2.0/unix/asm_linux_amd64.s
github.com/apache/beam/sdks/v2/go/pkg/beam,https://github.com/apache/beam/blob/sdks/v2.44.0/sdks/go/README.md,Apache-2.0
github.com/apache/beam/sdks/v2/java/container,https://github.com/apache/beam/blob/sdks/v2.44.0/sdks/LICENSE,Apache-2.0
github.com/golang/protobuf,https://github.com/golang/protobuf/blob/v1.5.2/LICENSE,BSD-3-Clause
golang.org/x/net,https://cs.opensource.google/go/x/net/+/v0.2.0:LICENSE,BSD-3-Clause
golang.org/x/sys/unix,https://cs.opensource.google/go/x/sys/+/v0.2.0:LICENSE,BSD-3-Clause
golang.org/x/text,https://cs.opensource.google/go/x/text/+/v0.4.0:LICENSE,BSD-3-Clause
google.golang.org/genproto/googleapis/rpc/status,https://github.com/googleapis/go-genproto/blob/16455021b5e6/LICENSE,Apache-2.0
google.golang.org/grpc,https://github.com/grpc/grpc-go/blob/v1.51.0/LICENSE,Apache-2.0
google.golang.org/protobuf,https://github.com/protocolbuffers/protobuf-go/blob/v1.28.1/LICENSE,BSD-3-Clause
+ chmod -R a+w /output/licenses

> Task :release:go-licenses:java:createLicenses
> Task :sdks:java:container:java8:copyGolangLicenses

FAILURE: Build failed with an exception.

* What went wrong:
Execution failed for task ':sdks:java:container:pullLicenses'.
> Process 'command './license_scripts/license_script.sh'' finished with non-zero exit value 1

* Try:
> Run with --stacktrace option to get the stack trace.
> Run with --info or --debug option to get more log output.

* Get more help at https://help.gradle.org

Deprecated Gradle features were used in this build, making it incompatible with Gradle 8.0.

You can use '--warning-mode all' to show the individual deprecation warnings and determine if they come from your own scripts or plugins.

See https://docs.gradle.org/7.5.1/userguide/command_line_interface.html#sec:command_line_warnings

Execution optimizations have been disabled for 1 invalid unit(s) of work during this build to ensure correctness.
Please consult deprecation warnings for more details.

BUILD FAILED in 1m 38s
131 actionable tasks: 87 executed, 40 from cache, 4 up-to-date

Publishing build scan...
https://gradle.com/s/fs7lfmypngvho

Build step 'Invoke Gradle script' changed build result to FAILURE
Build step 'Invoke Gradle script' marked build as failure

---------------------------------------------------------------------
To unsubscribe, e-mail: builds-unsubscribe@beam.apache.org
For additional commands, e-mail: builds-help@beam.apache.org