You are viewing a plain text version of this content. The canonical link for it is here.
Posted to builds@lucene.apache.org by Policeman Jenkins Server via builds <bu...@lucene.apache.org> on 2026/05/26 19:30:23 UTC

[JENKINS] Lucene-main-Linux (64bit/hotspot/jdk-26) - Build # 64948 - Unstable!

Build: https://jenkins.thetaphi.de/job/Lucene-main-Linux/64948/
Java: 64bit/hotspot/jdk-26 -XX:+UseCompressedOops -XX:+UseSerialGC

1 tests failed.
FAILED:  org.apache.lucene.index.TestColumnBatchIndexing.testForceMergeMixedOriginSegments

Error Message:
java.lang.AssertionError: expected:<30> but was:<40>

Stack Trace:
java.lang.AssertionError: expected:<30> but was:<40>
	at __randomizedtesting.SeedInfo.seed([951C5314A9F5655E:95A684000D3B9622]:0)
	at org.junit.Assert.fail(Assert.java:89)
	at org.junit.Assert.failNotEquals(Assert.java:835)
	at org.junit.Assert.assertEquals(Assert.java:647)
	at org.junit.Assert.assertEquals(Assert.java:633)
	at org.apache.lucene.index.TestColumnBatchIndexing.testForceMergeMixedOriginSegments(TestColumnBatchIndexing.java:1136)