You are viewing a plain text version of this content. The canonical link for it is here.
Posted to notifications@maven.apache.org by Apache Jenkins Server <je...@builds.apache.org> on 2019/08/10 10:51:55 UTC
Build unstable in Jenkins: Maven TLP » maven-shade-plugin » master #15
See https://builds.apache.org/job/maven-box/job/maven-shade-plugin/job/master/15/
Changes:
* [MSHADE-306] - log all duplicates to not silently swallow a duplicate
* [MSHADE-306] - log all duplicates to not silently swallow a duplicate
* [MSHADE-306] - log all duplicates to not silently swallow a duplicate
* [MSHADE-306] - log all duplicates to not silently swallow a duplicate
* [MSHADE-306] - log all duplicates to not silently swallow a duplicate
* [MSHADE-306] - log all duplicates to not silently swallow a duplicate
* [MSHADE-306] - log all duplicates to not silently swallow a duplicate
* [MSHADE-306] - log all duplicates to not silently swallow a duplicate
* [MSHADE-306] - log all duplicates to not silently swallow a duplicate
* [MSHADE-306] - log all duplicates to not silently swallow a duplicate
* [MSHADE-306] - log all duplicates to not silently swallow a duplicate
* [MSHADE-306] - log all duplicates to not silently swallow a duplicate
* [MSHADE-306] - log all duplicates to not silently swallow a duplicate
* [MSHADE-306] - log all duplicates to not silently swallow a duplicate
* [MSHADE-306] - log all duplicates to not silently swallow a duplicate
* [MSHADE-306] - log all duplicates to not silently swallow a duplicate
43 tests failed.
FAILED: org.apache.maven.plugins.shade.DefaultShaderTest.windows-jdk7-m3.3.x_build / Build windows-jdk7-m3.3.x_build / testOverlappingResourcesAreLogged
Error Message:
[Processing JAR src\test\jars\test-project-1.0-SNAPSHOT.jar, Processing JAR src\test\jars\plexus-utils-1.4.1.jar, We have a duplicate META-INF/MANIFEST.MF in src\test\jars\plexus-utils-1.4.1.jar]
Stack Trace:
junit.framework.AssertionFailedError: [Processing JAR src\test\jars\test-project-1.0-SNAPSHOT.jar, Processing JAR src\test\jars\plexus-utils-1.4.1.jar, We have a duplicate META-INF/MANIFEST.MF in src\test\jars\plexus-utils-1.4.1.jar]
at org.apache.maven.plugins.shade.DefaultShaderTest.testOverlappingResourcesAreLogged(DefaultShaderTest.java:122)
FAILED: org.apache.maven.plugins.shade.resource.properties.PropertiesTransformerTest.windows-jdk7-m3.3.x_build / Build windows-jdk7-m3.3.x_build / mergeWithoutOverlap
Error Message:
foo/bar/my.properties, expected=#.*
a=b
c=d
, actual=# Merged by maven-shade-plugin (org.apache.maven.plugins.shade.resource.properties.PropertiesTransformer)
a=b
c=d
Stack Trace:
java.lang.AssertionError:
foo/bar/my.properties, expected=#.*
a=b
c=d
, actual=# Merged by maven-shade-plugin (org.apache.maven.plugins.shade.resource.properties.PropertiesTransformer)
a=b
c=d
FAILED: org.apache.maven.plugins.shade.resource.properties.PropertiesTransformerTest.windows-jdk7-m3.3.x_build / Build windows-jdk7-m3.3.x_build / mergeWithAlreadyMerged
Error Message:
foo/bar/my.properties, expected=#.*
a=b
, actual=# Merged by maven-shade-plugin (org.apache.maven.plugins.shade.resource.properties.PropertiesTransformer)
a=b
Stack Trace:
java.lang.AssertionError:
foo/bar/my.properties, expected=#.*
a=b
, actual=# Merged by maven-shade-plugin (org.apache.maven.plugins.shade.resource.properties.PropertiesTransformer)
a=b
FAILED: org.apache.maven.plugins.shade.resource.properties.PropertiesTransformerTest.windows-jdk7-m3.3.x_build / Build windows-jdk7-m3.3.x_build / mergeWithOverlap
Error Message:
foo/bar/my.properties, expected=#.*
a=d
, actual=# Merged by maven-shade-plugin (org.apache.maven.plugins.shade.resource.properties.PropertiesTransformer)
a=d
Stack Trace:
java.lang.AssertionError:
foo/bar/my.properties, expected=#.*
a=d
, actual=# Merged by maven-shade-plugin (org.apache.maven.plugins.shade.resource.properties.PropertiesTransformer)
a=d
FAILED: org.apache.maven.plugins.shade.DefaultShaderTest.windows-jdk7-m3.2.x_build / Build windows-jdk7-m3.2.x_build / testOverlappingResourcesAreLogged
Error Message:
[Processing JAR src\test\jars\test-project-1.0-SNAPSHOT.jar, Processing JAR src\test\jars\plexus-utils-1.4.1.jar, We have a duplicate META-INF/MANIFEST.MF in src\test\jars\plexus-utils-1.4.1.jar]
Stack Trace:
junit.framework.AssertionFailedError: [Processing JAR src\test\jars\test-project-1.0-SNAPSHOT.jar, Processing JAR src\test\jars\plexus-utils-1.4.1.jar, We have a duplicate META-INF/MANIFEST.MF in src\test\jars\plexus-utils-1.4.1.jar]
at org.apache.maven.plugins.shade.DefaultShaderTest.testOverlappingResourcesAreLogged(DefaultShaderTest.java:122)
FAILED: org.apache.maven.plugins.shade.resource.properties.PropertiesTransformerTest.windows-jdk7-m3.2.x_build / Build windows-jdk7-m3.2.x_build / mergeWithoutOverlap
Error Message:
foo/bar/my.properties, expected=#.*
a=b
c=d
, actual=# Merged by maven-shade-plugin (org.apache.maven.plugins.shade.resource.properties.PropertiesTransformer)
a=b
c=d
Stack Trace:
java.lang.AssertionError:
foo/bar/my.properties, expected=#.*
a=b
c=d
, actual=# Merged by maven-shade-plugin (org.apache.maven.plugins.shade.resource.properties.PropertiesTransformer)
a=b
c=d
FAILED: org.apache.maven.plugins.shade.resource.properties.PropertiesTransformerTest.windows-jdk7-m3.2.x_build / Build windows-jdk7-m3.2.x_build / mergeWithAlreadyMerged
Error Message:
foo/bar/my.properties, expected=#.*
a=b
, actual=# Merged by maven-shade-plugin (org.apache.maven.plugins.shade.resource.properties.PropertiesTransformer)
a=b
Stack Trace:
java.lang.AssertionError:
foo/bar/my.properties, expected=#.*
a=b
, actual=# Merged by maven-shade-plugin (org.apache.maven.plugins.shade.resource.properties.PropertiesTransformer)
a=b
FAILED: org.apache.maven.plugins.shade.resource.properties.PropertiesTransformerTest.windows-jdk7-m3.2.x_build / Build windows-jdk7-m3.2.x_build / mergeWithOverlap
Error Message:
foo/bar/my.properties, expected=#.*
a=d
, actual=# Merged by maven-shade-plugin (org.apache.maven.plugins.shade.resource.properties.PropertiesTransformer)
a=d
Stack Trace:
java.lang.AssertionError:
foo/bar/my.properties, expected=#.*
a=d
, actual=# Merged by maven-shade-plugin (org.apache.maven.plugins.shade.resource.properties.PropertiesTransformer)
a=d
FAILED: org.apache.maven.plugins.shade.DefaultShaderTest.windows-jdk7-m3.5.x_build / Build windows-jdk7-m3.5.x_build / testOverlappingResourcesAreLogged
Error Message:
[Processing JAR src\test\jars\test-project-1.0-SNAPSHOT.jar, Processing JAR src\test\jars\plexus-utils-1.4.1.jar, We have a duplicate META-INF/MANIFEST.MF in src\test\jars\plexus-utils-1.4.1.jar]
Stack Trace:
junit.framework.AssertionFailedError: [Processing JAR src\test\jars\test-project-1.0-SNAPSHOT.jar, Processing JAR src\test\jars\plexus-utils-1.4.1.jar, We have a duplicate META-INF/MANIFEST.MF in src\test\jars\plexus-utils-1.4.1.jar]
at org.apache.maven.plugins.shade.DefaultShaderTest.testOverlappingResourcesAreLogged(DefaultShaderTest.java:122)
FAILED: org.apache.maven.plugins.shade.resource.properties.PropertiesTransformerTest.windows-jdk7-m3.5.x_build / Build windows-jdk7-m3.5.x_build / mergeWithoutOverlap
Error Message:
foo/bar/my.properties, expected=#.*
a=b
c=d
, actual=# Merged by maven-shade-plugin (org.apache.maven.plugins.shade.resource.properties.PropertiesTransformer)
a=b
c=d
Stack Trace:
java.lang.AssertionError:
foo/bar/my.properties, expected=#.*
a=b
c=d
, actual=# Merged by maven-shade-plugin (org.apache.maven.plugins.shade.resource.properties.PropertiesTransformer)
a=b
c=d
FAILED: org.apache.maven.plugins.shade.resource.properties.PropertiesTransformerTest.windows-jdk7-m3.5.x_build / Build windows-jdk7-m3.5.x_build / mergeWithAlreadyMerged
Error Message:
foo/bar/my.properties, expected=#.*
a=b
, actual=# Merged by maven-shade-plugin (org.apache.maven.plugins.shade.resource.properties.PropertiesTransformer)
a=b
Stack Trace:
java.lang.AssertionError:
foo/bar/my.properties, expected=#.*
a=b
, actual=# Merged by maven-shade-plugin (org.apache.maven.plugins.shade.resource.properties.PropertiesTransformer)
a=b
FAILED: org.apache.maven.plugins.shade.resource.properties.PropertiesTransformerTest.windows-jdk7-m3.5.x_build / Build windows-jdk7-m3.5.x_build / mergeWithOverlap
Error Message:
foo/bar/my.properties, expected=#.*
a=d
, actual=# Merged by maven-shade-plugin (org.apache.maven.plugins.shade.resource.properties.PropertiesTransformer)
a=d
Stack Trace:
java.lang.AssertionError:
foo/bar/my.properties, expected=#.*
a=d
, actual=# Merged by maven-shade-plugin (org.apache.maven.plugins.shade.resource.properties.PropertiesTransformer)
a=d
FAILED: org.apache.maven.plugins.shade.DefaultShaderTest.windows-jdk7-m3.6.x_build / Build windows-jdk7-m3.6.x_build / testOverlappingResourcesAreLogged
Error Message:
[Processing JAR src\test\jars\test-project-1.0-SNAPSHOT.jar, Processing JAR src\test\jars\plexus-utils-1.4.1.jar, We have a duplicate META-INF/MANIFEST.MF in src\test\jars\plexus-utils-1.4.1.jar]
Stack Trace:
junit.framework.AssertionFailedError: [Processing JAR src\test\jars\test-project-1.0-SNAPSHOT.jar, Processing JAR src\test\jars\plexus-utils-1.4.1.jar, We have a duplicate META-INF/MANIFEST.MF in src\test\jars\plexus-utils-1.4.1.jar]
at org.apache.maven.plugins.shade.DefaultShaderTest.testOverlappingResourcesAreLogged(DefaultShaderTest.java:122)
FAILED: org.apache.maven.plugins.shade.resource.properties.PropertiesTransformerTest.windows-jdk7-m3.6.x_build / Build windows-jdk7-m3.6.x_build / mergeWithoutOverlap
Error Message:
foo/bar/my.properties, expected=#.*
a=b
c=d
, actual=# Merged by maven-shade-plugin (org.apache.maven.plugins.shade.resource.properties.PropertiesTransformer)
a=b
c=d
Stack Trace:
java.lang.AssertionError:
foo/bar/my.properties, expected=#.*
a=b
c=d
, actual=# Merged by maven-shade-plugin (org.apache.maven.plugins.shade.resource.properties.PropertiesTransformer)
a=b
c=d
FAILED: org.apache.maven.plugins.shade.resource.properties.PropertiesTransformerTest.windows-jdk7-m3.6.x_build / Build windows-jdk7-m3.6.x_build / mergeWithAlreadyMerged
Error Message:
foo/bar/my.properties, expected=#.*
a=b
, actual=# Merged by maven-shade-plugin (org.apache.maven.plugins.shade.resource.properties.PropertiesTransformer)
a=b
Stack Trace:
java.lang.AssertionError:
foo/bar/my.properties, expected=#.*
a=b
, actual=# Merged by maven-shade-plugin (org.apache.maven.plugins.shade.resource.properties.PropertiesTransformer)
a=b
FAILED: org.apache.maven.plugins.shade.resource.properties.PropertiesTransformerTest.windows-jdk7-m3.6.x_build / Build windows-jdk7-m3.6.x_build / mergeWithOverlap
Error Message:
foo/bar/my.properties, expected=#.*
a=d
, actual=# Merged by maven-shade-plugin (org.apache.maven.plugins.shade.resource.properties.PropertiesTransformer)
a=d
Stack Trace:
java.lang.AssertionError:
foo/bar/my.properties, expected=#.*
a=d
, actual=# Merged by maven-shade-plugin (org.apache.maven.plugins.shade.resource.properties.PropertiesTransformer)
a=d
FAILED: org.apache.maven.plugins.shade.DefaultShaderTest.windows-jdk11-m3.6.x_build / Build windows-jdk11-m3.6.x_build / testOverlappingResourcesAreLogged
Error Message:
[Processing JAR src\test\jars\test-project-1.0-SNAPSHOT.jar, Processing JAR src\test\jars\plexus-utils-1.4.1.jar, We have a duplicate META-INF/MANIFEST.MF in src\test\jars\plexus-utils-1.4.1.jar]
Stack Trace:
junit.framework.AssertionFailedError: [Processing JAR src\test\jars\test-project-1.0-SNAPSHOT.jar, Processing JAR src\test\jars\plexus-utils-1.4.1.jar, We have a duplicate META-INF/MANIFEST.MF in src\test\jars\plexus-utils-1.4.1.jar]
at org.apache.maven.plugins.shade.DefaultShaderTest.testOverlappingResourcesAreLogged(DefaultShaderTest.java:122)
FAILED: org.apache.maven.plugins.shade.resource.properties.PropertiesTransformerTest.windows-jdk11-m3.6.x_build / Build windows-jdk11-m3.6.x_build / mergeWithoutOverlap
Error Message:
foo/bar/my.properties, expected=#.*
a=b
c=d
, actual=# Merged by maven-shade-plugin (org.apache.maven.plugins.shade.resource.properties.PropertiesTransformer)
a=b
c=d
Stack Trace:
java.lang.AssertionError:
foo/bar/my.properties, expected=#.*
a=b
c=d
, actual=# Merged by maven-shade-plugin (org.apache.maven.plugins.shade.resource.properties.PropertiesTransformer)
a=b
c=d
FAILED: org.apache.maven.plugins.shade.resource.properties.PropertiesTransformerTest.windows-jdk11-m3.6.x_build / Build windows-jdk11-m3.6.x_build / mergeWithAlreadyMerged
Error Message:
foo/bar/my.properties, expected=#.*
a=b
, actual=# Merged by maven-shade-plugin (org.apache.maven.plugins.shade.resource.properties.PropertiesTransformer)
a=b
Stack Trace:
java.lang.AssertionError:
foo/bar/my.properties, expected=#.*
a=b
, actual=# Merged by maven-shade-plugin (org.apache.maven.plugins.shade.resource.properties.PropertiesTransformer)
a=b
FAILED: org.apache.maven.plugins.shade.resource.properties.PropertiesTransformerTest.windows-jdk11-m3.6.x_build / Build windows-jdk11-m3.6.x_build / mergeWithOverlap
Error Message:
foo/bar/my.properties, expected=#.*
a=d
, actual=# Merged by maven-shade-plugin (org.apache.maven.plugins.shade.resource.properties.PropertiesTransformer)
a=d
Stack Trace:
java.lang.AssertionError:
foo/bar/my.properties, expected=#.*
a=d
, actual=# Merged by maven-shade-plugin (org.apache.maven.plugins.shade.resource.properties.PropertiesTransformer)
a=d
FAILED: org.apache.maven.plugins.shade.DefaultShaderTest.windows-jdk12-m3.6.x_build / Build windows-jdk12-m3.6.x_build / testOverlappingResourcesAreLogged
Error Message:
[Processing JAR src\test\jars\test-project-1.0-SNAPSHOT.jar, Processing JAR src\test\jars\plexus-utils-1.4.1.jar, We have a duplicate META-INF/MANIFEST.MF in src\test\jars\plexus-utils-1.4.1.jar]
Stack Trace:
junit.framework.AssertionFailedError: [Processing JAR src\test\jars\test-project-1.0-SNAPSHOT.jar, Processing JAR src\test\jars\plexus-utils-1.4.1.jar, We have a duplicate META-INF/MANIFEST.MF in src\test\jars\plexus-utils-1.4.1.jar]
at org.apache.maven.plugins.shade.DefaultShaderTest.testOverlappingResourcesAreLogged(DefaultShaderTest.java:122)
FAILED: org.apache.maven.plugins.shade.resource.properties.PropertiesTransformerTest.windows-jdk12-m3.6.x_build / Build windows-jdk12-m3.6.x_build / mergeWithoutOverlap
Error Message:
foo/bar/my.properties, expected=#.*
a=b
c=d
, actual=# Merged by maven-shade-plugin (org.apache.maven.plugins.shade.resource.properties.PropertiesTransformer)
a=b
c=d
Stack Trace:
java.lang.AssertionError:
foo/bar/my.properties, expected=#.*
a=b
c=d
, actual=# Merged by maven-shade-plugin (org.apache.maven.plugins.shade.resource.properties.PropertiesTransformer)
a=b
c=d
FAILED: org.apache.maven.plugins.shade.resource.properties.PropertiesTransformerTest.windows-jdk12-m3.6.x_build / Build windows-jdk12-m3.6.x_build / mergeWithAlreadyMerged
Error Message:
foo/bar/my.properties, expected=#.*
a=b
, actual=# Merged by maven-shade-plugin (org.apache.maven.plugins.shade.resource.properties.PropertiesTransformer)
a=b
Stack Trace:
java.lang.AssertionError:
foo/bar/my.properties, expected=#.*
a=b
, actual=# Merged by maven-shade-plugin (org.apache.maven.plugins.shade.resource.properties.PropertiesTransformer)
a=b
FAILED: org.apache.maven.plugins.shade.resource.properties.PropertiesTransformerTest.windows-jdk12-m3.6.x_build / Build windows-jdk12-m3.6.x_build / mergeWithOverlap
Error Message:
foo/bar/my.properties, expected=#.*
a=d
, actual=# Merged by maven-shade-plugin (org.apache.maven.plugins.shade.resource.properties.PropertiesTransformer)
a=d
Stack Trace:
java.lang.AssertionError:
foo/bar/my.properties, expected=#.*
a=d
, actual=# Merged by maven-shade-plugin (org.apache.maven.plugins.shade.resource.properties.PropertiesTransformer)
a=d
FAILED: org.apache.maven.plugins.shade.DefaultShaderTest.windows-jdk8-m3.6.x_build / Build windows-jdk8-m3.6.x_build / testOverlappingResourcesAreLogged
Error Message:
[Processing JAR src\test\jars\test-project-1.0-SNAPSHOT.jar, Processing JAR src\test\jars\plexus-utils-1.4.1.jar, We have a duplicate META-INF/MANIFEST.MF in src\test\jars\plexus-utils-1.4.1.jar]
Stack Trace:
junit.framework.AssertionFailedError: [Processing JAR src\test\jars\test-project-1.0-SNAPSHOT.jar, Processing JAR src\test\jars\plexus-utils-1.4.1.jar, We have a duplicate META-INF/MANIFEST.MF in src\test\jars\plexus-utils-1.4.1.jar]
at org.apache.maven.plugins.shade.DefaultShaderTest.testOverlappingResourcesAreLogged(DefaultShaderTest.java:122)
FAILED: org.apache.maven.plugins.shade.resource.properties.PropertiesTransformerTest.windows-jdk8-m3.6.x_build / Build windows-jdk8-m3.6.x_build / mergeWithoutOverlap
Error Message:
foo/bar/my.properties, expected=#.*
a=b
c=d
, actual=# Merged by maven-shade-plugin (org.apache.maven.plugins.shade.resource.properties.PropertiesTransformer)
a=b
c=d
Stack Trace:
java.lang.AssertionError:
foo/bar/my.properties, expected=#.*
a=b
c=d
, actual=# Merged by maven-shade-plugin (org.apache.maven.plugins.shade.resource.properties.PropertiesTransformer)
a=b
c=d
FAILED: org.apache.maven.plugins.shade.resource.properties.PropertiesTransformerTest.windows-jdk8-m3.6.x_build / Build windows-jdk8-m3.6.x_build / mergeWithAlreadyMerged
Error Message:
foo/bar/my.properties, expected=#.*
a=b
, actual=# Merged by maven-shade-plugin (org.apache.maven.plugins.shade.resource.properties.PropertiesTransformer)
a=b
Stack Trace:
java.lang.AssertionError:
foo/bar/my.properties, expected=#.*
a=b
, actual=# Merged by maven-shade-plugin (org.apache.maven.plugins.shade.resource.properties.PropertiesTransformer)
a=b
FAILED: org.apache.maven.plugins.shade.resource.properties.PropertiesTransformerTest.windows-jdk8-m3.6.x_build / Build windows-jdk8-m3.6.x_build / mergeWithOverlap
Error Message:
foo/bar/my.properties, expected=#.*
a=d
, actual=# Merged by maven-shade-plugin (org.apache.maven.plugins.shade.resource.properties.PropertiesTransformer)
a=d
Stack Trace:
java.lang.AssertionError:
foo/bar/my.properties, expected=#.*
a=d
, actual=# Merged by maven-shade-plugin (org.apache.maven.plugins.shade.resource.properties.PropertiesTransformer)
a=d
FAILED: org.apache.maven.plugins.shade.DefaultShaderTest.windows-jdk13-m3.6.x_build / Build windows-jdk13-m3.6.x_build / testOverlappingResourcesAreLogged
Error Message:
[Processing JAR src\test\jars\test-project-1.0-SNAPSHOT.jar, Processing JAR src\test\jars\plexus-utils-1.4.1.jar, We have a duplicate META-INF/MANIFEST.MF in src\test\jars\plexus-utils-1.4.1.jar]
Stack Trace:
junit.framework.AssertionFailedError: [Processing JAR src\test\jars\test-project-1.0-SNAPSHOT.jar, Processing JAR src\test\jars\plexus-utils-1.4.1.jar, We have a duplicate META-INF/MANIFEST.MF in src\test\jars\plexus-utils-1.4.1.jar]
at org.apache.maven.plugins.shade.DefaultShaderTest.testOverlappingResourcesAreLogged(DefaultShaderTest.java:122)
FAILED: org.apache.maven.plugins.shade.resource.properties.PropertiesTransformerTest.windows-jdk13-m3.6.x_build / Build windows-jdk13-m3.6.x_build / mergeWithoutOverlap
Error Message:
foo/bar/my.properties, expected=#.*
a=b
c=d
, actual=# Merged by maven-shade-plugin (org.apache.maven.plugins.shade.resource.properties.PropertiesTransformer)
a=b
c=d
Stack Trace:
java.lang.AssertionError:
foo/bar/my.properties, expected=#.*
a=b
c=d
, actual=# Merged by maven-shade-plugin (org.apache.maven.plugins.shade.resource.properties.PropertiesTransformer)
a=b
c=d
FAILED: org.apache.maven.plugins.shade.resource.properties.PropertiesTransformerTest.windows-jdk13-m3.6.x_build / Build windows-jdk13-m3.6.x_build / mergeWithAlreadyMerged
Error Message:
foo/bar/my.properties, expected=#.*
a=b
, actual=# Merged by maven-shade-plugin (org.apache.maven.plugins.shade.resource.properties.PropertiesTransformer)
a=b
Stack Trace:
java.lang.AssertionError:
foo/bar/my.properties, expected=#.*
a=b
, actual=# Merged by maven-shade-plugin (org.apache.maven.plugins.shade.resource.properties.PropertiesTransformer)
a=b
FAILED: org.apache.maven.plugins.shade.resource.properties.PropertiesTransformerTest.windows-jdk13-m3.6.x_build / Build windows-jdk13-m3.6.x_build / mergeWithOverlap
Error Message:
foo/bar/my.properties, expected=#.*
a=d
, actual=# Merged by maven-shade-plugin (org.apache.maven.plugins.shade.resource.properties.PropertiesTransformer)
a=d
Stack Trace:
java.lang.AssertionError:
foo/bar/my.properties, expected=#.*
a=d
, actual=# Merged by maven-shade-plugin (org.apache.maven.plugins.shade.resource.properties.PropertiesTransformer)
a=d
FAILED: org.apache.maven.plugins.shade.resource.properties.PropertiesTransformerTest.linux-jdk13-m3.6.x_build / Build linux-jdk13-m3.6.x_build / propertiesRewritingIsStable
Error Message:
expected:<... maven-shade-plugin
[b=2
a=1]
> but was:<... maven-shade-plugin
[a=1
b=2]
>
Stack Trace:
org.junit.ComparisonFailure:
expected:<... maven-shade-plugin
[b=2
a=1]
> but was:<... maven-shade-plugin
[a=1
b=2]
>
at org.apache.maven.plugins.shade.resource.properties.PropertiesTransformerTest.propertiesRewritingIsStable(PropertiesTransformerTest.java:62)
FAILED: org.apache.maven.plugins.shade.resource.properties.PropertiesTransformerTest.windows-jdk7-m3.3.x_build / Build windows-jdk7-m3.3.x_build / propertiesRewritingIsStable
Error Message:
expected:<...y maven-shade-plugin[
b=2
a=1]
> but was:<...y maven-shade-plugin[
b=2
a=1
]
>
Stack Trace:
org.junit.ComparisonFailure:
expected:<...y maven-shade-plugin[
b=2
a=1]
> but was:<...y maven-shade-plugin[
b=2
a=1
]
>
at org.apache.maven.plugins.shade.resource.properties.PropertiesTransformerTest.propertiesRewritingIsStable(PropertiesTransformerTest.java:62)
FAILED: org.apache.maven.plugins.shade.resource.properties.PropertiesTransformerTest.windows-jdk7-m3.2.x_build / Build windows-jdk7-m3.2.x_build / propertiesRewritingIsStable
Error Message:
expected:<...y maven-shade-plugin[
b=2
a=1]
> but was:<...y maven-shade-plugin[
b=2
a=1
]
>
Stack Trace:
org.junit.ComparisonFailure:
expected:<...y maven-shade-plugin[
b=2
a=1]
> but was:<...y maven-shade-plugin[
b=2
a=1
]
>
at org.apache.maven.plugins.shade.resource.properties.PropertiesTransformerTest.propertiesRewritingIsStable(PropertiesTransformerTest.java:62)
FAILED: org.apache.maven.plugins.shade.resource.properties.PropertiesTransformerTest.windows-jdk7-m3.5.x_build / Build windows-jdk7-m3.5.x_build / propertiesRewritingIsStable
Error Message:
expected:<...y maven-shade-plugin[
b=2
a=1]
> but was:<...y maven-shade-plugin[
b=2
a=1
]
>
Stack Trace:
org.junit.ComparisonFailure:
expected:<...y maven-shade-plugin[
b=2
a=1]
> but was:<...y maven-shade-plugin[
b=2
a=1
]
>
at org.apache.maven.plugins.shade.resource.properties.PropertiesTransformerTest.propertiesRewritingIsStable(PropertiesTransformerTest.java:62)
FAILED: org.apache.maven.plugins.shade.resource.properties.PropertiesTransformerTest.windows-jdk7-m3.6.x_build / Build windows-jdk7-m3.6.x_build / propertiesRewritingIsStable
Error Message:
expected:<...y maven-shade-plugin[
b=2
a=1]
> but was:<...y maven-shade-plugin[
b=2
a=1
]
>
Stack Trace:
org.junit.ComparisonFailure:
expected:<...y maven-shade-plugin[
b=2
a=1]
> but was:<...y maven-shade-plugin[
b=2
a=1
]
>
at org.apache.maven.plugins.shade.resource.properties.PropertiesTransformerTest.propertiesRewritingIsStable(PropertiesTransformerTest.java:62)
FAILED: org.apache.maven.plugins.shade.resource.properties.PropertiesTransformerTest.windows-jdk11-m3.6.x_build / Build windows-jdk11-m3.6.x_build / propertiesRewritingIsStable
Error Message:
expected:<...y maven-shade-plugin[
b=2
a=1]
> but was:<...y maven-shade-plugin[
a=1
b=2
]
>
Stack Trace:
org.junit.ComparisonFailure:
expected:<...y maven-shade-plugin[
b=2
a=1]
> but was:<...y maven-shade-plugin[
a=1
b=2
]
>
at org.apache.maven.plugins.shade.resource.properties.PropertiesTransformerTest.propertiesRewritingIsStable(PropertiesTransformerTest.java:62)
FAILED: org.apache.maven.plugins.shade.resource.properties.PropertiesTransformerTest.windows-jdk12-m3.6.x_build / Build windows-jdk12-m3.6.x_build / propertiesRewritingIsStable
Error Message:
expected:<...y maven-shade-plugin[
b=2
a=1]
> but was:<...y maven-shade-plugin[
a=1
b=2
]
>
Stack Trace:
org.junit.ComparisonFailure:
expected:<...y maven-shade-plugin[
b=2
a=1]
> but was:<...y maven-shade-plugin[
a=1
b=2
]
>
at org.apache.maven.plugins.shade.resource.properties.PropertiesTransformerTest.propertiesRewritingIsStable(PropertiesTransformerTest.java:62)
FAILED: org.apache.maven.plugins.shade.resource.properties.PropertiesTransformerTest.windows-jdk8-m3.6.x_build / Build windows-jdk8-m3.6.x_build / propertiesRewritingIsStable
Error Message:
expected:<...y maven-shade-plugin[
b=2
a=1]
> but was:<...y maven-shade-plugin[
b=2
a=1
]
>
Stack Trace:
org.junit.ComparisonFailure:
expected:<...y maven-shade-plugin[
b=2
a=1]
> but was:<...y maven-shade-plugin[
b=2
a=1
]
>
at org.apache.maven.plugins.shade.resource.properties.PropertiesTransformerTest.propertiesRewritingIsStable(PropertiesTransformerTest.java:62)
FAILED: org.apache.maven.plugins.shade.resource.properties.PropertiesTransformerTest.windows-jdk13-m3.6.x_build / Build windows-jdk13-m3.6.x_build / propertiesRewritingIsStable
Error Message:
expected:<...y maven-shade-plugin[
b=2
a=1]
> but was:<...y maven-shade-plugin[
a=1
b=2
]
>
Stack Trace:
org.junit.ComparisonFailure:
expected:<...y maven-shade-plugin[
b=2
a=1]
> but was:<...y maven-shade-plugin[
a=1
b=2
]
>
at org.apache.maven.plugins.shade.resource.properties.PropertiesTransformerTest.propertiesRewritingIsStable(PropertiesTransformerTest.java:62)
FAILED: org.apache.maven.plugins.shade.resource.properties.PropertiesTransformerTest.linux-jdk12-m3.6.x_build / Build linux-jdk12-m3.6.x_build / propertiesRewritingIsStable
Error Message:
expected:<... maven-shade-plugin
[b=2
a=1]
> but was:<... maven-shade-plugin
[a=1
b=2]
>
Stack Trace:
org.junit.ComparisonFailure:
expected:<... maven-shade-plugin
[b=2
a=1]
> but was:<... maven-shade-plugin
[a=1
b=2]
>
at org.apache.maven.plugins.shade.resource.properties.PropertiesTransformerTest.propertiesRewritingIsStable(PropertiesTransformerTest.java:62)
FAILED: org.apache.maven.plugins.shade.resource.properties.PropertiesTransformerTest.linux-jdk11-m3.6.x_build / Build linux-jdk11-m3.6.x_build / propertiesRewritingIsStable
Error Message:
expected:<... maven-shade-plugin
[b=2
a=1]
> but was:<... maven-shade-plugin
[a=1
b=2]
>
Stack Trace:
org.junit.ComparisonFailure:
expected:<... maven-shade-plugin
[b=2
a=1]
> but was:<... maven-shade-plugin
[a=1
b=2]
>
at org.apache.maven.plugins.shade.resource.properties.PropertiesTransformerTest.propertiesRewritingIsStable(PropertiesTransformerTest.java:62)
Build log:
[...truncated 8469 lines...]
[INFO] Building: MSHADE-105/pom.xml
[INFO] run post-build script verify.bsh
[INFO] MSHADE-105/pom.xml ............................... SUCCESS (22.9 s)
[INFO] Building: mini-jar/pom.xml
[INFO] run post-build script verify.bsh
[INFO] MSHADE-105/pom.xml ............................... SUCCESS (23.3 s)
[INFO] Building: mini-jar/pom.xml
[INFO] run post-build script verify.bsh
[INFO] mini-jar/pom.xml ................................. SUCCESS (5.4 s)
[INFO] Building: dep-reduced-pom-with-local-parent/pom.xml
[INFO] run post-build script verify.bsh
[INFO] mini-jar/pom.xml ................................. SUCCESS (4.9 s)
[INFO] Building: dep-reduced-pom-with-local-parent/pom.xml
[INFO] dep-reduced-pom-with-local-parent/pom.xml ........ SUCCESS (3.6 s)
[INFO] Building: finalNameShade-attached/pom.xml
[INFO] run pre-build script setup.bsh
[INFO] dep-reduced-pom-with-local-parent/pom.xml ........ SUCCESS (3.8 s)
[INFO] Building: finalNameShade-attached/pom.xml
[INFO] run pre-build script setup.bsh
[INFO] run post-build script verify.bsh
[INFO] finalNameShade-attached/pom.xml .................. SUCCESS (4.9 s)
[INFO] Building: reloc-includes-excludes/pom.xml
[INFO] run post-build script verify.bsh
[INFO] finalNameShade-attached/pom.xml .................. SUCCESS (5.2 s)
[INFO] Building: reloc-includes-excludes/pom.xml
[INFO] run post-build script verify.bsh
[INFO] reloc-includes-excludes/pom.xml .................. SUCCESS (4.9 s)
[INFO] Building: pom-packaging/pom.xml
[INFO] run post-build script verify.bsh
[INFO] reloc-includes-excludes/pom.xml .................. SUCCESS (4.9 s)
[INFO] Building: pom-packaging/pom.xml
[INFO] run post-build script verify.bsh
[INFO] pom-packaging/pom.xml ............................ SUCCESS (3.3 s)
[INFO] Building: rerun-with-reloc/pom.xml
[INFO] run post-build script verify.bsh
[INFO] pom-packaging/pom.xml ............................ SUCCESS (3.5 s)
[INFO] Building: rerun-with-reloc/pom.xml
[INFO] rerun-with-reloc/pom.xml ......................... SUCCESS (5.6 s)
[INFO] Building: empty-relocation-shaded-pattern/pom.xml
[INFO] rerun-with-reloc/pom.xml ......................... SUCCESS (5.7 s)
[INFO] Building: empty-relocation-shaded-pattern/pom.xml
[INFO] empty-relocation-shaded-pattern/pom.xml .......... SUCCESS (4.2 s)
[INFO] Building: dep-reduced-pom/pom.xml
[INFO] empty-relocation-shaded-pattern/pom.xml .......... SUCCESS (4.1 s)
[INFO] Building: dep-reduced-pom/pom.xml
[INFO] run post-build script verify.groovy
[INFO] run post-build script verify.groovy
[INFO] dep-reduced-pom/pom.xml .......................... SUCCESS (4.5 s)
[INFO] Building: artifact-includes-excludes/pom.xml
[INFO] dep-reduced-pom/pom.xml .......................... SUCCESS (4.9 s)
[INFO] Building: artifact-includes-excludes/pom.xml
[INFO] run post-build script verify.bsh
[INFO] artifact-includes-excludes/pom.xml ............... SUCCESS (5.1 s)
[INFO] Building: shadePomDependency/pom.xml
[INFO] run post-build script verify.bsh
[INFO] artifact-includes-excludes/pom.xml ............... SUCCESS (6.0 s)
[INFO] Building: shadePomDependency/pom.xml
[INFO] shadePomDependency/pom.xml ....................... SUCCESS (5.1 s)
[INFO] Building: finalNameShade/pom.xml
[INFO] run pre-build script setup.bsh
[INFO] shadePomDependency/pom.xml ....................... SUCCESS (6.0 s)
[INFO] Building: finalNameShade/pom.xml
[INFO] run pre-build script setup.bsh
[INFO] run post-build script verify.bsh
[INFO] finalNameShade/pom.xml ........................... SUCCESS (4.5 s)
[INFO] Building: duplicate-classes-with-reloc/pom.xml
[INFO] run post-build script verify.bsh
[INFO] finalNameShade/pom.xml ........................... SUCCESS (5.1 s)
[INFO] Building: duplicate-classes-with-reloc/pom.xml
[INFO] duplicate-classes-with-reloc/pom.xml ............. SUCCESS (4.1 s)
[INFO] Building: xml-transformer-ignores-dtd/pom.xml
[INFO] duplicate-classes-with-reloc/pom.xml ............. SUCCESS (5.1 s)
[INFO] Building: xml-transformer-ignores-dtd/pom.xml
[INFO] run post-build script verify.bsh
[INFO] xml-transformer-ignores-dtd/pom.xml .............. SUCCESS (4.9 s)
[INFO] Building: dep-reduced-pom-relocated-result/pom.xml
[INFO] run post-build script verify.bsh
[INFO] xml-transformer-ignores-dtd/pom.xml .............. SUCCESS (5.2 s)
[INFO] Building: dep-reduced-pom-relocated-result/pom.xml
[INFO] dep-reduced-pom-relocated-result/pom.xml ......... SUCCESS (3.9 s)
[INFO] Building: MSHADE-239_finalName-attachments/pom.xml
[INFO] dep-reduced-pom-relocated-result/pom.xml ......... SUCCESS (3.6 s)
[INFO] Building: MSHADE-239_finalName-attachments/pom.xml
[INFO] run post-build script verify.groovy
[INFO] MSHADE-239_finalName-attachments/pom.xml ......... SUCCESS (5.9 s)
[INFO] Building: empty-apache-notice-transform/pom.xml
[INFO] run post-build script verify.groovy
[INFO] MSHADE-239_finalName-attachments/pom.xml ......... SUCCESS (4.6 s)
[INFO] Building: empty-apache-notice-transform/pom.xml
[INFO] empty-apache-notice-transform/pom.xml ............ SUCCESS (7.5 s)
[INFO] Building: services-resource-transformer/pom.xml
[INFO] empty-apache-notice-transform/pom.xml ............ SUCCESS (6.8 s)
[INFO] Building: services-resource-transformer/pom.xml
[INFO] run post-build script verify.bsh
[INFO] services-resource-transformer/pom.xml ............ SUCCESS (4.7 s)
[INFO] Building: shading-with-java-8-sources/pom.xml
[INFO] run post-build script verify.bsh
[INFO] services-resource-transformer/pom.xml ............ SUCCESS (4.8 s)
[INFO] Building: shading-with-java-8-sources/pom.xml
[INFO] run post-build script verify.groovy
[INFO] shading-with-java-8-sources/pom.xml .............. SUCCESS (5.6 s)
[INFO] Building: plugin-descriptor-relocation/pom.xml
[INFO] run post-build script verify.groovy
[INFO] shading-with-java-8-sources/pom.xml .............. SUCCESS (5.5 s)
[INFO] Building: plugin-descriptor-relocation/pom.xml
[INFO] run post-build script verify.groovy
[INFO] plugin-descriptor-relocation/pom.xml ............. SUCCESS (22.7 s)
[INFO] Building: dep-reduced-pom-unique/pom.xml
[INFO] run post-build script verify.groovy
[INFO] plugin-descriptor-relocation/pom.xml ............. SUCCESS (23.7 s)
[INFO] Building: dep-reduced-pom-unique/pom.xml
[INFO] run post-build script verify.groovy
[INFO] dep-reduced-pom-unique/pom.xml ................... SUCCESS (5.4 s)
[INFO] Building: reloc-enum-ref-from-anno/pom.xml
[INFO] run post-build script verify.groovy
[INFO] dep-reduced-pom-unique/pom.xml ................... SUCCESS (5.0 s)
[INFO] Building: reloc-enum-ref-from-anno/pom.xml
[INFO] reloc-enum-ref-from-anno/pom.xml ................. SUCCESS (5.1 s)
[INFO] Building: mshade-123/pom.xml
[INFO] reloc-enum-ref-from-anno/pom.xml ................. SUCCESS (5.0 s)
[INFO] Building: mshade-123/pom.xml
[INFO] mshade-123/pom.xml ............................... SUCCESS (18.1 s)
[INFO] Building: shading-with-java-11-sources/pom.xml
[INFO] mshade-123/pom.xml ............................... SUCCESS (17.3 s)
[INFO] Building: shading-with-java-11-sources/pom.xml
[INFO] run post-build script verify.groovy
[INFO] shading-with-java-11-sources/pom.xml ............. SUCCESS (6.8 s)
[INFO] Building: finalNameBuild/pom.xml
[INFO] run pre-build script setup.bsh
[INFO] run post-build script verify.groovy
[INFO] shading-with-java-11-sources/pom.xml ............. SUCCESS (7.0 s)
[INFO] Building: finalNameBuild/pom.xml
[INFO] run pre-build script setup.bsh
[INFO] run post-build script verify.bsh
[INFO] finalNameBuild/pom.xml ........................... SUCCESS (5.1 s)
[INFO] Building: attached-artifact-type/pom.xml
[INFO] run post-build script verify.bsh
[INFO] finalNameBuild/pom.xml ........................... SUCCESS (4.8 s)
[INFO] Building: attached-artifact-type/pom.xml
[INFO] attached-artifact-type/pom.xml ................... SUCCESS (6.2 s)
[INFO] Building: implicit-inclusion-of-project-artifact/pom.xml
[INFO] attached-artifact-type/pom.xml ................... SUCCESS (5.8 s)
[INFO] Building: implicit-inclusion-of-project-artifact/pom.xml
[INFO] run post-build script verify.bsh
[INFO] implicit-inclusion-of-project-artifact/pom.xml ... SUCCESS (5.9 s)
[INFO]
[INFO] --- maven-checkstyle-plugin:3.0.0:check (checkstyle-check) @ maven-shade-plugin ---
[INFO] run post-build script verify.bsh
[INFO] implicit-inclusion-of-project-artifact/pom.xml ... SUCCESS (5.9 s)
[INFO]
[INFO] --- maven-checkstyle-plugin:3.0.0:check (checkstyle-check) @ maven-shade-plugin ---
[INFO] There are 3 errors reported by Checkstyle 6.18 with config/maven_checks.xml ruleset.
[INFO] Ignored 3 errors, 0 violation remaining.
[INFO]
[INFO] --- maven-invoker-plugin:3.1.0:verify (integration-test) @ maven-shade-plugin ---
[INFO] -------------------------------------------------
[INFO] Build Summary:
[INFO] Passed: 62, Failed: 0, Errors: 0, Skipped: 1
[INFO] -------------------------------------------------
[INFO] ------------------------------------------------------------------------
[INFO] BUILD SUCCESS
[INFO] ------------------------------------------------------------------------
[INFO] Total time: 17:26 min
[INFO] Finished at: 2019-08-10T10:50:27Z
[INFO] ------------------------------------------------------------------------
[INFO] [jenkins-event-spy] Generated /home/jenkins/jenkins-slave/workspace/en-box_maven-shade-plugin_master@3@2@tmp/withMaven475d7e61/maven-spy-20190810-103259-2278735049468472184377.log
[Pipeline] }
[Pipeline] // dir
[Pipeline] }
[INFO] There are 3 errors reported by Checkstyle 6.18 with config/maven_checks.xml ruleset.
[INFO] Ignored 3 errors, 0 violation remaining.
[INFO]
[INFO] --- maven-invoker-plugin:3.1.0:verify (integration-test) @ maven-shade-plugin ---
[INFO] -------------------------------------------------
[INFO] Build Summary:
[INFO] Passed: 62, Failed: 0, Errors: 0, Skipped: 1
[INFO] -------------------------------------------------
[INFO] ------------------------------------------------------------------------
[INFO] BUILD SUCCESS
[INFO] ------------------------------------------------------------------------
[INFO] Total time: 17:18 min
[INFO] Finished at: 2019-08-10T10:50:29Z
[INFO] ------------------------------------------------------------------------
[INFO] [jenkins-event-spy] Generated /home/jenkins/jenkins-slave/workspace/en-box_maven-shade-plugin_master@2@tmp/withMaven702dc146/maven-spy-20190810-103307-63315733303838745537885.log
[withMaven] artifactsPublisher - Archive artifact linux-jdk12-m3.6.x_build/pom.xml under org/apache/maven/plugins/maven-shade-plugin/3.2.2-SNAPSHOT/maven-shade-plugin-3.2.2-SNAPSHOT.pom
[Pipeline] }
[Pipeline] // dir
[Pipeline] }
[withMaven] artifactsPublisher - Archive artifact linux-jdk12-m3.6.x_build/target/maven-shade-plugin-3.2.2-SNAPSHOT.jar under org/apache/maven/plugins/maven-shade-plugin/3.2.2-SNAPSHOT/maven-shade-plugin-3.2.2-SNAPSHOT.jar
[withMaven] artifactsPublisher - Archive artifact linux-jdk12-m3.6.x_build/target/maven-shade-plugin-3.2.2-SNAPSHOT-tests.jar under org/apache/maven/plugins/maven-shade-plugin/3.2.2-SNAPSHOT/maven-shade-plugin-3.2.2-SNAPSHOT-tests.jar
[withMaven] artifactsPublisher - Archive artifact linux-jdk11-m3.6.x_build/pom.xml under org/apache/maven/plugins/maven-shade-plugin/3.2.2-SNAPSHOT/maven-shade-plugin-3.2.2-SNAPSHOT.pom
[withMaven] artifactsPublisher - Archive artifact linux-jdk11-m3.6.x_build/target/maven-shade-plugin-3.2.2-SNAPSHOT.jar under org/apache/maven/plugins/maven-shade-plugin/3.2.2-SNAPSHOT/maven-shade-plugin-3.2.2-SNAPSHOT.jar
[withMaven] artifactsPublisher - Archive artifact linux-jdk11-m3.6.x_build/target/maven-shade-plugin-3.2.2-SNAPSHOT-tests.jar under org/apache/maven/plugins/maven-shade-plugin/3.2.2-SNAPSHOT/maven-shade-plugin-3.2.2-SNAPSHOT-tests.jar
[withMaven] junitPublisher - Archive test results for Maven artifact org.apache.maven.plugins:maven-shade-plugin:maven-plugin:3.2.2-SNAPSHOT generated by maven-surefire-plugin:test (default-test): linux-jdk12-m3.6.x_build/target/surefire-reports/*.xml
Recording test results
[withMaven] junitPublisher - Archive test results for Maven artifact org.apache.maven.plugins:maven-shade-plugin:maven-plugin:3.2.2-SNAPSHOT generated by maven-surefire-plugin:test (default-test): linux-jdk11-m3.6.x_build/target/surefire-reports/*.xml
Recording test results
[withMaven] openTasksPublisher - Scan Tasks for Maven artifact org.apache.maven.plugins:maven-shade-plugin:maven-plugin:3.2.2-SNAPSHOT in source directory linux-jdk12-m3.6.x_build/src/main/java
[TASKS] Scanning folder '/home/jenkins/jenkins-slave/workspace/en-box_maven-shade-plugin_master@3@2' for files matching the pattern 'linux-jdk12-m3.6.x_build/src/main/java/**/*' - excludes: null
[TASKS] Found 37 files to scan for tasks
[TASKS] Found 2 open tasks.
Skipping warnings blame since pipelines do not have an SCM link.%n
[TASKS] Computing warning deltas based on reference build #14
[withMaven] invokerPublisher - Archive invoker results for Maven artifact MavenArtifact{org.apache.maven.plugins:maven-shade-plugin:maven-plugin:3.2.2-SNAPSHOT(version: 3.2.2-SNAPSHOT, snapshot:false) } generated by PluginInvocation{org.apache.maven.plugins:maven-invoker-plugin:3.1.0@integration-test integration-test}: linux-jdk12-m3.6.x_build/target/invoker-reports/*.xml
[withMaven] openTasksPublisher - Scan Tasks for Maven artifact org.apache.maven.plugins:maven-shade-plugin:maven-plugin:3.2.2-SNAPSHOT in source directory linux-jdk11-m3.6.x_build/src/main/java
[TASKS] Scanning folder '/home/jenkins/jenkins-slave/workspace/en-box_maven-shade-plugin_master@2' for files matching the pattern 'linux-jdk11-m3.6.x_build/src/main/java/**/*' - excludes: null
[TASKS] Found 37 files to scan for tasks
[TASKS] Found 2 open tasks.
Skipping warnings blame since pipelines do not have an SCM link.%n
[TASKS] Computing warning deltas based on reference build #14
[withMaven] invokerPublisher - Archive invoker results for Maven artifact MavenArtifact{org.apache.maven.plugins:maven-shade-plugin:maven-plugin:3.2.2-SNAPSHOT(version: 3.2.2-SNAPSHOT, snapshot:false) } generated by PluginInvocation{org.apache.maven.plugins:maven-invoker-plugin:3.1.0@integration-test integration-test}: linux-jdk11-m3.6.x_build/target/invoker-reports/*.xml
[withMaven] Publishers: Generated Artifacts Publisher: 2884 ms, Junit Publisher: 9212 ms, Open Task Scanner Publisher: 784 ms, Invoker Publisher: 59506 ms, Pipeline Graph Publisher: 28 ms
[Pipeline] // withMaven
[Pipeline] cleanWs
[WS-CLEANUP] Deleting project workspace...
[WS-CLEANUP] Deferred wipeout is used...
[WS-CLEANUP] done
[Pipeline] }
[Pipeline] // stage
[Pipeline] }
[Pipeline] // ws
[Pipeline] }
[Pipeline] // node
[Pipeline] }
[withMaven] Publishers: Generated Artifacts Publisher: 1902 ms, Junit Publisher: 18103 ms, Open Task Scanner Publisher: 707 ms, Invoker Publisher: 59589 ms, Pipeline Graph Publisher: 1 ms
[Pipeline] // withMaven
[Pipeline] cleanWs
[WS-CLEANUP] Deleting project workspace...
[WS-CLEANUP] Deferred wipeout is used...
[WS-CLEANUP] done
[Pipeline] }
[Pipeline] // stage
[Pipeline] }
[Pipeline] // ws
[Pipeline] }
[Pipeline] // node
[Pipeline] }
[Pipeline] // parallel
[Pipeline] stage
[Pipeline] { (Notifications)
[Pipeline] echo
Build result: UNSTABLE
[Pipeline] jiraIssueSelector
[Pipeline] jiraComment
[Pipeline] echo
The authors of changes [rmannibucau].
[Pipeline] echo
Sending email ...
[Pipeline] emailext
Build succeeded in Jenkins: Maven TLP » maven-shade-plugin » master #19
Posted by Apache Jenkins Server <je...@builds.apache.org>.
See https://builds.apache.org/job/maven-box/job/maven-shade-plugin/job/master/19/
Changes:
* [MSHADE-322][MSHADE-306] fixing Tibor's review comments and ensure
* [MSHADE-322][MSHADE-306] fixing Tibor's review comments and ensure
* [MSHADE-322][MSHADE-306] fixing Tibor's review comments and ensure
* [MSHADE-322][MSHADE-306] fixing Tibor's review comments and ensure
* [MSHADE-322][MSHADE-306] fixing Tibor's review comments and ensure
* [MSHADE-322][MSHADE-306] fixing Tibor's review comments and ensure
* [MSHADE-322][MSHADE-306] fixing Tibor's review comments and ensure
* [MSHADE-322][MSHADE-306] fixing Tibor's review comments and ensure
* [MSHADE-322][MSHADE-306] fixing Tibor's review comments and ensure
* [MSHADE-322][MSHADE-306] fixing Tibor's review comments and ensure
* [MSHADE-322][MSHADE-306] fixing Tibor's review comments and ensure
* [MSHADE-322][MSHADE-306] fixing Tibor's review comments and ensure
* [MSHADE-322][MSHADE-306] fixing Tibor's review comments and ensure
* [MSHADE-322][MSHADE-306] fixing Tibor's review comments and ensure
All tests passed
Build unstable in Jenkins: Maven TLP » maven-shade-plugin » master #18
Posted by Apache Jenkins Server <je...@builds.apache.org>.
See https://builds.apache.org/job/maven-box/job/maven-shade-plugin/job/master/18/
No changes.
8 tests failed.
FAILED: org.apache.maven.plugins.shade.DefaultShaderTest.windows-jdk7-m3.2.x_build / Build windows-jdk7-m3.2.x_build / testOverlappingResourcesAreLogged
Error Message:
[Processing JAR src\test\jars\test-project-1.0-SNAPSHOT.jar, Processing JAR src\test\jars\plexus-utils-1.4.1.jar, We have a duplicate META-INF/MANIFEST.MF in src\test\jars\plexus-utils-1.4.1.jar]
Stack Trace:
junit.framework.AssertionFailedError: [Processing JAR src\test\jars\test-project-1.0-SNAPSHOT.jar, Processing JAR src\test\jars\plexus-utils-1.4.1.jar, We have a duplicate META-INF/MANIFEST.MF in src\test\jars\plexus-utils-1.4.1.jar]
at org.apache.maven.plugins.shade.DefaultShaderTest.testOverlappingResourcesAreLogged(DefaultShaderTest.java:122)
FAILED: org.apache.maven.plugins.shade.DefaultShaderTest.windows-jdk7-m3.3.x_build / Build windows-jdk7-m3.3.x_build / testOverlappingResourcesAreLogged
Error Message:
[Processing JAR src\test\jars\test-project-1.0-SNAPSHOT.jar, Processing JAR src\test\jars\plexus-utils-1.4.1.jar, We have a duplicate META-INF/MANIFEST.MF in src\test\jars\plexus-utils-1.4.1.jar]
Stack Trace:
junit.framework.AssertionFailedError: [Processing JAR src\test\jars\test-project-1.0-SNAPSHOT.jar, Processing JAR src\test\jars\plexus-utils-1.4.1.jar, We have a duplicate META-INF/MANIFEST.MF in src\test\jars\plexus-utils-1.4.1.jar]
at org.apache.maven.plugins.shade.DefaultShaderTest.testOverlappingResourcesAreLogged(DefaultShaderTest.java:122)
FAILED: org.apache.maven.plugins.shade.DefaultShaderTest.windows-jdk7-m3.5.x_build / Build windows-jdk7-m3.5.x_build / testOverlappingResourcesAreLogged
Error Message:
[Processing JAR src\test\jars\test-project-1.0-SNAPSHOT.jar, Processing JAR src\test\jars\plexus-utils-1.4.1.jar, We have a duplicate META-INF/MANIFEST.MF in src\test\jars\plexus-utils-1.4.1.jar]
Stack Trace:
junit.framework.AssertionFailedError: [Processing JAR src\test\jars\test-project-1.0-SNAPSHOT.jar, Processing JAR src\test\jars\plexus-utils-1.4.1.jar, We have a duplicate META-INF/MANIFEST.MF in src\test\jars\plexus-utils-1.4.1.jar]
at org.apache.maven.plugins.shade.DefaultShaderTest.testOverlappingResourcesAreLogged(DefaultShaderTest.java:122)
FAILED: org.apache.maven.plugins.shade.DefaultShaderTest.windows-jdk8-m3.6.x_build / Build windows-jdk8-m3.6.x_build / testOverlappingResourcesAreLogged
Error Message:
[Processing JAR src\test\jars\test-project-1.0-SNAPSHOT.jar, Processing JAR src\test\jars\plexus-utils-1.4.1.jar, We have a duplicate META-INF/MANIFEST.MF in src\test\jars\plexus-utils-1.4.1.jar]
Stack Trace:
junit.framework.AssertionFailedError: [Processing JAR src\test\jars\test-project-1.0-SNAPSHOT.jar, Processing JAR src\test\jars\plexus-utils-1.4.1.jar, We have a duplicate META-INF/MANIFEST.MF in src\test\jars\plexus-utils-1.4.1.jar]
at org.apache.maven.plugins.shade.DefaultShaderTest.testOverlappingResourcesAreLogged(DefaultShaderTest.java:122)
FAILED: org.apache.maven.plugins.shade.DefaultShaderTest.windows-jdk7-m3.6.x_build / Build windows-jdk7-m3.6.x_build / testOverlappingResourcesAreLogged
Error Message:
[Processing JAR src\test\jars\test-project-1.0-SNAPSHOT.jar, Processing JAR src\test\jars\plexus-utils-1.4.1.jar, We have a duplicate META-INF/MANIFEST.MF in src\test\jars\plexus-utils-1.4.1.jar]
Stack Trace:
junit.framework.AssertionFailedError: [Processing JAR src\test\jars\test-project-1.0-SNAPSHOT.jar, Processing JAR src\test\jars\plexus-utils-1.4.1.jar, We have a duplicate META-INF/MANIFEST.MF in src\test\jars\plexus-utils-1.4.1.jar]
at org.apache.maven.plugins.shade.DefaultShaderTest.testOverlappingResourcesAreLogged(DefaultShaderTest.java:122)
FAILED: org.apache.maven.plugins.shade.DefaultShaderTest.windows-jdk11-m3.6.x_build / Build windows-jdk11-m3.6.x_build / testOverlappingResourcesAreLogged
Error Message:
[Processing JAR src\test\jars\test-project-1.0-SNAPSHOT.jar, Processing JAR src\test\jars\plexus-utils-1.4.1.jar, We have a duplicate META-INF/MANIFEST.MF in src\test\jars\plexus-utils-1.4.1.jar]
Stack Trace:
junit.framework.AssertionFailedError: [Processing JAR src\test\jars\test-project-1.0-SNAPSHOT.jar, Processing JAR src\test\jars\plexus-utils-1.4.1.jar, We have a duplicate META-INF/MANIFEST.MF in src\test\jars\plexus-utils-1.4.1.jar]
at org.apache.maven.plugins.shade.DefaultShaderTest.testOverlappingResourcesAreLogged(DefaultShaderTest.java:122)
FAILED: org.apache.maven.plugins.shade.DefaultShaderTest.windows-jdk12-m3.6.x_build / Build windows-jdk12-m3.6.x_build / testOverlappingResourcesAreLogged
Error Message:
[Processing JAR src\test\jars\test-project-1.0-SNAPSHOT.jar, Processing JAR src\test\jars\plexus-utils-1.4.1.jar, We have a duplicate META-INF/MANIFEST.MF in src\test\jars\plexus-utils-1.4.1.jar]
Stack Trace:
junit.framework.AssertionFailedError: [Processing JAR src\test\jars\test-project-1.0-SNAPSHOT.jar, Processing JAR src\test\jars\plexus-utils-1.4.1.jar, We have a duplicate META-INF/MANIFEST.MF in src\test\jars\plexus-utils-1.4.1.jar]
at org.apache.maven.plugins.shade.DefaultShaderTest.testOverlappingResourcesAreLogged(DefaultShaderTest.java:122)
FAILED: org.apache.maven.plugins.shade.DefaultShaderTest.windows-jdk13-m3.6.x_build / Build windows-jdk13-m3.6.x_build / testOverlappingResourcesAreLogged
Error Message:
[Processing JAR src\test\jars\test-project-1.0-SNAPSHOT.jar, Processing JAR src\test\jars\plexus-utils-1.4.1.jar, We have a duplicate META-INF/MANIFEST.MF in src\test\jars\plexus-utils-1.4.1.jar]
Stack Trace:
junit.framework.AssertionFailedError: [Processing JAR src\test\jars\test-project-1.0-SNAPSHOT.jar, Processing JAR src\test\jars\plexus-utils-1.4.1.jar, We have a duplicate META-INF/MANIFEST.MF in src\test\jars\plexus-utils-1.4.1.jar]
at org.apache.maven.plugins.shade.DefaultShaderTest.testOverlappingResourcesAreLogged(DefaultShaderTest.java:122)
Build log:
[...truncated 7892 lines...]
[INFO] Building: rerun-with-reloc/pom.xml
[INFO] empty-relocation-pattern/pom.xml ................. SUCCESS (4.8 s)
[INFO] Building: MSHADE-185/pom.xml
[INFO] run post-build script verify.bsh
[INFO] non-runtime-scope-excluded/pom.xml ............... SUCCESS (5.0 s)
[INFO]
[INFO] --- maven-checkstyle-plugin:3.0.0:check (checkstyle-check) @ maven-shade-plugin ---
[INFO] There are 3 errors reported by Checkstyle 6.18 with config/maven_checks.xml ruleset.
[INFO] rerun-with-reloc/pom.xml ......................... SUCCESS (5.9 s)
[INFO] Building: mini-jar/pom.xml
[INFO] mini-jar/pom.xml ................................. SKIPPED due to JRE version
[INFO] Building: MSHADE-258_module_relocation/pom.xml
[INFO] Ignored 3 errors, 0 violation remaining.
[INFO]
[INFO] --- maven-invoker-plugin:3.1.0:verify (integration-test) @ maven-shade-plugin ---
[INFO] -------------------------------------------------
[INFO] Build Summary:
[INFO] Passed: 62, Failed: 0, Errors: 0, Skipped: 1
[INFO] -------------------------------------------------
[INFO] ------------------------------------------------------------------------
[INFO] BUILD SUCCESS
[INFO] ------------------------------------------------------------------------
[INFO] Total time: 07:07 min
[INFO] Finished at: 2019-08-13T14:39:19Z
[INFO] ------------------------------------------------------------------------
[INFO] [jenkins-event-spy] Generated /home/jenkins/jenkins-slave/workspace/en-box_maven-shade-plugin_master@2@tmp/withMaven7e84ef9d/maven-spy-20190813-143209-6679145092821355902091.log
[Pipeline] }
[Pipeline] // dir
[Pipeline] }
[withMaven] artifactsPublisher - Archive artifact linux-jdk13-m3.6.x_build/pom.xml under org/apache/maven/plugins/maven-shade-plugin/3.2.2-SNAPSHOT/maven-shade-plugin-3.2.2-SNAPSHOT.pom
[withMaven] artifactsPublisher - Archive artifact linux-jdk13-m3.6.x_build/target/maven-shade-plugin-3.2.2-SNAPSHOT.jar under org/apache/maven/plugins/maven-shade-plugin/3.2.2-SNAPSHOT/maven-shade-plugin-3.2.2-SNAPSHOT.jar
[withMaven] artifactsPublisher - Archive artifact linux-jdk13-m3.6.x_build/target/maven-shade-plugin-3.2.2-SNAPSHOT-tests.jar under org/apache/maven/plugins/maven-shade-plugin/3.2.2-SNAPSHOT/maven-shade-plugin-3.2.2-SNAPSHOT-tests.jar
[withMaven] junitPublisher - Archive test results for Maven artifact org.apache.maven.plugins:maven-shade-plugin:maven-plugin:3.2.2-SNAPSHOT generated by maven-surefire-plugin:test (default-test): linux-jdk13-m3.6.x_build/target/surefire-reports/*.xml
Recording test results
[INFO] run post-build script verify.groovy
[INFO] MSHADE-185/pom.xml ............................... SUCCESS (6.7 s)
[INFO] Building: finalNameShade/pom.xml
[INFO] run pre-build script setup.bsh
[INFO] run post-build script verify.groovy
[INFO] MSHADE-258_module_relocation/pom.xml ............. SUCCESS (5.2 s)
[INFO] Building: project-with-reactors-included/pom.xml
[INFO] run post-build script verify.bsh
[INFO] finalNameShade/pom.xml ........................... SUCCESS (4.8 s)
[INFO] Building: MSHADE-313_minimized-services/pom.xml
[INFO] MSHADE-313_minimized-services/pom.xml ............ SKIPPED due to JRE version
[INFO] Building: shading-with-java-11-sources/pom.xml
[INFO] shading-with-java-11-sources/pom.xml ............. SKIPPED due to JRE version
[INFO] Building: mini-jar-respect-includes/pom.xml
[INFO] mini-jar-respect-includes/pom.xml ................ SKIPPED due to JRE version
[INFO] Building: rerun-without-reloc/pom.xml
[INFO] run post-build script verify.bsh
[INFO] project-with-reactors-included/pom.xml ........... SUCCESS (6.9 s)
[INFO] Building: dep-reduced-pom/pom.xml
[withMaven] Publishers: Generated Artifacts Publisher: 158 ms, Junit Publisher: 533 ms, Open Task Scanner Publisher: 116 ms, Invoker Publisher: 22989 ms, Pipeline Graph Publisher: 2 ms
[withMaven] Publishers: Generated Artifacts Publisher: 146 ms, Junit Publisher: 493 ms, Open Task Scanner Publisher: 121 ms, Invoker Publisher: 29116 ms, Pipeline Graph Publisher: 1 ms
[Pipeline] // withMaven
[withMaven] Publishers: Generated Artifacts Publisher: 207 ms, Junit Publisher: 956 ms, Open Task Scanner Publisher: 157 ms, Invoker Publisher: 32289 ms, Pipeline Graph Publisher: 1 ms
[Pipeline] // withMaven
[Pipeline] cleanWs
[WS-CLEANUP] Deleting project workspace...
[WS-CLEANUP] Deferred wipeout is used...
[Pipeline] cleanWs
[WS-CLEANUP] Deleting project workspace...
[WS-CLEANUP] Deferred wipeout is used...
[Pipeline] // withMaven
[WS-CLEANUP] done
[WS-CLEANUP] done
[Pipeline] cleanWs
[Pipeline] }
[Pipeline] }
[WS-CLEANUP] Deleting project workspace...
[WS-CLEANUP] Deferred wipeout is used...
[Pipeline] // stage
[Pipeline] // stage
[Pipeline] }
[WS-CLEANUP] done
[Pipeline] }
[Pipeline] // ws
[Pipeline] // ws
[Pipeline] }
[Pipeline] }
[Pipeline] }
[Pipeline] // node
[Pipeline] // node
[Pipeline] // stage
[Pipeline] }
[Pipeline] }
[Pipeline] }
[Pipeline] // ws
[Pipeline] }
[withMaven] openTasksPublisher - Scan Tasks for Maven artifact org.apache.maven.plugins:maven-shade-plugin:maven-plugin:3.2.2-SNAPSHOT in source directory linux-jdk13-m3.6.x_build/src/main/java
[Pipeline] // node
[Pipeline] }
[INFO] rerun-without-reloc/pom.xml ...................... SUCCESS (4.6 s)
[INFO] Building: reloc-class-from-string-pool/pom.xml
[TASKS] Scanning folder '/home/jenkins/jenkins-slave/workspace/en-box_maven-shade-plugin_master@2' for files matching the pattern 'linux-jdk13-m3.6.x_build/src/main/java/**/*' - excludes: null
[TASKS] Found 38 files to scan for tasks
[TASKS] Found 2 open tasks.
Skipping warnings blame since pipelines do not have an SCM link.%n
[TASKS] Computing warning deltas based on reference build #17
[withMaven] invokerPublisher - Archive invoker results for Maven artifact MavenArtifact{org.apache.maven.plugins:maven-shade-plugin:maven-plugin:3.2.2-SNAPSHOT(version: 3.2.2-SNAPSHOT, snapshot:false) } generated by PluginInvocation{org.apache.maven.plugins:maven-invoker-plugin:3.1.0@integration-test integration-test}: linux-jdk13-m3.6.x_build/target/invoker-reports/*.xml
[INFO] run post-build script verify.groovy
[INFO] dep-reduced-pom/pom.xml .......................... SUCCESS (5.1 s)
[INFO] Building: dep-reduced-pom-unique/pom.xml
[INFO] reloc-class-from-string-pool/pom.xml ............. SUCCESS (4.7 s)
[INFO] Building: dep-reduced-pom-with-local-parent/pom.xml
[INFO] dep-reduced-pom-with-local-parent/pom.xml ........ SUCCESS (3.8 s)
[INFO] Building: finalNameBuild/pom.xml
[INFO] run pre-build script setup.bsh
[INFO] run post-build script verify.groovy
[INFO] dep-reduced-pom-unique/pom.xml ................... SUCCESS (5.3 s)
[INFO] Building: MSHADE-133/pom.xml
[INFO] run post-build script verify.bsh
[INFO] finalNameBuild/pom.xml ........................... SUCCESS (4.4 s)
[INFO] Building: shadePomDependency/pom.xml
[INFO] run post-build script verify.groovy
[INFO] MSHADE-133/pom.xml ............................... SUCCESS (4.7 s)
[INFO]
[INFO] --- maven-checkstyle-plugin:3.0.0:check (checkstyle-check) @ maven-shade-plugin ---
[INFO] shadePomDependency/pom.xml ....................... SUCCESS (5.3 s)
[INFO] Building: empty-relocation-shaded-pattern/pom.xml
[INFO] There are 3 errors reported by Checkstyle 6.18 with config/maven_checks.xml ruleset.
[INFO] Ignored 3 errors, 0 violation remaining.
[INFO]
[INFO] --- maven-invoker-plugin:3.1.0:verify (integration-test) @ maven-shade-plugin ---
[INFO] -------------------------------------------------
[INFO] Build Summary:
[INFO] Passed: 52, Failed: 0, Errors: 0, Skipped: 11
[INFO] -------------------------------------------------
[INFO] ------------------------------------------------------------------------
[INFO] BUILD SUCCESS
[INFO] ------------------------------------------------------------------------
[INFO] Total time: 07:32 min
[INFO] Finished at: 2019-08-13T14:39:52Z
[INFO] ------------------------------------------------------------------------
[INFO] [jenkins-event-spy] Generated /home/jenkins/jenkins-slave/workspace/en-box_maven-shade-plugin_master@2@tmp/withMaven1a24f87a/maven-spy-20190813-143219-410568139242883755441.log
[Pipeline] }
[Pipeline] // dir
[Pipeline] }
[withMaven] artifactsPublisher - Archive artifact linux-jdk7-m3.5.x_build/pom.xml under org/apache/maven/plugins/maven-shade-plugin/3.2.2-SNAPSHOT/maven-shade-plugin-3.2.2-SNAPSHOT.pom
[INFO] empty-relocation-shaded-pattern/pom.xml .......... SUCCESS (4.4 s)
[INFO] Building: reloc-includes-excludes/pom.xml
[withMaven] artifactsPublisher - Archive artifact linux-jdk7-m3.5.x_build/target/maven-shade-plugin-3.2.2-SNAPSHOT.jar under org/apache/maven/plugins/maven-shade-plugin/3.2.2-SNAPSHOT/maven-shade-plugin-3.2.2-SNAPSHOT.jar
[withMaven] artifactsPublisher - Archive artifact linux-jdk7-m3.5.x_build/target/maven-shade-plugin-3.2.2-SNAPSHOT-tests.jar under org/apache/maven/plugins/maven-shade-plugin/3.2.2-SNAPSHOT/maven-shade-plugin-3.2.2-SNAPSHOT-tests.jar
[withMaven] junitPublisher - Archive test results for Maven artifact org.apache.maven.plugins:maven-shade-plugin:maven-plugin:3.2.2-SNAPSHOT generated by maven-surefire-plugin:test (default-test): linux-jdk7-m3.5.x_build/target/surefire-reports/*.xml
Recording test results
[INFO] run post-build script verify.bsh
[INFO] reloc-includes-excludes/pom.xml .................. SUCCESS (5.1 s)
[INFO] Building: manifest-retained/pom.xml
[INFO] run post-build script verify.bsh
[INFO] manifest-retained/pom.xml ........................ SUCCESS (5.7 s)
[INFO] Building: shading-with-java-10-sources/pom.xml
[INFO] shading-with-java-10-sources/pom.xml ............. SKIPPED due to JRE version
[INFO] Building: plugin-descriptor-relocation/pom.xml
[withMaven] openTasksPublisher - Scan Tasks for Maven artifact org.apache.maven.plugins:maven-shade-plugin:maven-plugin:3.2.2-SNAPSHOT in source directory linux-jdk7-m3.5.x_build/src/main/java
[TASKS] Scanning folder '/home/jenkins/jenkins-slave/workspace/en-box_maven-shade-plugin_master@2' for files matching the pattern 'linux-jdk7-m3.5.x_build/src/main/java/**/*' - excludes: null
[TASKS] Found 38 files to scan for tasks
[TASKS] Found 2 open tasks.
Skipping warnings blame since pipelines do not have an SCM link.%n
[TASKS] Computing warning deltas based on reference build #17
[withMaven] invokerPublisher - Archive invoker results for Maven artifact MavenArtifact{org.apache.maven.plugins:maven-shade-plugin:maven-plugin:3.2.2-SNAPSHOT(version: 3.2.2-SNAPSHOT, snapshot:false) } generated by PluginInvocation{org.apache.maven.plugins:maven-invoker-plugin:3.1.0@integration-test integration-test}: linux-jdk7-m3.5.x_build/target/invoker-reports/*.xml
[INFO] run post-build script verify.groovy
[INFO] plugin-descriptor-relocation/pom.xml ............. SUCCESS (14.6 s)
[INFO] Building: MSHADE-133/pom.xml
[INFO] run post-build script verify.groovy
[INFO] MSHADE-133/pom.xml ............................... SUCCESS (4.4 s)
[INFO]
[INFO] --- maven-checkstyle-plugin:3.0.0:check (checkstyle-check) @ maven-shade-plugin ---
[INFO] There are 3 errors reported by Checkstyle 6.18 with config/maven_checks.xml ruleset.
[INFO] Ignored 3 errors, 0 violation remaining.
[INFO]
[INFO] --- maven-invoker-plugin:3.1.0:verify (integration-test) @ maven-shade-plugin ---
[INFO] -------------------------------------------------
[INFO] Build Summary:
[INFO] Passed: 52, Failed: 0, Errors: 0, Skipped: 11
[INFO] -------------------------------------------------
[INFO] ------------------------------------------------------------------------
[INFO] BUILD SUCCESS
[INFO] ------------------------------------------------------------------------
[INFO] Total time: 08:13 min
[INFO] Finished at: 2019-08-13T14:40:30+00:00
[INFO] Final Memory: 48M/1431M
[INFO] ------------------------------------------------------------------------
[INFO] [jenkins-event-spy] Generated /home/jenkins/jenkins-slave/workspace/en-box_maven-shade-plugin_master@2@tmp/withMavend1b0d841/maven-spy-20190813-143216-835832644170753584299.log
[Pipeline] }
[Pipeline] // dir
[Pipeline] }
[withMaven] artifactsPublisher - Archive artifact linux-jdk7-m3.2.x_build/pom.xml under org/apache/maven/plugins/maven-shade-plugin/3.2.2-SNAPSHOT/maven-shade-plugin-3.2.2-SNAPSHOT.pom
[withMaven] artifactsPublisher - Archive artifact linux-jdk7-m3.2.x_build/target/maven-shade-plugin-3.2.2-SNAPSHOT.jar under org/apache/maven/plugins/maven-shade-plugin/3.2.2-SNAPSHOT/maven-shade-plugin-3.2.2-SNAPSHOT.jar
[withMaven] artifactsPublisher - Archive artifact linux-jdk7-m3.2.x_build/target/maven-shade-plugin-3.2.2-SNAPSHOT-tests.jar under org/apache/maven/plugins/maven-shade-plugin/3.2.2-SNAPSHOT/maven-shade-plugin-3.2.2-SNAPSHOT-tests.jar
[withMaven] Publishers: Generated Artifacts Publisher: 1625 ms, Junit Publisher: 9092 ms, Open Task Scanner Publisher: 751 ms, Invoker Publisher: 60348 ms, Pipeline Graph Publisher: 1 ms
[withMaven] junitPublisher - Archive test results for Maven artifact org.apache.maven.plugins:maven-shade-plugin:maven-plugin:3.2.2-SNAPSHOT generated by maven-surefire-plugin:test (default-test): linux-jdk7-m3.2.x_build/target/surefire-reports/*.xml
Recording test results
[Pipeline] // withMaven
[Pipeline] cleanWs
[WS-CLEANUP] Deleting project workspace...
[WS-CLEANUP] Deferred wipeout is used...
[withMaven] openTasksPublisher - Scan Tasks for Maven artifact org.apache.maven.plugins:maven-shade-plugin:maven-plugin:3.2.2-SNAPSHOT in source directory linux-jdk7-m3.2.x_build/src/main/java
[WS-CLEANUP] done
[Pipeline] }
[TASKS] Scanning folder '/home/jenkins/jenkins-slave/workspace/en-box_maven-shade-plugin_master@2' for files matching the pattern 'linux-jdk7-m3.2.x_build/src/main/java/**/*' - excludes: null
[TASKS] Found 38 files to scan for tasks
[TASKS] Found 2 open tasks.
Skipping warnings blame since pipelines do not have an SCM link.%n
[TASKS] Computing warning deltas based on reference build #17
[Pipeline] // stage
[Pipeline] }
[Pipeline] // ws
[Pipeline] }
[Pipeline] // node
[Pipeline] }
[withMaven] invokerPublisher - Archive invoker results for Maven artifact MavenArtifact{org.apache.maven.plugins:maven-shade-plugin:maven-plugin:3.2.2-SNAPSHOT(version: 3.2.2-SNAPSHOT, snapshot:false) } generated by PluginInvocation{org.apache.maven.plugins:maven-invoker-plugin:3.1.0@integration-test integration-test}: linux-jdk7-m3.2.x_build/target/invoker-reports/*.xml
[withMaven] Publishers: Generated Artifacts Publisher: 1843 ms, Junit Publisher: 9513 ms, Open Task Scanner Publisher: 855 ms, Invoker Publisher: 57818 ms, Pipeline Graph Publisher: 1 ms
[Pipeline] // withMaven
[Pipeline] cleanWs
[WS-CLEANUP] Deleting project workspace...
[WS-CLEANUP] Deferred wipeout is used...
[WS-CLEANUP] done
[Pipeline] }
[Pipeline] // stage
[Pipeline] }
[Pipeline] // ws
[Pipeline] }
[Pipeline] // node
[Pipeline] }
[withMaven] Publishers: Generated Artifacts Publisher: 1572 ms, Junit Publisher: 9177 ms, Open Task Scanner Publisher: 705 ms, Invoker Publisher: 57322 ms, Pipeline Graph Publisher: 1 ms
[Pipeline] // withMaven
[Pipeline] cleanWs
[WS-CLEANUP] Deleting project workspace...
[WS-CLEANUP] Deferred wipeout is used...
[WS-CLEANUP] done
[Pipeline] }
[Pipeline] // stage
[Pipeline] }
[Pipeline] // ws
[Pipeline] }
[Pipeline] // node
[Pipeline] }
[Pipeline] // parallel
[Pipeline] stage
[Pipeline] { (Notifications)
[Pipeline] echo
Build result: UNSTABLE
[Pipeline] jiraIssueSelector
[Pipeline] echo
The authors of changes [].
[Pipeline] echo
Sending email ...
[Pipeline] emailext
Build unstable in Jenkins: Maven TLP » maven-shade-plugin » master #17
Posted by Apache Jenkins Server <je...@builds.apache.org>.
See https://builds.apache.org/job/maven-box/job/maven-shade-plugin/job/master/17/
No changes.
8 tests failed.
FAILED: org.apache.maven.plugins.shade.DefaultShaderTest.windows-jdk7-m3.6.x_build / Build windows-jdk7-m3.6.x_build / testOverlappingResourcesAreLogged
Error Message:
[Processing JAR src\test\jars\test-project-1.0-SNAPSHOT.jar, Processing JAR src\test\jars\plexus-utils-1.4.1.jar, We have a duplicate META-INF/MANIFEST.MF in src\test\jars\plexus-utils-1.4.1.jar]
Stack Trace:
junit.framework.AssertionFailedError: [Processing JAR src\test\jars\test-project-1.0-SNAPSHOT.jar, Processing JAR src\test\jars\plexus-utils-1.4.1.jar, We have a duplicate META-INF/MANIFEST.MF in src\test\jars\plexus-utils-1.4.1.jar]
at org.apache.maven.plugins.shade.DefaultShaderTest.testOverlappingResourcesAreLogged(DefaultShaderTest.java:122)
FAILED: org.apache.maven.plugins.shade.DefaultShaderTest.windows-jdk7-m3.2.x_build / Build windows-jdk7-m3.2.x_build / testOverlappingResourcesAreLogged
Error Message:
[Processing JAR src\test\jars\test-project-1.0-SNAPSHOT.jar, Processing JAR src\test\jars\plexus-utils-1.4.1.jar, We have a duplicate META-INF/MANIFEST.MF in src\test\jars\plexus-utils-1.4.1.jar]
Stack Trace:
junit.framework.AssertionFailedError: [Processing JAR src\test\jars\test-project-1.0-SNAPSHOT.jar, Processing JAR src\test\jars\plexus-utils-1.4.1.jar, We have a duplicate META-INF/MANIFEST.MF in src\test\jars\plexus-utils-1.4.1.jar]
at org.apache.maven.plugins.shade.DefaultShaderTest.testOverlappingResourcesAreLogged(DefaultShaderTest.java:122)
FAILED: org.apache.maven.plugins.shade.DefaultShaderTest.windows-jdk7-m3.3.x_build / Build windows-jdk7-m3.3.x_build / testOverlappingResourcesAreLogged
Error Message:
[Processing JAR src\test\jars\test-project-1.0-SNAPSHOT.jar, Processing JAR src\test\jars\plexus-utils-1.4.1.jar, We have a duplicate META-INF/MANIFEST.MF in src\test\jars\plexus-utils-1.4.1.jar]
Stack Trace:
junit.framework.AssertionFailedError: [Processing JAR src\test\jars\test-project-1.0-SNAPSHOT.jar, Processing JAR src\test\jars\plexus-utils-1.4.1.jar, We have a duplicate META-INF/MANIFEST.MF in src\test\jars\plexus-utils-1.4.1.jar]
at org.apache.maven.plugins.shade.DefaultShaderTest.testOverlappingResourcesAreLogged(DefaultShaderTest.java:122)
FAILED: org.apache.maven.plugins.shade.DefaultShaderTest.windows-jdk7-m3.5.x_build / Build windows-jdk7-m3.5.x_build / testOverlappingResourcesAreLogged
Error Message:
[Processing JAR src\test\jars\test-project-1.0-SNAPSHOT.jar, Processing JAR src\test\jars\plexus-utils-1.4.1.jar, We have a duplicate META-INF/MANIFEST.MF in src\test\jars\plexus-utils-1.4.1.jar]
Stack Trace:
junit.framework.AssertionFailedError: [Processing JAR src\test\jars\test-project-1.0-SNAPSHOT.jar, Processing JAR src\test\jars\plexus-utils-1.4.1.jar, We have a duplicate META-INF/MANIFEST.MF in src\test\jars\plexus-utils-1.4.1.jar]
at org.apache.maven.plugins.shade.DefaultShaderTest.testOverlappingResourcesAreLogged(DefaultShaderTest.java:122)
FAILED: org.apache.maven.plugins.shade.DefaultShaderTest.windows-jdk8-m3.6.x_build / Build windows-jdk8-m3.6.x_build / testOverlappingResourcesAreLogged
Error Message:
[Processing JAR src\test\jars\test-project-1.0-SNAPSHOT.jar, Processing JAR src\test\jars\plexus-utils-1.4.1.jar, We have a duplicate META-INF/MANIFEST.MF in src\test\jars\plexus-utils-1.4.1.jar]
Stack Trace:
junit.framework.AssertionFailedError: [Processing JAR src\test\jars\test-project-1.0-SNAPSHOT.jar, Processing JAR src\test\jars\plexus-utils-1.4.1.jar, We have a duplicate META-INF/MANIFEST.MF in src\test\jars\plexus-utils-1.4.1.jar]
at org.apache.maven.plugins.shade.DefaultShaderTest.testOverlappingResourcesAreLogged(DefaultShaderTest.java:122)
FAILED: org.apache.maven.plugins.shade.DefaultShaderTest.windows-jdk11-m3.6.x_build / Build windows-jdk11-m3.6.x_build / testOverlappingResourcesAreLogged
Error Message:
[Processing JAR src\test\jars\test-project-1.0-SNAPSHOT.jar, Processing JAR src\test\jars\plexus-utils-1.4.1.jar, We have a duplicate META-INF/MANIFEST.MF in src\test\jars\plexus-utils-1.4.1.jar]
Stack Trace:
junit.framework.AssertionFailedError: [Processing JAR src\test\jars\test-project-1.0-SNAPSHOT.jar, Processing JAR src\test\jars\plexus-utils-1.4.1.jar, We have a duplicate META-INF/MANIFEST.MF in src\test\jars\plexus-utils-1.4.1.jar]
at org.apache.maven.plugins.shade.DefaultShaderTest.testOverlappingResourcesAreLogged(DefaultShaderTest.java:122)
FAILED: org.apache.maven.plugins.shade.DefaultShaderTest.windows-jdk12-m3.6.x_build / Build windows-jdk12-m3.6.x_build / testOverlappingResourcesAreLogged
Error Message:
[Processing JAR src\test\jars\test-project-1.0-SNAPSHOT.jar, Processing JAR src\test\jars\plexus-utils-1.4.1.jar, We have a duplicate META-INF/MANIFEST.MF in src\test\jars\plexus-utils-1.4.1.jar]
Stack Trace:
junit.framework.AssertionFailedError: [Processing JAR src\test\jars\test-project-1.0-SNAPSHOT.jar, Processing JAR src\test\jars\plexus-utils-1.4.1.jar, We have a duplicate META-INF/MANIFEST.MF in src\test\jars\plexus-utils-1.4.1.jar]
at org.apache.maven.plugins.shade.DefaultShaderTest.testOverlappingResourcesAreLogged(DefaultShaderTest.java:122)
FAILED: org.apache.maven.plugins.shade.DefaultShaderTest.windows-jdk13-m3.6.x_build / Build windows-jdk13-m3.6.x_build / testOverlappingResourcesAreLogged
Error Message:
[Processing JAR src\test\jars\test-project-1.0-SNAPSHOT.jar, Processing JAR src\test\jars\plexus-utils-1.4.1.jar, We have a duplicate META-INF/MANIFEST.MF in src\test\jars\plexus-utils-1.4.1.jar]
Stack Trace:
junit.framework.AssertionFailedError: [Processing JAR src\test\jars\test-project-1.0-SNAPSHOT.jar, Processing JAR src\test\jars\plexus-utils-1.4.1.jar, We have a duplicate META-INF/MANIFEST.MF in src\test\jars\plexus-utils-1.4.1.jar]
at org.apache.maven.plugins.shade.DefaultShaderTest.testOverlappingResourcesAreLogged(DefaultShaderTest.java:122)
Build log:
[...truncated 7875 lines...]
[INFO] run post-build script verify.groovy
[INFO] MSHADE-182/pom.xml ............................... SUCCESS (4.8 s)
[INFO] Building: shading-with-java-10-sources/pom.xml
[INFO] shadePomDependency/pom.xml ....................... SUCCESS (5.2 s)
[INFO]
[INFO] --- maven-checkstyle-plugin:3.0.0:check (checkstyle-check) @ maven-shade-plugin ---
[INFO] run post-build script verify.bsh
[INFO] finalNameBuild/pom.xml ........................... SUCCESS (4.2 s)
[INFO] Building: filter-artifact-contents/pom.xml
[INFO] There are 3 errors reported by Checkstyle 6.18 with config/maven_checks.xml ruleset.
[INFO] Ignored 3 errors, 0 violation remaining.
[INFO]
[INFO] --- maven-invoker-plugin:3.1.0:verify (integration-test) @ maven-shade-plugin ---
[INFO] -------------------------------------------------
[INFO] Build Summary:
[INFO] Passed: 62, Failed: 0, Errors: 0, Skipped: 1
[INFO] -------------------------------------------------
[INFO] ------------------------------------------------------------------------
[INFO] BUILD SUCCESS
[INFO] ------------------------------------------------------------------------
[INFO] Total time: 05:29 min
[INFO] Finished at: 2019-08-13T13:42:07Z
[INFO] ------------------------------------------------------------------------
[INFO] [jenkins-event-spy] Generated /home/jenkins/jenkins-slave/workspace/en-box_maven-shade-plugin_master@2@tmp/withMavenece26cc7/maven-spy-20190813-133637-78811839974570599925628.log
[Pipeline] }
[Pipeline] // dir
[Pipeline] }
[withMaven] artifactsPublisher - Archive artifact linux-jdk12-m3.6.x_build/pom.xml under org/apache/maven/plugins/maven-shade-plugin/3.2.2-SNAPSHOT/maven-shade-plugin-3.2.2-SNAPSHOT.pom
[INFO] run post-build script verify.bsh
[INFO] filter-artifact-contents/pom.xml ................. SUCCESS (3.8 s)
[INFO] Building: mini-jar-respect-includes/pom.xml
[withMaven] artifactsPublisher - Archive artifact linux-jdk12-m3.6.x_build/target/maven-shade-plugin-3.2.2-SNAPSHOT.jar under org/apache/maven/plugins/maven-shade-plugin/3.2.2-SNAPSHOT/maven-shade-plugin-3.2.2-SNAPSHOT.jar
[INFO] run post-build script verify.groovy
[INFO] shading-with-java-10-sources/pom.xml ............. SUCCESS (7.2 s)
[INFO] Building: MSHADE-114/pom.xml
[withMaven] artifactsPublisher - Archive artifact linux-jdk12-m3.6.x_build/target/maven-shade-plugin-3.2.2-SNAPSHOT-tests.jar under org/apache/maven/plugins/maven-shade-plugin/3.2.2-SNAPSHOT/maven-shade-plugin-3.2.2-SNAPSHOT-tests.jar
[withMaven] junitPublisher - Archive test results for Maven artifact org.apache.maven.plugins:maven-shade-plugin:maven-plugin:3.2.2-SNAPSHOT generated by maven-surefire-plugin:test (default-test): linux-jdk12-m3.6.x_build/target/surefire-reports/*.xml
Recording test results
[INFO] MSHADE-114/pom.xml ............................... SUCCESS (4.9 s)
[INFO] Building: MSHADE-183/pom.xml
[INFO] run post-build script verify.bsh
[INFO] mini-jar-respect-includes/pom.xml ................ SUCCESS (5.4 s)
[INFO] Building: reloc-enum-ref-from-anno/pom.xml
[INFO] reloc-enum-ref-from-anno/pom.xml ................. SUCCESS (4.0 s)
[INFO]
[INFO] --- maven-checkstyle-plugin:3.0.0:check (checkstyle-check) @ maven-shade-plugin ---
[withMaven] openTasksPublisher - Scan Tasks for Maven artifact org.apache.maven.plugins:maven-shade-plugin:maven-plugin:3.2.2-SNAPSHOT in source directory linux-jdk12-m3.6.x_build/src/main/java
[TASKS] Scanning folder '/home/jenkins/jenkins-slave/workspace/en-box_maven-shade-plugin_master@2' for files matching the pattern 'linux-jdk12-m3.6.x_build/src/main/java/**/*' - excludes: null
[TASKS] Found 38 files to scan for tasks
[TASKS] Found 2 open tasks.
Skipping warnings blame since pipelines do not have an SCM link.%n
[TASKS] Computing warning deltas based on reference build #16
[INFO] There are 3 errors reported by Checkstyle 6.18 with config/maven_checks.xml ruleset.
[withMaven] invokerPublisher - Archive invoker results for Maven artifact MavenArtifact{org.apache.maven.plugins:maven-shade-plugin:maven-plugin:3.2.2-SNAPSHOT(version: 3.2.2-SNAPSHOT, snapshot:false) } generated by PluginInvocation{org.apache.maven.plugins:maven-invoker-plugin:3.1.0@integration-test integration-test}: linux-jdk12-m3.6.x_build/target/invoker-reports/*.xml
[INFO] Ignored 3 errors, 0 violation remaining.
[INFO]
[INFO] --- maven-invoker-plugin:3.1.0:verify (integration-test) @ maven-shade-plugin ---
[INFO] -------------------------------------------------
[INFO] Build Summary:
[INFO] Passed: 62, Failed: 0, Errors: 0, Skipped: 1
[INFO] -------------------------------------------------
[INFO] ------------------------------------------------------------------------
[INFO] BUILD SUCCESS
[INFO] ------------------------------------------------------------------------
[INFO] Total time: 05:15 min
[INFO] Finished at: 2019-08-13T13:42:51Z
[INFO] ------------------------------------------------------------------------
[INFO] [jenkins-event-spy] Generated /home/jenkins/jenkins-slave/workspace/en-box_maven-shade-plugin_master@2@tmp/withMaven7d9a0a1d/maven-spy-20190813-133735-42610675099951596071284.log
[Pipeline] }
[Pipeline] // dir
[Pipeline] }
[withMaven] artifactsPublisher - Archive artifact linux-jdk13-m3.6.x_build/pom.xml under org/apache/maven/plugins/maven-shade-plugin/3.2.2-SNAPSHOT/maven-shade-plugin-3.2.2-SNAPSHOT.pom
[withMaven] artifactsPublisher - Archive artifact linux-jdk13-m3.6.x_build/target/maven-shade-plugin-3.2.2-SNAPSHOT.jar under org/apache/maven/plugins/maven-shade-plugin/3.2.2-SNAPSHOT/maven-shade-plugin-3.2.2-SNAPSHOT.jar
[withMaven] artifactsPublisher - Archive artifact linux-jdk13-m3.6.x_build/target/maven-shade-plugin-3.2.2-SNAPSHOT-tests.jar under org/apache/maven/plugins/maven-shade-plugin/3.2.2-SNAPSHOT/maven-shade-plugin-3.2.2-SNAPSHOT-tests.jar
[withMaven] junitPublisher - Archive test results for Maven artifact org.apache.maven.plugins:maven-shade-plugin:maven-plugin:3.2.2-SNAPSHOT generated by maven-surefire-plugin:test (default-test): linux-jdk13-m3.6.x_build/target/surefire-reports/*.xml
Recording test results
[INFO] run post-build script verify.bsh
[INFO] MSHADE-183/pom.xml ............................... SUCCESS (10.5 s)
[INFO] Building: users-shader-impl/pom.xml
[INFO] run post-build script verify.groovy
[INFO] users-shader-impl/pom.xml ........................ SUCCESS (6.7 s)
[INFO] Building: rerun-with-reloc/pom.xml
[withMaven] openTasksPublisher - Scan Tasks for Maven artifact org.apache.maven.plugins:maven-shade-plugin:maven-plugin:3.2.2-SNAPSHOT in source directory linux-jdk13-m3.6.x_build/src/main/java
[TASKS] Scanning folder '/home/jenkins/jenkins-slave/workspace/en-box_maven-shade-plugin_master@2' for files matching the pattern 'linux-jdk13-m3.6.x_build/src/main/java/**/*' - excludes: null
[TASKS] Found 38 files to scan for tasks
[TASKS] Found 2 open tasks.
Skipping warnings blame since pipelines do not have an SCM link.%n
[TASKS] Computing warning deltas based on reference build #16
[withMaven] invokerPublisher - Archive invoker results for Maven artifact MavenArtifact{org.apache.maven.plugins:maven-shade-plugin:maven-plugin:3.2.2-SNAPSHOT(version: 3.2.2-SNAPSHOT, snapshot:false) } generated by PluginInvocation{org.apache.maven.plugins:maven-invoker-plugin:3.1.0@integration-test integration-test}: linux-jdk13-m3.6.x_build/target/invoker-reports/*.xml
[INFO] rerun-with-reloc/pom.xml ......................... SUCCESS (6.3 s)
[INFO] Building: filter-artifact-contents/pom.xml
[withMaven] Publishers: Generated Artifacts Publisher: 1577 ms, Junit Publisher: 9108 ms, Open Task Scanner Publisher: 728 ms, Dependencies Fingerprint Publisher: 1 ms, Invoker Publisher: 62697 ms, Pipeline Graph Publisher: 2 ms
[Pipeline] // withMaven
[Pipeline] cleanWs
[WS-CLEANUP] Deleting project workspace...
[WS-CLEANUP] Deferred wipeout is used...
[WS-CLEANUP] done
[Pipeline] }
[Pipeline] // stage
[Pipeline] }
[Pipeline] // ws
[Pipeline] }
[Pipeline] // node
[Pipeline] }
[INFO] run post-build script verify.bsh
[INFO] filter-artifact-contents/pom.xml ................. SUCCESS (5.0 s)
[INFO] Building: dep-reduced-pom-with-local-parent/pom.xml
[INFO] dep-reduced-pom-with-local-parent/pom.xml ........ SUCCESS (4.2 s)
[INFO] Building: reloc-abs-resource-path-exclude/pom.xml
[INFO] reloc-abs-resource-path-exclude/pom.xml .......... SUCCESS (6.1 s)
[INFO] Building: reloc-anno/pom.xml
[INFO] reloc-anno/pom.xml ............................... SUCCESS (5.4 s)
[INFO] Building: finalNameBuild/pom.xml
[INFO] run pre-build script setup.bsh
[INFO] run post-build script verify.bsh
[INFO] finalNameBuild/pom.xml ........................... SUCCESS (4.7 s)
[INFO] Building: services-resource-transformer/pom.xml
[INFO] run post-build script verify.bsh
[INFO] services-resource-transformer/pom.xml ............ SUCCESS (4.8 s)
[INFO] Building: empty-relocation-shaded-pattern/pom.xml
[INFO] empty-relocation-shaded-pattern/pom.xml .......... SUCCESS (4.9 s)
[INFO] Building: attached-artifact-type/pom.xml
[withMaven] Publishers: Generated Artifacts Publisher: 1558 ms, Junit Publisher: 8853 ms, Open Task Scanner Publisher: 693 ms, Invoker Publisher: 56138 ms, Pipeline Graph Publisher: 1 ms
[Pipeline] // withMaven
[Pipeline] cleanWs
[WS-CLEANUP] Deleting project workspace...
[WS-CLEANUP] Deferred wipeout is used...
[WS-CLEANUP] done
[Pipeline] }
[Pipeline] // stage
[Pipeline] }
[Pipeline] // ws
[INFO] attached-artifact-type/pom.xml ................... SUCCESS (5.8 s)
[INFO] Building: MSHADE-105/pom.xml
[Pipeline] }
[Pipeline] // node
[Pipeline] }
[withMaven] Publishers: Generated Artifacts Publisher: 1590 ms, Junit Publisher: 9028 ms, Open Task Scanner Publisher: 682 ms, Invoker Publisher: 57623 ms, Pipeline Graph Publisher: 1 ms
[Pipeline] // withMaven
[Pipeline] cleanWs
[WS-CLEANUP] Deleting project workspace...
[WS-CLEANUP] Deferred wipeout is used...
[WS-CLEANUP] done
[Pipeline] }
[Pipeline] // stage
[Pipeline] }
[Pipeline] // ws
[Pipeline] }
[Pipeline] // node
[Pipeline] }
[INFO] run post-build script verify.bsh
[INFO] MSHADE-105/pom.xml ............................... SUCCESS (14.0 s)
[INFO] Building: MSHADE-247/pom.xml
[INFO] MSHADE-247/pom.xml ............................... SUCCESS (5.8 s)
[INFO] Building: manifest-transformed/pom.xml
[INFO] run post-build script verify.bsh
[INFO] manifest-transformed/pom.xml ..................... SUCCESS (5.8 s)
[INFO] Building: reloc-class-from-string-pool/pom.xml
[INFO] reloc-class-from-string-pool/pom.xml ............. SUCCESS (5.5 s)
[INFO] Building: dep-reduced-pom-unique/pom.xml
[INFO] run post-build script verify.groovy
[INFO] dep-reduced-pom-unique/pom.xml ................... SUCCESS (5.5 s)
[INFO] Building: dep-reduced-pom-use-base-version/pom.xml
[INFO] run post-build script verify.groovy
[INFO] dep-reduced-pom-use-base-version/pom.xml ......... SUCCESS (5.1 s)
[INFO] Building: services-resource-transformer-with-reloc-includes-excludes/pom.xml
[INFO] run post-build script verify.bsh
[INFO] services-resource-transformer-with-reloc-includes-excludes/pom.xml SUCCESS (5.3 s)
[INFO] Building: attach-after-lifecycle-fork/pom.xml
[INFO] run pre-build script setup.bsh
[INFO] run post-build script verify.bsh
[INFO] attach-after-lifecycle-fork/pom.xml .............. SUCCESS (5.2 s)
[INFO] Building: MSHADE-185/pom.xml
[INFO] MSHADE-185/pom.xml ............................... SKIPPED due to JRE version
[INFO] Building: reloc-abs-resource-path/pom.xml
[INFO] reloc-abs-resource-path/pom.xml .................. SUCCESS (6.2 s)
[INFO] Building: MSHADE-316/pom.xml
[INFO] run post-build script verify.bsh
[INFO] MSHADE-316/pom.xml ............................... SUCCESS (6.3 s)
[INFO] Building: dep-reduced-pom-relocated-result/pom.xml
[INFO] dep-reduced-pom-relocated-result/pom.xml ......... SUCCESS (4.0 s)
[INFO] Building: MSHADE-313_minimized-services/pom.xml
[INFO] run post-build script verify.bsh
[INFO] MSHADE-313_minimized-services/pom.xml ............ SUCCESS (6.8 s)
[INFO] Building: manifest-retained/pom.xml
[INFO] run post-build script verify.bsh
[INFO] manifest-retained/pom.xml ........................ SUCCESS (6.0 s)
[INFO] Building: mini-jar-package-info/pom.xml
[INFO] run post-build script verify.bsh
[INFO] mini-jar-package-info/pom.xml .................... SUCCESS (5.8 s)
[INFO] Building: non-runtime-scope-excluded/pom.xml
[INFO] run post-build script verify.bsh
[INFO] non-runtime-scope-excluded/pom.xml ............... SUCCESS (4.9 s)
[INFO]
[INFO] --- maven-checkstyle-plugin:3.0.0:check (checkstyle-check) @ maven-shade-plugin ---
[INFO] There are 3 errors reported by Checkstyle 6.18 with config/maven_checks.xml ruleset.
[INFO] Ignored 3 errors, 0 violation remaining.
[INFO]
[INFO] --- maven-invoker-plugin:3.1.0:verify (integration-test) @ maven-shade-plugin ---
[INFO] -------------------------------------------------
[INFO] Build Summary:
[INFO] Passed: 62, Failed: 0, Errors: 0, Skipped: 1
[INFO] -------------------------------------------------
[INFO] ------------------------------------------------------------------------
[INFO] BUILD SUCCESS
[INFO] ------------------------------------------------------------------------
[INFO] Total time: 08:26 min
[INFO] Finished at: 2019-08-13T13:45:22Z
[INFO] ------------------------------------------------------------------------
[INFO] [jenkins-event-spy] Generated /home/jenkins/jenkins-slave/workspace/en-box_maven-shade-plugin_master@2@tmp/withMaven610a14c9/maven-spy-20190813-133655-41015548171848618325322.log
[Pipeline] }
[Pipeline] // dir
[Pipeline] }
[withMaven] artifactsPublisher - Archive artifact linux-jdk11-m3.6.x_build/pom.xml under org/apache/maven/plugins/maven-shade-plugin/3.2.2-SNAPSHOT/maven-shade-plugin-3.2.2-SNAPSHOT.pom
[withMaven] artifactsPublisher - Archive artifact linux-jdk11-m3.6.x_build/target/maven-shade-plugin-3.2.2-SNAPSHOT.jar under org/apache/maven/plugins/maven-shade-plugin/3.2.2-SNAPSHOT/maven-shade-plugin-3.2.2-SNAPSHOT.jar
[withMaven] artifactsPublisher - Archive artifact linux-jdk11-m3.6.x_build/target/maven-shade-plugin-3.2.2-SNAPSHOT-tests.jar under org/apache/maven/plugins/maven-shade-plugin/3.2.2-SNAPSHOT/maven-shade-plugin-3.2.2-SNAPSHOT-tests.jar
[withMaven] junitPublisher - Archive test results for Maven artifact org.apache.maven.plugins:maven-shade-plugin:maven-plugin:3.2.2-SNAPSHOT generated by maven-surefire-plugin:test (default-test): linux-jdk11-m3.6.x_build/target/surefire-reports/*.xml
Recording test results
[withMaven] openTasksPublisher - Scan Tasks for Maven artifact org.apache.maven.plugins:maven-shade-plugin:maven-plugin:3.2.2-SNAPSHOT in source directory linux-jdk11-m3.6.x_build/src/main/java
[TASKS] Scanning folder '/home/jenkins/jenkins-slave/workspace/en-box_maven-shade-plugin_master@2' for files matching the pattern 'linux-jdk11-m3.6.x_build/src/main/java/**/*' - excludes: null
[TASKS] Found 38 files to scan for tasks
[TASKS] Found 2 open tasks.
Skipping warnings blame since pipelines do not have an SCM link.%n
[TASKS] Computing warning deltas based on reference build #16
[withMaven] invokerPublisher - Archive invoker results for Maven artifact MavenArtifact{org.apache.maven.plugins:maven-shade-plugin:maven-plugin:3.2.2-SNAPSHOT(version: 3.2.2-SNAPSHOT, snapshot:false) } generated by PluginInvocation{org.apache.maven.plugins:maven-invoker-plugin:3.1.0@integration-test integration-test}: linux-jdk11-m3.6.x_build/target/invoker-reports/*.xml
[withMaven] Publishers: Generated Artifacts Publisher: 1490 ms, Junit Publisher: 9088 ms, Open Task Scanner Publisher: 706 ms, Invoker Publisher: 61623 ms, Pipeline Graph Publisher: 1 ms
[Pipeline] // withMaven
[Pipeline] cleanWs
[WS-CLEANUP] Deleting project workspace...
[WS-CLEANUP] Deferred wipeout is used...
[WS-CLEANUP] done
[Pipeline] }
[Pipeline] // stage
[Pipeline] }
[Pipeline] // ws
[Pipeline] }
[Pipeline] // node
[Pipeline] }
[Pipeline] // parallel
[Pipeline] stage
[Pipeline] { (Notifications)
[Pipeline] echo
Build result: UNSTABLE
[Pipeline] jiraIssueSelector
[Pipeline] echo
The authors of changes [].
[Pipeline] echo
Sending email ...
[Pipeline] emailext
Build unstable in Jenkins: Maven TLP » maven-shade-plugin » master #16
Posted by Apache Jenkins Server <je...@builds.apache.org>.
See https://builds.apache.org/job/maven-box/job/maven-shade-plugin/job/master/16/
Changes:
* [MSHADE-322] - extracting SortedProperties to be able to reuse it in the
* [MSHADE-322] - extracting SortedProperties to be able to reuse it in the
* [MSHADE-322] - extracting SortedProperties to be able to reuse it in the
* [MSHADE-322] - extracting SortedProperties to be able to reuse it in the
* [MSHADE-322] - extracting SortedProperties to be able to reuse it in the
* [MSHADE-322] - extracting SortedProperties to be able to reuse it in the
* [MSHADE-322] - extracting SortedProperties to be able to reuse it in the
* [MSHADE-322] - extracting SortedProperties to be able to reuse it in the
8 tests failed.
FAILED: org.apache.maven.plugins.shade.DefaultShaderTest.windows-jdk7-m3.2.x_build / Build windows-jdk7-m3.2.x_build / testOverlappingResourcesAreLogged
Error Message:
[Processing JAR src\test\jars\test-project-1.0-SNAPSHOT.jar, Processing JAR src\test\jars\plexus-utils-1.4.1.jar, We have a duplicate META-INF/MANIFEST.MF in src\test\jars\plexus-utils-1.4.1.jar]
Stack Trace:
junit.framework.AssertionFailedError: [Processing JAR src\test\jars\test-project-1.0-SNAPSHOT.jar, Processing JAR src\test\jars\plexus-utils-1.4.1.jar, We have a duplicate META-INF/MANIFEST.MF in src\test\jars\plexus-utils-1.4.1.jar]
at org.apache.maven.plugins.shade.DefaultShaderTest.testOverlappingResourcesAreLogged(DefaultShaderTest.java:122)
FAILED: org.apache.maven.plugins.shade.DefaultShaderTest.windows-jdk7-m3.3.x_build / Build windows-jdk7-m3.3.x_build / testOverlappingResourcesAreLogged
Error Message:
[Processing JAR src\test\jars\test-project-1.0-SNAPSHOT.jar, Processing JAR src\test\jars\plexus-utils-1.4.1.jar, We have a duplicate META-INF/MANIFEST.MF in src\test\jars\plexus-utils-1.4.1.jar]
Stack Trace:
junit.framework.AssertionFailedError: [Processing JAR src\test\jars\test-project-1.0-SNAPSHOT.jar, Processing JAR src\test\jars\plexus-utils-1.4.1.jar, We have a duplicate META-INF/MANIFEST.MF in src\test\jars\plexus-utils-1.4.1.jar]
at org.apache.maven.plugins.shade.DefaultShaderTest.testOverlappingResourcesAreLogged(DefaultShaderTest.java:122)
FAILED: org.apache.maven.plugins.shade.DefaultShaderTest.windows-jdk7-m3.5.x_build / Build windows-jdk7-m3.5.x_build / testOverlappingResourcesAreLogged
Error Message:
[Processing JAR src\test\jars\test-project-1.0-SNAPSHOT.jar, Processing JAR src\test\jars\plexus-utils-1.4.1.jar, We have a duplicate META-INF/MANIFEST.MF in src\test\jars\plexus-utils-1.4.1.jar]
Stack Trace:
junit.framework.AssertionFailedError: [Processing JAR src\test\jars\test-project-1.0-SNAPSHOT.jar, Processing JAR src\test\jars\plexus-utils-1.4.1.jar, We have a duplicate META-INF/MANIFEST.MF in src\test\jars\plexus-utils-1.4.1.jar]
at org.apache.maven.plugins.shade.DefaultShaderTest.testOverlappingResourcesAreLogged(DefaultShaderTest.java:122)
FAILED: org.apache.maven.plugins.shade.DefaultShaderTest.windows-jdk7-m3.6.x_build / Build windows-jdk7-m3.6.x_build / testOverlappingResourcesAreLogged
Error Message:
[Processing JAR src\test\jars\test-project-1.0-SNAPSHOT.jar, Processing JAR src\test\jars\plexus-utils-1.4.1.jar, We have a duplicate META-INF/MANIFEST.MF in src\test\jars\plexus-utils-1.4.1.jar]
Stack Trace:
junit.framework.AssertionFailedError: [Processing JAR src\test\jars\test-project-1.0-SNAPSHOT.jar, Processing JAR src\test\jars\plexus-utils-1.4.1.jar, We have a duplicate META-INF/MANIFEST.MF in src\test\jars\plexus-utils-1.4.1.jar]
at org.apache.maven.plugins.shade.DefaultShaderTest.testOverlappingResourcesAreLogged(DefaultShaderTest.java:122)
FAILED: org.apache.maven.plugins.shade.DefaultShaderTest.windows-jdk8-m3.6.x_build / Build windows-jdk8-m3.6.x_build / testOverlappingResourcesAreLogged
Error Message:
[Processing JAR src\test\jars\test-project-1.0-SNAPSHOT.jar, Processing JAR src\test\jars\plexus-utils-1.4.1.jar, We have a duplicate META-INF/MANIFEST.MF in src\test\jars\plexus-utils-1.4.1.jar]
Stack Trace:
junit.framework.AssertionFailedError: [Processing JAR src\test\jars\test-project-1.0-SNAPSHOT.jar, Processing JAR src\test\jars\plexus-utils-1.4.1.jar, We have a duplicate META-INF/MANIFEST.MF in src\test\jars\plexus-utils-1.4.1.jar]
at org.apache.maven.plugins.shade.DefaultShaderTest.testOverlappingResourcesAreLogged(DefaultShaderTest.java:122)
FAILED: org.apache.maven.plugins.shade.DefaultShaderTest.windows-jdk13-m3.6.x_build / Build windows-jdk13-m3.6.x_build / testOverlappingResourcesAreLogged
Error Message:
[Processing JAR src\test\jars\test-project-1.0-SNAPSHOT.jar, Processing JAR src\test\jars\plexus-utils-1.4.1.jar, We have a duplicate META-INF/MANIFEST.MF in src\test\jars\plexus-utils-1.4.1.jar]
Stack Trace:
junit.framework.AssertionFailedError: [Processing JAR src\test\jars\test-project-1.0-SNAPSHOT.jar, Processing JAR src\test\jars\plexus-utils-1.4.1.jar, We have a duplicate META-INF/MANIFEST.MF in src\test\jars\plexus-utils-1.4.1.jar]
at org.apache.maven.plugins.shade.DefaultShaderTest.testOverlappingResourcesAreLogged(DefaultShaderTest.java:122)
FAILED: org.apache.maven.plugins.shade.DefaultShaderTest.windows-jdk11-m3.6.x_build / Build windows-jdk11-m3.6.x_build / testOverlappingResourcesAreLogged
Error Message:
[Processing JAR src\test\jars\test-project-1.0-SNAPSHOT.jar, Processing JAR src\test\jars\plexus-utils-1.4.1.jar, We have a duplicate META-INF/MANIFEST.MF in src\test\jars\plexus-utils-1.4.1.jar]
Stack Trace:
junit.framework.AssertionFailedError: [Processing JAR src\test\jars\test-project-1.0-SNAPSHOT.jar, Processing JAR src\test\jars\plexus-utils-1.4.1.jar, We have a duplicate META-INF/MANIFEST.MF in src\test\jars\plexus-utils-1.4.1.jar]
at org.apache.maven.plugins.shade.DefaultShaderTest.testOverlappingResourcesAreLogged(DefaultShaderTest.java:122)
FAILED: org.apache.maven.plugins.shade.DefaultShaderTest.windows-jdk12-m3.6.x_build / Build windows-jdk12-m3.6.x_build / testOverlappingResourcesAreLogged
Error Message:
[Processing JAR src\test\jars\test-project-1.0-SNAPSHOT.jar, Processing JAR src\test\jars\plexus-utils-1.4.1.jar, We have a duplicate META-INF/MANIFEST.MF in src\test\jars\plexus-utils-1.4.1.jar]
Stack Trace:
junit.framework.AssertionFailedError: [Processing JAR src\test\jars\test-project-1.0-SNAPSHOT.jar, Processing JAR src\test\jars\plexus-utils-1.4.1.jar, We have a duplicate META-INF/MANIFEST.MF in src\test\jars\plexus-utils-1.4.1.jar]
at org.apache.maven.plugins.shade.DefaultShaderTest.testOverlappingResourcesAreLogged(DefaultShaderTest.java:122)
Build log:
[...truncated 7895 lines...]
[INFO] shadePomDependency/pom.xml ....................... SUCCESS (4.7 s)
[INFO] Building: reloc-class-from-string-pool/pom.xml
[INFO] run post-build script verify.bsh
[INFO] finalNameBuild-attached/pom.xml .................. SUCCESS (3.7 s)
[INFO] Building: duplicate-classes-without-reloc/pom.xml
[INFO] reloc-class-from-string-pool/pom.xml ............. SUCCESS (4.1 s)
[INFO] Building: rerun-without-reloc/pom.xml
[INFO] duplicate-classes-without-reloc/pom.xml .......... SUCCESS (3.2 s)
[INFO] Building: manifest-retained/pom.xml
[INFO] rerun-without-reloc/pom.xml ...................... SUCCESS (4.0 s)
[INFO] Building: component-descriptor-relocation/pom.xml
[INFO] component-descriptor-relocation/pom.xml .......... SUCCESS (4.3 s)
[INFO] Building: finalNameBuild-attached/pom.xml
[INFO] run pre-build script setup.bsh
[INFO] run post-build script verify.bsh
[INFO] manifest-retained/pom.xml ........................ SUCCESS (7.5 s)
[INFO] Building: MSHADE-239_finalName-attachments/pom.xml
[INFO] run post-build script verify.bsh
[INFO] finalNameBuild-attached/pom.xml .................. SUCCESS (3.4 s)
[INFO] Building: dep-reduced-pom-use-base-version/pom.xml
[INFO] run post-build script verify.groovy
[INFO] MSHADE-239_finalName-attachments/pom.xml ......... SUCCESS (4.8 s)
[INFO] Building: mini-jar-malformed-dependencies/pom.xml
[INFO] run post-build script verify.groovy
[INFO] dep-reduced-pom-use-base-version/pom.xml ......... SUCCESS (3.8 s)
[INFO] Building: empty-relocation-shaded-pattern/pom.xml
[INFO] empty-relocation-shaded-pattern/pom.xml .......... SUCCESS (3.4 s)
[INFO] Building: MSHADE-247/pom.xml
[INFO] mini-jar-malformed-dependencies/pom.xml .......... SUCCESS (8.4 s)
[INFO] Building: attach-after-lifecycle-fork/pom.xml
[INFO] run pre-build script setup.bsh
[INFO] MSHADE-247/pom.xml ............................... SUCCESS (4.4 s)
[INFO] Building: empty-apache-notice-transform/pom.xml
[INFO] run post-build script verify.bsh
[INFO] attach-after-lifecycle-fork/pom.xml .............. SUCCESS (3.8 s)
[INFO] Building: non-runtime-scope-excluded/pom.xml
[INFO] empty-apache-notice-transform/pom.xml ............ SUCCESS (3.8 s)
[INFO] Building: shading-with-java-10-sources/pom.xml
[INFO] run post-build script verify.bsh
[INFO] non-runtime-scope-excluded/pom.xml ............... SUCCESS (3.6 s)
[INFO] Building: MSHADE-313_minimized-services/pom.xml
[INFO] run post-build script verify.groovy
[INFO] shading-with-java-10-sources/pom.xml ............. SUCCESS (4.8 s)
[INFO] Building: MSHADE-240_reloc-mavenfiles/pom.xml
[INFO] run post-build script verify.bsh
[INFO] MSHADE-313_minimized-services/pom.xml ............ SUCCESS (4.9 s)
[INFO] Building: MSHADE-185/pom.xml
[INFO] MSHADE-185/pom.xml ............................... SKIPPED due to JRE version
[INFO] Building: empty-relocation-shaded-pattern/pom.xml
[INFO] empty-relocation-shaded-pattern/pom.xml .......... SUCCESS (3.5 s)
[INFO] Building: MSHADE-105/pom.xml
[INFO] run post-build script verify.groovy
[INFO] MSHADE-240_reloc-mavenfiles/pom.xml .............. SUCCESS (6.7 s)
[INFO]
[INFO] --- maven-checkstyle-plugin:3.0.0:check (checkstyle-check) @ maven-shade-plugin ---
[INFO] There are 3 errors reported by Checkstyle 6.18 with config/maven_checks.xml ruleset.
[INFO] Ignored 3 errors, 0 violation remaining.
[INFO]
[INFO] --- maven-invoker-plugin:3.1.0:verify (integration-test) @ maven-shade-plugin ---
[INFO] -------------------------------------------------
[INFO] Build Summary:
[INFO] Passed: 62, Failed: 0, Errors: 0, Skipped: 1
[INFO] -------------------------------------------------
[INFO] ------------------------------------------------------------------------
[INFO] BUILD SUCCESS
[INFO] ------------------------------------------------------------------------
[INFO] Total time: 04:44 min
[INFO] Finished at: 2019-08-13T11:32:09Z
[INFO] ------------------------------------------------------------------------
[INFO] [jenkins-event-spy] Generated /home/jenkins/jenkins-slave/workspace/en-box_maven-shade-plugin_master@2@tmp/withMavencb3f84c9/maven-spy-20190813-112724-16914450736235685524098.log
[Pipeline] }
[Pipeline] // dir
[Pipeline] }
[withMaven] artifactsPublisher - Archive artifact linux-jdk13-m3.6.x_build/pom.xml under org/apache/maven/plugins/maven-shade-plugin/3.2.2-SNAPSHOT/maven-shade-plugin-3.2.2-SNAPSHOT.pom
[withMaven] artifactsPublisher - Archive artifact linux-jdk13-m3.6.x_build/target/maven-shade-plugin-3.2.2-SNAPSHOT.jar under org/apache/maven/plugins/maven-shade-plugin/3.2.2-SNAPSHOT/maven-shade-plugin-3.2.2-SNAPSHOT.jar
[withMaven] artifactsPublisher - Archive artifact linux-jdk13-m3.6.x_build/target/maven-shade-plugin-3.2.2-SNAPSHOT-tests.jar under org/apache/maven/plugins/maven-shade-plugin/3.2.2-SNAPSHOT/maven-shade-plugin-3.2.2-SNAPSHOT-tests.jar
[withMaven] junitPublisher - Archive test results for Maven artifact org.apache.maven.plugins:maven-shade-plugin:maven-plugin:3.2.2-SNAPSHOT generated by maven-surefire-plugin:test (default-test): linux-jdk13-m3.6.x_build/target/surefire-reports/*.xml
Recording test results
[INFO] run post-build script verify.bsh
[INFO] MSHADE-105/pom.xml ............................... SUCCESS (12.2 s)
[INFO] Building: MSHADE-316/pom.xml
[withMaven] openTasksPublisher - Scan Tasks for Maven artifact org.apache.maven.plugins:maven-shade-plugin:maven-plugin:3.2.2-SNAPSHOT in source directory linux-jdk13-m3.6.x_build/src/main/java
[TASKS] Scanning folder '/home/jenkins/jenkins-slave/workspace/en-box_maven-shade-plugin_master@2' for files matching the pattern 'linux-jdk13-m3.6.x_build/src/main/java/**/*' - excludes: null
[TASKS] Found 38 files to scan for tasks
[TASKS] Found 2 open tasks.
Skipping warnings blame since pipelines do not have an SCM link.%n
[TASKS] Computing warning deltas based on reference build #15
[withMaven] invokerPublisher - Archive invoker results for Maven artifact MavenArtifact{org.apache.maven.plugins:maven-shade-plugin:maven-plugin:3.2.2-SNAPSHOT(version: 3.2.2-SNAPSHOT, snapshot:false) } generated by PluginInvocation{org.apache.maven.plugins:maven-invoker-plugin:3.1.0@integration-test integration-test}: linux-jdk13-m3.6.x_build/target/invoker-reports/*.xml
[INFO] run post-build script verify.bsh
[INFO] MSHADE-316/pom.xml ............................... SUCCESS (4.6 s)
[INFO] Building: pom-packaging/pom.xml
[INFO] run post-build script verify.bsh
[INFO] pom-packaging/pom.xml ............................ SUCCESS (2.7 s)
[INFO] Building: finalNameBuild/pom.xml
[INFO] run pre-build script setup.bsh
[INFO] run post-build script verify.bsh
[INFO] finalNameBuild/pom.xml ........................... SUCCESS (3.8 s)
[INFO] Building: MSHADE-155/pom.xml
[INFO] run post-build script verify.groovy
[INFO] MSHADE-155/pom.xml ............................... SUCCESS (3.6 s)
[INFO] Building: users-shader-impl/pom.xml
[INFO] run post-build script verify.groovy
[INFO] users-shader-impl/pom.xml ........................ SUCCESS (4.8 s)
[INFO] Building: reloc-includes-excludes/pom.xml
[INFO] run post-build script verify.bsh
[INFO] reloc-includes-excludes/pom.xml .................. SUCCESS (4.0 s)
[INFO] Building: attached-artifact-type/pom.xml
[INFO] attached-artifact-type/pom.xml ................... SUCCESS (4.8 s)
[INFO] Building: plugin-descriptor-relocation/pom.xml
[INFO] run post-build script verify.groovy
[INFO] plugin-descriptor-relocation/pom.xml ............. SUCCESS (14.7 s)
[INFO] Building: finalNameShade/pom.xml
[INFO] run pre-build script setup.bsh
[INFO] run post-build script verify.bsh
[INFO] finalNameShade/pom.xml ........................... SUCCESS (3.6 s)
[INFO] Building: empty-relocation-pattern/pom.xml
[INFO] empty-relocation-pattern/pom.xml ................. SUCCESS (3.4 s)
[INFO] Building: dep-reduced-pom/pom.xml
[INFO] run post-build script verify.groovy
[INFO] dep-reduced-pom/pom.xml .......................... SUCCESS (3.6 s)
[INFO] Building: reloc-class-from-string-pool/pom.xml
[INFO] reloc-class-from-string-pool/pom.xml ............. SUCCESS (4.3 s)
[INFO] Building: mini-jar/pom.xml
[INFO] run post-build script verify.bsh
[INFO] mini-jar/pom.xml ................................. SUCCESS (4.1 s)
[INFO] Building: dep-reduced-pom-unique/pom.xml
[withMaven] Publishers: Generated Artifacts Publisher: 1594 ms, Junit Publisher: 9254 ms, Open Task Scanner Publisher: 729 ms, Invoker Publisher: 59405 ms, Pipeline Graph Publisher: 3 ms
[Pipeline] // withMaven
[Pipeline] cleanWs
[WS-CLEANUP] Deleting project workspace...
[WS-CLEANUP] Deferred wipeout is used...
[WS-CLEANUP] done
[Pipeline] }
[Pipeline] // stage
[Pipeline] }
[Pipeline] // ws
[Pipeline] }
[Pipeline] // node
[Pipeline] }
[INFO] run post-build script verify.groovy
[INFO] dep-reduced-pom-unique/pom.xml ................... SUCCESS (4.3 s)
[INFO] Building: MSHADE-232_ResourceBundleAppendingTransformer/pom.xml
[INFO] run post-build script verify.groovy
[INFO] MSHADE-232_ResourceBundleAppendingTransformer/pom.xml SUCCESS (3.9 s)
[INFO] Building: services-resource-transformer-with-reloc-includes-excludes/pom.xml
[INFO] run post-build script verify.bsh
[INFO] services-resource-transformer-with-reloc-includes-excludes/pom.xml SUCCESS (4.0 s)
[INFO] Building: reloc-abs-resource-path-exclude/pom.xml
[INFO] reloc-abs-resource-path-exclude/pom.xml .......... SUCCESS (5.0 s)
[INFO] Building: rerun-with-reloc/pom.xml
[INFO] rerun-with-reloc/pom.xml ......................... SUCCESS (5.0 s)
[INFO] Building: implicit-inclusion-of-project-artifact/pom.xml
[INFO] run post-build script verify.bsh
[INFO] implicit-inclusion-of-project-artifact/pom.xml ... SUCCESS (4.4 s)
[INFO] Building: MSHADE-183/pom.xml
[INFO] run post-build script verify.bsh
[INFO] MSHADE-183/pom.xml ............................... SUCCESS (4.6 s)
[INFO] Building: MSHADE-182/pom.xml
[INFO] run post-build script verify.groovy
[INFO] MSHADE-182/pom.xml ............................... SUCCESS (4.5 s)
[INFO] Building: dep-reduced-pom-relocated-result/pom.xml
[INFO] dep-reduced-pom-relocated-result/pom.xml ......... SUCCESS (3.1 s)
[INFO] Building: shadePomDependency/pom.xml
[INFO] shadePomDependency/pom.xml ....................... SUCCESS (4.6 s)
[INFO] Building: dep-reduced-pom-with-local-parent/pom.xml
[INFO] dep-reduced-pom-with-local-parent/pom.xml ........ SUCCESS (2.9 s)
[INFO] Building: MSHADE-258_module_relocation/pom.xml
[INFO] run post-build script verify.groovy
[INFO] MSHADE-258_module_relocation/pom.xml ............. SUCCESS (3.8 s)
[INFO] Building: finalNameShade-attached/pom.xml
[INFO] run pre-build script setup.bsh
[INFO] run post-build script verify.bsh
[INFO] finalNameShade-attached/pom.xml .................. SUCCESS (3.4 s)
[INFO] Building: shading-with-java-10-sources/pom.xml
[INFO] run post-build script verify.groovy
[INFO] shading-with-java-10-sources/pom.xml ............. SUCCESS (6.7 s)
[INFO] Building: empty-apache-notice-transform/pom.xml
[INFO] empty-apache-notice-transform/pom.xml ............ SUCCESS (3.8 s)
[INFO] Building: MSHADE-240_reloc-mavenfiles/pom.xml
[INFO] run post-build script verify.groovy
[INFO] MSHADE-240_reloc-mavenfiles/pom.xml .............. SUCCESS (6.1 s)
[INFO] Building: MSHADE-114/pom.xml
[INFO] MSHADE-114/pom.xml ............................... SUCCESS (3.6 s)
[INFO] Building: manifest-transformed/pom.xml
[INFO] run post-build script verify.bsh
[INFO] manifest-transformed/pom.xml ..................... SUCCESS (4.5 s)
[INFO] Building: shading-with-java-11-sources/pom.xml
[INFO] run post-build script verify.groovy
[INFO] shading-with-java-11-sources/pom.xml ............. SUCCESS (5.2 s)
[INFO] Building: MSHADE-133/pom.xml
[INFO] run post-build script verify.groovy
[INFO] MSHADE-133/pom.xml ............................... SUCCESS (3.6 s)
[INFO]
[INFO] --- maven-checkstyle-plugin:3.0.0:check (checkstyle-check) @ maven-shade-plugin ---
[INFO] There are 3 errors reported by Checkstyle 6.18 with config/maven_checks.xml ruleset.
[INFO] Ignored 3 errors, 0 violation remaining.
[INFO]
[INFO] --- maven-invoker-plugin:3.1.0:verify (integration-test) @ maven-shade-plugin ---
[INFO] -------------------------------------------------
[INFO] Build Summary:
[INFO] Passed: 62, Failed: 0, Errors: 0, Skipped: 1
[INFO] -------------------------------------------------
[INFO] ------------------------------------------------------------------------
[INFO] BUILD SUCCESS
[INFO] ------------------------------------------------------------------------
[INFO] Total time: 07:25 min
[INFO] Finished at: 2019-08-13T11:34:55Z
[INFO] ------------------------------------------------------------------------
[INFO] [jenkins-event-spy] Generated /home/jenkins/jenkins-slave/workspace/en-box_maven-shade-plugin_master@2@tmp/withMaveneffb395c/maven-spy-20190813-112728-2397396891777143260678.log
[Pipeline] }
[Pipeline] // dir
[Pipeline] }
[withMaven] artifactsPublisher - Archive artifact linux-jdk12-m3.6.x_build/pom.xml under org/apache/maven/plugins/maven-shade-plugin/3.2.2-SNAPSHOT/maven-shade-plugin-3.2.2-SNAPSHOT.pom
[withMaven] artifactsPublisher - Archive artifact linux-jdk12-m3.6.x_build/target/maven-shade-plugin-3.2.2-SNAPSHOT.jar under org/apache/maven/plugins/maven-shade-plugin/3.2.2-SNAPSHOT/maven-shade-plugin-3.2.2-SNAPSHOT.jar
[withMaven] artifactsPublisher - Archive artifact linux-jdk12-m3.6.x_build/target/maven-shade-plugin-3.2.2-SNAPSHOT-tests.jar under org/apache/maven/plugins/maven-shade-plugin/3.2.2-SNAPSHOT/maven-shade-plugin-3.2.2-SNAPSHOT-tests.jar
[withMaven] junitPublisher - Archive test results for Maven artifact org.apache.maven.plugins:maven-shade-plugin:maven-plugin:3.2.2-SNAPSHOT generated by maven-surefire-plugin:test (default-test): linux-jdk12-m3.6.x_build/target/surefire-reports/*.xml
Recording test results
[withMaven] openTasksPublisher - Scan Tasks for Maven artifact org.apache.maven.plugins:maven-shade-plugin:maven-plugin:3.2.2-SNAPSHOT in source directory linux-jdk12-m3.6.x_build/src/main/java
[TASKS] Scanning folder '/home/jenkins/jenkins-slave/workspace/en-box_maven-shade-plugin_master@2' for files matching the pattern 'linux-jdk12-m3.6.x_build/src/main/java/**/*' - excludes: null
[TASKS] Found 38 files to scan for tasks
[TASKS] Found 2 open tasks.
Skipping warnings blame since pipelines do not have an SCM link.%n
[TASKS] Computing warning deltas based on reference build #15
[withMaven] invokerPublisher - Archive invoker results for Maven artifact MavenArtifact{org.apache.maven.plugins:maven-shade-plugin:maven-plugin:3.2.2-SNAPSHOT(version: 3.2.2-SNAPSHOT, snapshot:false) } generated by PluginInvocation{org.apache.maven.plugins:maven-invoker-plugin:3.1.0@integration-test integration-test}: linux-jdk12-m3.6.x_build/target/invoker-reports/*.xml
[withMaven] Publishers: Generated Artifacts Publisher: 1538 ms, Junit Publisher: 8870 ms, Open Task Scanner Publisher: 705 ms, Invoker Publisher: 61080 ms, Pipeline Graph Publisher: 27 ms
[Pipeline] // withMaven
[Pipeline] cleanWs
[WS-CLEANUP] Deleting project workspace...
[WS-CLEANUP] Deferred wipeout is used...
[WS-CLEANUP] done
[Pipeline] }
[Pipeline] // stage
[Pipeline] }
[Pipeline] // ws
[Pipeline] }
[Pipeline] // node
[Pipeline] }
[Pipeline] // parallel
[Pipeline] stage
[Pipeline] { (Notifications)
[Pipeline] echo
Build result: UNSTABLE
[Pipeline] jiraIssueSelector
[Pipeline] jiraComment
[Pipeline] echo
The authors of changes [rmannibucau].
[Pipeline] echo
Sending email ...
[Pipeline] emailext