You are viewing a plain text version of this content. The canonical link for it is here.
Posted to builds@beam.apache.org by Apache Jenkins Server <je...@builds.apache.org> on 2023/07/30 16:00:09 UTC

Build failed in Jenkins: beam_PostCommit_XVR_JavaUsingPython_Dataflow #2192

See <https://ci-beam.apache.org/job/beam_PostCommit_XVR_JavaUsingPython_Dataflow/2192/display/redirect>

Changes:


------------------------------------------
[...truncated 1.24 MB...]
#9 408.1 tensorflow-estimator==2.13.0
#9 408.1 tensorflow-io-gcs-filesystem==0.32.0
#9 408.1 termcolor==2.3.0
#9 408.1 testcontainers==3.7.1
#9 408.1 threadpoolctl==3.2.0
#9 408.1 tqdm==4.65.0
#9 408.1 typing_extensions==4.5.0
#9 408.1 urllib3==1.26.16
#9 408.1 websocket-client==1.6.1
#9 408.1 Werkzeug==2.3.6
#9 408.1 wheel==0.41.0
#9 408.1 wrapt==1.15.0
#9 408.1 zstandard==0.21.0
#9 DONE 409.7s

#10 [third_party_licenses 1/4] COPY target/license_scripts /tmp/license_scripts/
#10 DONE 0.1s

#11 [third_party_licenses 2/4] COPY  target/go-licenses/* /opt/apache/beam/third_party_licenses/golang/
#11 DONE 0.1s

#12 [third_party_licenses 3/4] COPY target/license_scripts /tmp/license_scripts/
#12 DONE 0.1s

#13 [third_party_licenses 4/4] RUN if [ "true" = "true" ] ; then       pip install 'pip-licenses<5' pyyaml tenacity &&       python /tmp/license_scripts/pull_licenses_py.py ;     fi
#13 1.078 Collecting pip-licenses<5
#13 1.163   Downloading pip_licenses-4.3.2-py3-none-any.whl (19 kB)
#13 1.176 Requirement already satisfied: pyyaml in /usr/local/lib/python3.11/site-packages (6.0)
#13 1.177 Requirement already satisfied: tenacity in /usr/local/lib/python3.11/site-packages (8.2.2)
#13 1.231 Collecting prettytable>=2.3.0 (from pip-licenses<5)
#13 1.249   Downloading prettytable-3.8.0-py3-none-any.whl (27 kB)
#13 1.319 Collecting wcwidth (from prettytable>=2.3.0->pip-licenses<5)
#13 1.334   Downloading wcwidth-0.2.6-py2.py3-none-any.whl (29 kB)
#13 2.504 Installing collected packages: wcwidth, prettytable, pip-licenses
#13 2.637 Successfully installed pip-licenses-4.3.2 prettytable-3.8.0 wcwidth-0.2.6
#13 2.637 WARNING: Running pip as the 'root' user can result in broken permissions and conflicting behaviour with the system package manager. It is recommended to use a virtual environment instead: https://pip.pypa.io/warnings/venv
#13 2.907 
#13 2.907 [notice] A new release of pip is available: 23.1.2 -> 23.2.1
#13 2.907 [notice] To update, run: pip install --upgrade pip
#13 16.50 INFO:root:Successfully pulled licenses for 129 dependencies
#13 16.50 Skip pulling license for  bs4
#13 DONE 16.7s

#14 [stage-2 1/2] COPY --from=third_party_licenses /opt/apache/beam/third_party_licenses /opt/apache/beam/third_party_licenses
#14 DONE 0.2s

#15 [stage-2 2/2] RUN if [ "true" != "true" ] ; then       rm -rf /opt/apache/beam/third_party_licenses ;     fi
#15 DONE 0.3s

#16 exporting to image
#16 exporting layers
#16 exporting layers 23.3s done
#16 writing image sha256:248d9e28db1938efbd0439ee06548bea7e7ad20805e96a2893cd766956d97b44 0.0s done
#16 naming to docker.io/apache/beam_python3.11_sdk:2.50.0.dev done
#16 DONE 23.3s

> Task :runners:google-cloud-dataflow-java:buildAndPushDockerPythonContainer
WARNING: `gcloud docker` will not be supported for Docker client versions above 18.03.

As an alternative, use `gcloud auth configure-docker` to configure `docker` to
use `gcloud` as a credential helper, then use `docker` as you would for non-GCR
registries, e.g. `docker pull gcr.io/project-id/my-image`. Add
`--verbosity=error` to silence this warning: `gcloud docker
--verbosity=error -- pull gcr.io/project-id/my-image`.

See: https://cloud.google.com/container-registry/docs/support/deprecation-notices#gcloud-docker

The push refers to repository [us.gcr.io/apache-beam-testing/java-postcommit-it/python]
360cf935a640: Preparing
69bbfcd90cfc: Preparing
3d49571c0892: Preparing
dea1a8f0b709: Preparing
059b5ce725b2: Preparing
d71ed68bf1a4: Preparing
8e6516a870e3: Preparing
1435c4bac103: Preparing
43d073594e29: Preparing
801d9ec76403: Preparing
4bae804cfcdc: Preparing
891fa86dfd1d: Preparing
4438bc41581a: Preparing
f370a05d981b: Preparing
1435c4bac103: Waiting
43d073594e29: Waiting
801d9ec76403: Waiting
f370a05d981b: Waiting
4bae804cfcdc: Waiting
891fa86dfd1d: Waiting
4438bc41581a: Waiting
8e6516a870e3: Waiting
d71ed68bf1a4: Waiting
69bbfcd90cfc: Pushed
360cf935a640: Pushed
059b5ce725b2: Pushed
8e6516a870e3: Layer already exists
1435c4bac103: Layer already exists
801d9ec76403: Layer already exists
43d073594e29: Layer already exists
dea1a8f0b709: Pushed
891fa86dfd1d: Layer already exists
4bae804cfcdc: Layer already exists
f370a05d981b: Layer already exists
4438bc41581a: Layer already exists
d71ed68bf1a4: Pushed
3d49571c0892: Pushed
20230730154640: digest: sha256:c9ba1f53354cc95940b1a871e6750c6a7bbddf94c11bc1e540f623e62d6c40c6 size: 3268

> Task :runners:google-cloud-dataflow-java:setupXVR

> Task :runners:google-cloud-dataflow-java:validatesCrossLanguageRunnerSetup
Launching Java expansion service @ 33031
Launching Python expansion service @ 33349

> Task :runners:google-cloud-dataflow-java:validatesCrossLanguageRunnerJavaUsingPython

org.apache.beam.runners.core.construction.ValidateRunnerXlangTest$GroupByKeyTest > test FAILED
    java.lang.RuntimeException at ValidateRunnerXlangTest.java:285
        Caused by: java.io.IOException at ValidateRunnerXlangTest.java:285
    java.lang.NullPointerException at Preconditions.java:980

org.apache.beam.runners.core.construction.ValidateRunnerXlangTest$CombinePerKeyTest > test FAILED
    java.lang.RuntimeException at ValidateRunnerXlangTest.java:349
        Caused by: java.io.IOException at ValidateRunnerXlangTest.java:349
    java.lang.NullPointerException at Preconditions.java:980

org.apache.beam.runners.core.construction.ValidateRunnerXlangTest$CombineGloballyTest > test FAILED
    java.lang.RuntimeException at ValidateRunnerXlangTest.java:328
        Caused by: java.io.IOException at ValidateRunnerXlangTest.java:328
    java.lang.NullPointerException at Preconditions.java:980

org.apache.beam.runners.core.construction.ValidateRunnerXlangTest$MultiInputOutputWithSideInputTest > test FAILED
    java.lang.RuntimeException at ValidateRunnerXlangTest.java:263
        Caused by: java.io.IOException at ValidateRunnerXlangTest.java:263
    java.lang.NullPointerException at Preconditions.java:980

org.apache.beam.runners.core.construction.ValidateRunnerXlangTest$PartitionTest > test FAILED
    java.lang.RuntimeException at ValidateRunnerXlangTest.java:392
        Caused by: java.io.IOException at ValidateRunnerXlangTest.java:392
    java.lang.NullPointerException at Preconditions.java:980

org.apache.beam.runners.core.construction.ValidateRunnerXlangTest$FlattenTest > test FAILED
    java.lang.RuntimeException at ValidateRunnerXlangTest.java:370
        Caused by: java.io.IOException at ValidateRunnerXlangTest.java:370
    java.lang.NullPointerException at Preconditions.java:980

org.apache.beam.sdk.extensions.python.transforms.PythonMapTest > testPythonMap FAILED
    java.lang.RuntimeException at PythonMapTest.java:41
        Caused by: java.io.IOException at PythonMapTest.java:41
    java.lang.NullPointerException at Preconditions.java:980

org.apache.beam.sdk.extensions.python.transforms.DataframeTransformTest > testDataframeSum FAILED
    java.lang.RuntimeException at DataframeTransformTest.java:50
    java.lang.NullPointerException at Preconditions.java:980

org.apache.beam.runners.core.construction.ValidateRunnerXlangTest$PythonDependenciesTest > test FAILED
    java.lang.RuntimeException at ValidateRunnerXlangTest.java:401
        Caused by: java.io.IOException at ValidateRunnerXlangTest.java:401
    java.lang.NullPointerException at Preconditions.java:980

org.apache.beam.sdk.extensions.python.transforms.RunInferenceTransformTest > testRunInferenceWithKVs FAILED
    java.lang.RuntimeException at RunInferenceTransformTest.java:108
        Caused by: java.io.IOException at RunInferenceTransformTest.java:108
    java.lang.NullPointerException at Preconditions.java:980

org.apache.beam.sdk.extensions.python.PythonExternalTransformTest > trivialPythonTransform FAILED
    java.lang.RuntimeException at PythonExternalTransformTest.java:58
        Caused by: java.io.IOException at PythonExternalTransformTest.java:58

org.apache.beam.sdk.extensions.python.PythonExternalTransformTest > pythonTransformWithDependencies FAILED
    java.lang.RuntimeException at PythonExternalTransformTest.java:73
        Caused by: java.io.IOException at PythonExternalTransformTest.java:73

org.apache.beam.sdk.extensions.python.transforms.PythonMapTest > testPythonFlatMap FAILED
    java.lang.RuntimeException at PythonMapTest.java:54
        Caused by: java.io.IOException at PythonMapTest.java:54
    java.lang.NullPointerException at Preconditions.java:980

org.apache.beam.runners.core.construction.ValidateRunnerXlangTest$CoGroupByKeyTest > test FAILED
    java.lang.RuntimeException at ValidateRunnerXlangTest.java:307
        Caused by: java.io.IOException at ValidateRunnerXlangTest.java:307
    java.lang.NullPointerException at Preconditions.java:980

org.apache.beam.sdk.extensions.python.transforms.RunInferenceTransformTest > testRunInference FAILED
    java.lang.RuntimeException at RunInferenceTransformTest.java:60
    java.lang.NullPointerException at Preconditions.java:980

org.apache.beam.runners.core.construction.ValidateRunnerXlangTest$SingleInputOutputTest > test FAILED
    java.lang.RuntimeException at ValidateRunnerXlangTest.java:242
        Caused by: java.io.IOException at ValidateRunnerXlangTest.java:242
    java.lang.NullPointerException at Preconditions.java:980

16 tests completed, 16 failed

> Task :runners:google-cloud-dataflow-java:validatesCrossLanguageRunnerJavaUsingPython FAILED
> Task :runners:google-cloud-dataflow-java:cleanupXVR UP-TO-DATE

> Task :runners:google-cloud-dataflow-java:cleanUpDockerPythonImages
Untagged: us.gcr.io/apache-beam-testing/java-postcommit-it/python:20230730154640
Untagged: us.gcr.io/apache-beam-testing/java-postcommit-it/python@sha256:c9ba1f53354cc95940b1a871e6750c6a7bbddf94c11bc1e540f623e62d6c40c6
WARNING: Successfully resolved tag to sha256, but it is recommended to use sha256 directly.
Tag: [us.gcr.io/apache-beam-testing/java-postcommit-it/python:20230730154640]
- referencing digest: [us.gcr.io/apache-beam-testing/java-postcommit-it/python@sha256:c9ba1f53354cc95940b1a871e6750c6a7bbddf94c11bc1e540f623e62d6c40c6]

Deleted [[us.gcr.io/apache-beam-testing/java-postcommit-it/python:20230730154640] (referencing [us.gcr.io/apache-beam-testing/java-postcommit-it/python@sha256:c9ba1f53354cc95940b1a871e6750c6a7bbddf94c11bc1e540f623e62d6c40c6])].
Removing untagged image us.gcr.io/apache-beam-testing/java-postcommit-it/python@sha256:c9ba1f53354cc95940b1a871e6750c6a7bbddf94c11bc1e540f623e62d6c40c6

> Task :runners:google-cloud-dataflow-java:cleanUpDockerJavaImages
Untagged: us.gcr.io/apache-beam-testing/java-postcommit-it/java:20230730154640
Untagged: us.gcr.io/apache-beam-testing/java-postcommit-it/java@sha256:b63f2862a7e72fdae77adbf19d130e00b90634fae72417cc643efbd6286d3578
WARNING: Successfully resolved tag to sha256, but it is recommended to use sha256 directly.
Tag: [us.gcr.io/apache-beam-testing/java-postcommit-it/java:20230730154640]
- referencing digest: [us.gcr.io/apache-beam-testing/java-postcommit-it/java@sha256:b63f2862a7e72fdae77adbf19d130e00b90634fae72417cc643efbd6286d3578]

Deleted [[us.gcr.io/apache-beam-testing/java-postcommit-it/java:20230730154640] (referencing [us.gcr.io/apache-beam-testing/java-postcommit-it/java@sha256:b63f2862a7e72fdae77adbf19d130e00b90634fae72417cc643efbd6286d3578])].
Removing untagged image us.gcr.io/apache-beam-testing/java-postcommit-it/java@sha256:b63f2862a7e72fdae77adbf19d130e00b90634fae72417cc643efbd6286d3578

> Task :runners:google-cloud-dataflow-java:validatesCrossLanguageRunnerCleanup
Stopping expansion service pid: 149616.
Stopping expansion service pid: 149617.

FAILURE: Build failed with an exception.

* What went wrong:
Execution failed for task ':runners:google-cloud-dataflow-java:validatesCrossLanguageRunnerJavaUsingPython'.
> There were failing tests. See the report at: file://<https://ci-beam.apache.org/job/beam_PostCommit_XVR_JavaUsingPython_Dataflow/ws/src/runners/google-cloud-dataflow-java/build/reports/tests/validatesCrossLanguageRunnerJavaUsingPython/index.html>

* Try:
> Run with --stacktrace option to get the stack trace.
> Run with --info or --debug option to get more log output.

* Get more help at https://help.gradle.org

Deprecated Gradle features were used in this build, making it incompatible with Gradle 8.0.

You can use '--warning-mode all' to show the individual deprecation warnings and determine if they come from your own scripts or plugins.

See https://docs.gradle.org/7.6.2/userguide/command_line_interface.html#sec:command_line_warnings

Execution optimizations have been disabled for 1 invalid unit(s) of work during this build to ensure correctness.
Please consult deprecation warnings for more details.

BUILD FAILED in 13m 43s
185 actionable tasks: 25 executed, 160 up-to-date

Publishing build scan...
https://ge.apache.org/s/zi7apxlrklndo

Build step 'Invoke Gradle script' changed build result to FAILURE
Build step 'Invoke Gradle script' marked build as failure

---------------------------------------------------------------------
To unsubscribe, e-mail: builds-unsubscribe@beam.apache.org
For additional commands, e-mail: builds-help@beam.apache.org


Jenkins build is back to normal : beam_PostCommit_XVR_JavaUsingPython_Dataflow #2193

Posted by Apache Jenkins Server <je...@builds.apache.org>.
See <https://ci-beam.apache.org/job/beam_PostCommit_XVR_JavaUsingPython_Dataflow/2193/display/redirect>


---------------------------------------------------------------------
To unsubscribe, e-mail: builds-unsubscribe@beam.apache.org
For additional commands, e-mail: builds-help@beam.apache.org