You are viewing a plain text version of this content. The canonical link for it is here.
Posted to dev@hive.apache.org by Apache Hudson Server <hu...@hudson.zones.apache.org> on 2010/06/24 16:32:49 UTC
Build failed in Hudson: Hive-trunk-h0.17 #479
See <http://hudson.zones.apache.org/hudson/job/Hive-trunk-h0.17/479/changes>
Changes:
[namit] HIVE-1430. Dont run serialize plan by default (Ning Zhang via namit)
[jvs] HIVE-1176. 'create if not exists' fails for a table name with
'select' in it.
(Arvind Prabhakar via jvs)
[athusoo] HIVE-1271. Make matching of type information case insensitive.
(Arvind Prabhakar via Ashish Thusoo)
[jvs] HIVE-1359. Unit test should be shim-aware
(Ning Zhang via jvs)
------------------------------------------
[...truncated 11162 lines...]
[junit] POSTHOOK: Output: default@srcbucket2
[junit] OK
[junit] Loading data to table srcbucket2
[junit] POSTHOOK: Output: default@srcbucket2
[junit] OK
[junit] Loading data to table src
[junit] POSTHOOK: Output: default@src
[junit] OK
[junit] Loading data to table src1
[junit] POSTHOOK: Output: default@src1
[junit] OK
[junit] Loading data to table src_sequencefile
[junit] POSTHOOK: Output: default@src_sequencefile
[junit] OK
[junit] Loading data to table src_thrift
[junit] POSTHOOK: Output: default@src_thrift
[junit] OK
[junit] Loading data to table src_json
[junit] POSTHOOK: Output: default@src_json
[junit] OK
[junit] diff <http://hudson.zones.apache.org/hudson/job/Hive-trunk-h0.17/ws/hive/build/ql/test/logs/negative/unknown_function4.q.out> <http://hudson.zones.apache.org/hudson/job/Hive-trunk-h0.17/ws/hive/ql/src/test/results/compiler/errors/unknown_function4.q.out>
[junit] Done query: unknown_function4.q
[junit] Begin query: unknown_table1.q
[junit] Loading data to table srcpart partition (ds=2008-04-08, hr=11)
[junit] POSTHOOK: Output: default@srcpart@ds=2008-04-08/hr=11
[junit] OK
[junit] Loading data to table srcpart partition (ds=2008-04-08, hr=12)
[junit] POSTHOOK: Output: default@srcpart@ds=2008-04-08/hr=12
[junit] OK
[junit] Loading data to table srcpart partition (ds=2008-04-09, hr=11)
[junit] POSTHOOK: Output: default@srcpart@ds=2008-04-09/hr=11
[junit] OK
[junit] Loading data to table srcpart partition (ds=2008-04-09, hr=12)
[junit] POSTHOOK: Output: default@srcpart@ds=2008-04-09/hr=12
[junit] OK
[junit] POSTHOOK: Output: default@srcbucket
[junit] OK
[junit] Loading data to table srcbucket
[junit] POSTHOOK: Output: default@srcbucket
[junit] OK
[junit] Loading data to table srcbucket
[junit] POSTHOOK: Output: default@srcbucket
[junit] OK
[junit] POSTHOOK: Output: default@srcbucket2
[junit] OK
[junit] Loading data to table srcbucket2
[junit] POSTHOOK: Output: default@srcbucket2
[junit] OK
[junit] Loading data to table srcbucket2
[junit] POSTHOOK: Output: default@srcbucket2
[junit] OK
[junit] Loading data to table srcbucket2
[junit] POSTHOOK: Output: default@srcbucket2
[junit] OK
[junit] Loading data to table srcbucket2
[junit] POSTHOOK: Output: default@srcbucket2
[junit] OK
[junit] Loading data to table src
[junit] POSTHOOK: Output: default@src
[junit] OK
[junit] Loading data to table src1
[junit] POSTHOOK: Output: default@src1
[junit] OK
[junit] Loading data to table src_sequencefile
[junit] POSTHOOK: Output: default@src_sequencefile
[junit] OK
[junit] Loading data to table src_thrift
[junit] POSTHOOK: Output: default@src_thrift
[junit] OK
[junit] Loading data to table src_json
[junit] POSTHOOK: Output: default@src_json
[junit] OK
[junit] diff <http://hudson.zones.apache.org/hudson/job/Hive-trunk-h0.17/ws/hive/build/ql/test/logs/negative/unknown_table1.q.out> <http://hudson.zones.apache.org/hudson/job/Hive-trunk-h0.17/ws/hive/ql/src/test/results/compiler/errors/unknown_table1.q.out>
[junit] Done query: unknown_table1.q
[junit] Begin query: unknown_table2.q
[junit] Loading data to table srcpart partition (ds=2008-04-08, hr=11)
[junit] POSTHOOK: Output: default@srcpart@ds=2008-04-08/hr=11
[junit] OK
[junit] Loading data to table srcpart partition (ds=2008-04-08, hr=12)
[junit] POSTHOOK: Output: default@srcpart@ds=2008-04-08/hr=12
[junit] OK
[junit] Loading data to table srcpart partition (ds=2008-04-09, hr=11)
[junit] POSTHOOK: Output: default@srcpart@ds=2008-04-09/hr=11
[junit] OK
[junit] Loading data to table srcpart partition (ds=2008-04-09, hr=12)
[junit] POSTHOOK: Output: default@srcpart@ds=2008-04-09/hr=12
[junit] OK
[junit] POSTHOOK: Output: default@srcbucket
[junit] OK
[junit] Loading data to table srcbucket
[junit] POSTHOOK: Output: default@srcbucket
[junit] OK
[junit] Loading data to table srcbucket
[junit] POSTHOOK: Output: default@srcbucket
[junit] OK
[junit] POSTHOOK: Output: default@srcbucket2
[junit] OK
[junit] Loading data to table srcbucket2
[junit] POSTHOOK: Output: default@srcbucket2
[junit] OK
[junit] Loading data to table srcbucket2
[junit] POSTHOOK: Output: default@srcbucket2
[junit] OK
[junit] Loading data to table srcbucket2
[junit] POSTHOOK: Output: default@srcbucket2
[junit] OK
[junit] Loading data to table srcbucket2
[junit] POSTHOOK: Output: default@srcbucket2
[junit] OK
[junit] Loading data to table src
[junit] POSTHOOK: Output: default@src
[junit] OK
[junit] Loading data to table src1
[junit] POSTHOOK: Output: default@src1
[junit] OK
[junit] Loading data to table src_sequencefile
[junit] POSTHOOK: Output: default@src_sequencefile
[junit] OK
[junit] Loading data to table src_thrift
[junit] POSTHOOK: Output: default@src_thrift
[junit] OK
[junit] Loading data to table src_json
[junit] POSTHOOK: Output: default@src_json
[junit] OK
[junit] diff <http://hudson.zones.apache.org/hudson/job/Hive-trunk-h0.17/ws/hive/build/ql/test/logs/negative/unknown_table2.q.out> <http://hudson.zones.apache.org/hudson/job/Hive-trunk-h0.17/ws/hive/ql/src/test/results/compiler/errors/unknown_table2.q.out>
[junit] Done query: unknown_table2.q
[junit] Begin query: wrong_distinct1.q
[junit] Loading data to table srcpart partition (ds=2008-04-08, hr=11)
[junit] POSTHOOK: Output: default@srcpart@ds=2008-04-08/hr=11
[junit] OK
[junit] Loading data to table srcpart partition (ds=2008-04-08, hr=12)
[junit] POSTHOOK: Output: default@srcpart@ds=2008-04-08/hr=12
[junit] OK
[junit] Loading data to table srcpart partition (ds=2008-04-09, hr=11)
[junit] POSTHOOK: Output: default@srcpart@ds=2008-04-09/hr=11
[junit] OK
[junit] Loading data to table srcpart partition (ds=2008-04-09, hr=12)
[junit] POSTHOOK: Output: default@srcpart@ds=2008-04-09/hr=12
[junit] OK
[junit] POSTHOOK: Output: default@srcbucket
[junit] OK
[junit] Loading data to table srcbucket
[junit] POSTHOOK: Output: default@srcbucket
[junit] OK
[junit] Loading data to table srcbucket
[junit] POSTHOOK: Output: default@srcbucket
[junit] OK
[junit] POSTHOOK: Output: default@srcbucket2
[junit] OK
[junit] Loading data to table srcbucket2
[junit] POSTHOOK: Output: default@srcbucket2
[junit] OK
[junit] Loading data to table srcbucket2
[junit] POSTHOOK: Output: default@srcbucket2
[junit] OK
[junit] Loading data to table srcbucket2
[junit] POSTHOOK: Output: default@srcbucket2
[junit] OK
[junit] Loading data to table srcbucket2
[junit] POSTHOOK: Output: default@srcbucket2
[junit] OK
[junit] Loading data to table src
[junit] POSTHOOK: Output: default@src
[junit] OK
[junit] Loading data to table src1
[junit] POSTHOOK: Output: default@src1
[junit] OK
[junit] Loading data to table src_sequencefile
[junit] POSTHOOK: Output: default@src_sequencefile
[junit] OK
[junit] Loading data to table src_thrift
[junit] POSTHOOK: Output: default@src_thrift
[junit] OK
[junit] Loading data to table src_json
[junit] POSTHOOK: Output: default@src_json
[junit] OK
[junit] diff <http://hudson.zones.apache.org/hudson/job/Hive-trunk-h0.17/ws/hive/build/ql/test/logs/negative/wrong_distinct1.q.out> <http://hudson.zones.apache.org/hudson/job/Hive-trunk-h0.17/ws/hive/ql/src/test/results/compiler/errors/wrong_distinct1.q.out>
[junit] Done query: wrong_distinct1.q
[junit] Begin query: wrong_distinct2.q
[junit] Loading data to table srcpart partition (ds=2008-04-08, hr=11)
[junit] POSTHOOK: Output: default@srcpart@ds=2008-04-08/hr=11
[junit] OK
[junit] Loading data to table srcpart partition (ds=2008-04-08, hr=12)
[junit] POSTHOOK: Output: default@srcpart@ds=2008-04-08/hr=12
[junit] OK
[junit] Loading data to table srcpart partition (ds=2008-04-09, hr=11)
[junit] POSTHOOK: Output: default@srcpart@ds=2008-04-09/hr=11
[junit] OK
[junit] Loading data to table srcpart partition (ds=2008-04-09, hr=12)
[junit] POSTHOOK: Output: default@srcpart@ds=2008-04-09/hr=12
[junit] OK
[junit] POSTHOOK: Output: default@srcbucket
[junit] OK
[junit] Loading data to table srcbucket
[junit] POSTHOOK: Output: default@srcbucket
[junit] OK
[junit] Loading data to table srcbucket
[junit] POSTHOOK: Output: default@srcbucket
[junit] OK
[junit] POSTHOOK: Output: default@srcbucket2
[junit] OK
[junit] Loading data to table srcbucket2
[junit] POSTHOOK: Output: default@srcbucket2
[junit] OK
[junit] Loading data to table srcbucket2
[junit] POSTHOOK: Output: default@srcbucket2
[junit] OK
[junit] Loading data to table srcbucket2
[junit] POSTHOOK: Output: default@srcbucket2
[junit] OK
[junit] Loading data to table srcbucket2
[junit] POSTHOOK: Output: default@srcbucket2
[junit] OK
[junit] Loading data to table src
[junit] POSTHOOK: Output: default@src
[junit] OK
[junit] Loading data to table src1
[junit] POSTHOOK: Output: default@src1
[junit] OK
[junit] Loading data to table src_sequencefile
[junit] POSTHOOK: Output: default@src_sequencefile
[junit] OK
[junit] Loading data to table src_thrift
[junit] POSTHOOK: Output: default@src_thrift
[junit] OK
[junit] Loading data to table src_json
[junit] POSTHOOK: Output: default@src_json
[junit] OK
[junit] diff <http://hudson.zones.apache.org/hudson/job/Hive-trunk-h0.17/ws/hive/build/ql/test/logs/negative/wrong_distinct2.q.out> <http://hudson.zones.apache.org/hudson/job/Hive-trunk-h0.17/ws/hive/ql/src/test/results/compiler/errors/wrong_distinct2.q.out>
[junit] Done query: wrong_distinct2.q
[junit] Tests run: 31, Failures: 0, Errors: 0, Time elapsed: 44.746 sec
[junit] Running org.apache.hadoop.hive.ql.tool.TestLineageInfo
[junit] Tests run: 5, Failures: 0, Errors: 0, Time elapsed: 0.346 sec
[junit] Running org.apache.hadoop.hive.ql.udf.TestUDFDateAdd
[junit] Tests run: 2, Failures: 0, Errors: 0, Time elapsed: 0.185 sec
[junit] Running org.apache.hadoop.hive.ql.udf.TestUDFDateDiff
[junit] Tests run: 1, Failures: 0, Errors: 0, Time elapsed: 0.154 sec
[junit] Running org.apache.hadoop.hive.ql.udf.TestUDFDateSub
[junit] Tests run: 2, Failures: 0, Errors: 0, Time elapsed: 0.154 sec
BUILD FAILED
<http://hudson.zones.apache.org/hudson/job/Hive-trunk-h0.17/ws/hive/build.xml>:166: The following error occurred while executing this line:
<http://hudson.zones.apache.org/hudson/job/Hive-trunk-h0.17/ws/hive/build.xml>:103: The following error occurred while executing this line:
<http://hudson.zones.apache.org/hudson/job/Hive-trunk-h0.17/ws/hive/build-common.xml>:432: Tests failed!
Total time: 85 minutes 1 second
Publishing Javadoc
Recording test results
[TASKS] Skipping publisher since build result is FAILURE
Hudson build is back to normal : Hive-trunk-h0.17 #481
Posted by Apache Hudson Server <hu...@hudson.zones.apache.org>.
See <http://hudson.zones.apache.org/hudson/job/Hive-trunk-h0.17/481/changes>
Build failed in Hudson: Hive-trunk-h0.17 #480
Posted by Apache Hudson Server <hu...@hudson.zones.apache.org>.
See <http://hudson.zones.apache.org/hudson/job/Hive-trunk-h0.17/480/changes>
Changes:
[jvs] HIVE-1435. Upgraded naming scheme causes JDO exceptions
(Paul Yang via jvs)
[namit] HIVE-1405. Add ability to run an initialization script by 'hive -i <fileName>' (John Sichi via namit)
------------------------------------------
[...truncated 3912 lines...]
[junit] diff -a -I file: -I /tmp/ -I invalidscheme: -I lastUpdateTime -I lastAccessTime -I owner -I transient_lastDdlTime -I java.lang.RuntimeException -I at org -I at sun -I at java -I at junit -I Caused by: -I [.][.][.] [0-9]* more <http://hudson.zones.apache.org/hudson/job/Hive-trunk-h0.17/ws/hive/build/ql/test/logs/clientpositive/partition_wise_fileformat.q.out> <http://hudson.zones.apache.org/hudson/job/Hive-trunk-h0.17/ws/hive/ql/src/test/results/clientpositive/partition_wise_fileformat.q.out>
[junit] Done query: partition_wise_fileformat.q
[junit] Begin query: partition_wise_fileformat2.q
[junit] diff -a -I file: -I /tmp/ -I invalidscheme: -I lastUpdateTime -I lastAccessTime -I owner -I transient_lastDdlTime -I java.lang.RuntimeException -I at org -I at sun -I at java -I at junit -I Caused by: -I [.][.][.] [0-9]* more <http://hudson.zones.apache.org/hudson/job/Hive-trunk-h0.17/ws/hive/build/ql/test/logs/clientpositive/partition_wise_fileformat2.q.out> <http://hudson.zones.apache.org/hudson/job/Hive-trunk-h0.17/ws/hive/ql/src/test/results/clientpositive/partition_wise_fileformat2.q.out>
[junit] Done query: partition_wise_fileformat2.q
[junit] Begin query: partition_wise_fileformat3.q
[junit] diff -a -I file: -I /tmp/ -I invalidscheme: -I lastUpdateTime -I lastAccessTime -I owner -I transient_lastDdlTime -I java.lang.RuntimeException -I at org -I at sun -I at java -I at junit -I Caused by: -I [.][.][.] [0-9]* more <http://hudson.zones.apache.org/hudson/job/Hive-trunk-h0.17/ws/hive/build/ql/test/logs/clientpositive/partition_wise_fileformat3.q.out> <http://hudson.zones.apache.org/hudson/job/Hive-trunk-h0.17/ws/hive/ql/src/test/results/clientpositive/partition_wise_fileformat3.q.out>
[junit] Done query: partition_wise_fileformat3.q
[junit] Begin query: ppd1.q
[junit] diff -a -I file: -I /tmp/ -I invalidscheme: -I lastUpdateTime -I lastAccessTime -I owner -I transient_lastDdlTime -I java.lang.RuntimeException -I at org -I at sun -I at java -I at junit -I Caused by: -I [.][.][.] [0-9]* more <http://hudson.zones.apache.org/hudson/job/Hive-trunk-h0.17/ws/hive/build/ql/test/logs/clientpositive/ppd1.q.out> <http://hudson.zones.apache.org/hudson/job/Hive-trunk-h0.17/ws/hive/ql/src/test/results/clientpositive/ppd1.q.out>
[junit] Done query: ppd1.q
[junit] Begin query: ppd_clusterby.q
[junit] diff -a -I file: -I /tmp/ -I invalidscheme: -I lastUpdateTime -I lastAccessTime -I owner -I transient_lastDdlTime -I java.lang.RuntimeException -I at org -I at sun -I at java -I at junit -I Caused by: -I [.][.][.] [0-9]* more <http://hudson.zones.apache.org/hudson/job/Hive-trunk-h0.17/ws/hive/build/ql/test/logs/clientpositive/ppd_clusterby.q.out> <http://hudson.zones.apache.org/hudson/job/Hive-trunk-h0.17/ws/hive/ql/src/test/results/clientpositive/ppd_clusterby.q.out>
[junit] Done query: ppd_clusterby.q
[junit] Begin query: ppd_constant_expr.q
[junit] diff -a -I file: -I /tmp/ -I invalidscheme: -I lastUpdateTime -I lastAccessTime -I owner -I transient_lastDdlTime -I java.lang.RuntimeException -I at org -I at sun -I at java -I at junit -I Caused by: -I [.][.][.] [0-9]* more <http://hudson.zones.apache.org/hudson/job/Hive-trunk-h0.17/ws/hive/build/ql/test/logs/clientpositive/ppd_constant_expr.q.out> <http://hudson.zones.apache.org/hudson/job/Hive-trunk-h0.17/ws/hive/ql/src/test/results/clientpositive/ppd_constant_expr.q.out>
[junit] Done query: ppd_constant_expr.q
[junit] Begin query: ppd_gby.q
[junit] diff -a -I file: -I /tmp/ -I invalidscheme: -I lastUpdateTime -I lastAccessTime -I owner -I transient_lastDdlTime -I java.lang.RuntimeException -I at org -I at sun -I at java -I at junit -I Caused by: -I [.][.][.] [0-9]* more <http://hudson.zones.apache.org/hudson/job/Hive-trunk-h0.17/ws/hive/build/ql/test/logs/clientpositive/ppd_gby.q.out> <http://hudson.zones.apache.org/hudson/job/Hive-trunk-h0.17/ws/hive/ql/src/test/results/clientpositive/ppd_gby.q.out>
[junit] Done query: ppd_gby.q
[junit] Begin query: ppd_gby2.q
[junit] diff -a -I file: -I /tmp/ -I invalidscheme: -I lastUpdateTime -I lastAccessTime -I owner -I transient_lastDdlTime -I java.lang.RuntimeException -I at org -I at sun -I at java -I at junit -I Caused by: -I [.][.][.] [0-9]* more <http://hudson.zones.apache.org/hudson/job/Hive-trunk-h0.17/ws/hive/build/ql/test/logs/clientpositive/ppd_gby2.q.out> <http://hudson.zones.apache.org/hudson/job/Hive-trunk-h0.17/ws/hive/ql/src/test/results/clientpositive/ppd_gby2.q.out>
[junit] Done query: ppd_gby2.q
[junit] Begin query: ppd_gby_join.q
[junit] diff -a -I file: -I /tmp/ -I invalidscheme: -I lastUpdateTime -I lastAccessTime -I owner -I transient_lastDdlTime -I java.lang.RuntimeException -I at org -I at sun -I at java -I at junit -I Caused by: -I [.][.][.] [0-9]* more <http://hudson.zones.apache.org/hudson/job/Hive-trunk-h0.17/ws/hive/build/ql/test/logs/clientpositive/ppd_gby_join.q.out> <http://hudson.zones.apache.org/hudson/job/Hive-trunk-h0.17/ws/hive/ql/src/test/results/clientpositive/ppd_gby_join.q.out>
[junit] Done query: ppd_gby_join.q
[junit] Begin query: ppd_join.q
[junit] diff -a -I file: -I /tmp/ -I invalidscheme: -I lastUpdateTime -I lastAccessTime -I owner -I transient_lastDdlTime -I java.lang.RuntimeException -I at org -I at sun -I at java -I at junit -I Caused by: -I [.][.][.] [0-9]* more <http://hudson.zones.apache.org/hudson/job/Hive-trunk-h0.17/ws/hive/build/ql/test/logs/clientpositive/ppd_join.q.out> <http://hudson.zones.apache.org/hudson/job/Hive-trunk-h0.17/ws/hive/ql/src/test/results/clientpositive/ppd_join.q.out>
[junit] Done query: ppd_join.q
[junit] Begin query: ppd_join2.q
[junit] diff -a -I file: -I /tmp/ -I invalidscheme: -I lastUpdateTime -I lastAccessTime -I owner -I transient_lastDdlTime -I java.lang.RuntimeException -I at org -I at sun -I at java -I at junit -I Caused by: -I [.][.][.] [0-9]* more <http://hudson.zones.apache.org/hudson/job/Hive-trunk-h0.17/ws/hive/build/ql/test/logs/clientpositive/ppd_join2.q.out> <http://hudson.zones.apache.org/hudson/job/Hive-trunk-h0.17/ws/hive/ql/src/test/results/clientpositive/ppd_join2.q.out>
[junit] Done query: ppd_join2.q
[junit] Begin query: ppd_join3.q
[junit] diff -a -I file: -I /tmp/ -I invalidscheme: -I lastUpdateTime -I lastAccessTime -I owner -I transient_lastDdlTime -I java.lang.RuntimeException -I at org -I at sun -I at java -I at junit -I Caused by: -I [.][.][.] [0-9]* more <http://hudson.zones.apache.org/hudson/job/Hive-trunk-h0.17/ws/hive/build/ql/test/logs/clientpositive/ppd_join3.q.out> <http://hudson.zones.apache.org/hudson/job/Hive-trunk-h0.17/ws/hive/ql/src/test/results/clientpositive/ppd_join3.q.out>
[junit] Done query: ppd_join3.q
[junit] Begin query: ppd_multi_insert.q
[junit] diff -a -I file: -I /tmp/ -I invalidscheme: -I lastUpdateTime -I lastAccessTime -I owner -I transient_lastDdlTime -I java.lang.RuntimeException -I at org -I at sun -I at java -I at junit -I Caused by: -I [.][.][.] [0-9]* more <http://hudson.zones.apache.org/hudson/job/Hive-trunk-h0.17/ws/hive/build/ql/test/logs/clientpositive/ppd_multi_insert.q.out> <http://hudson.zones.apache.org/hudson/job/Hive-trunk-h0.17/ws/hive/ql/src/test/results/clientpositive/ppd_multi_insert.q.out>
[junit] Done query: ppd_multi_insert.q
[junit] Begin query: ppd_outer_join1.q
[junit] diff -a -I file: -I /tmp/ -I invalidscheme: -I lastUpdateTime -I lastAccessTime -I owner -I transient_lastDdlTime -I java.lang.RuntimeException -I at org -I at sun -I at java -I at junit -I Caused by: -I [.][.][.] [0-9]* more <http://hudson.zones.apache.org/hudson/job/Hive-trunk-h0.17/ws/hive/build/ql/test/logs/clientpositive/ppd_outer_join1.q.out> <http://hudson.zones.apache.org/hudson/job/Hive-trunk-h0.17/ws/hive/ql/src/test/results/clientpositive/ppd_outer_join1.q.out>
[junit] Done query: ppd_outer_join1.q
[junit] Begin query: ppd_outer_join2.q
[junit] diff -a -I file: -I /tmp/ -I invalidscheme: -I lastUpdateTime -I lastAccessTime -I owner -I transient_lastDdlTime -I java.lang.RuntimeException -I at org -I at sun -I at java -I at junit -I Caused by: -I [.][.][.] [0-9]* more <http://hudson.zones.apache.org/hudson/job/Hive-trunk-h0.17/ws/hive/build/ql/test/logs/clientpositive/ppd_outer_join2.q.out> <http://hudson.zones.apache.org/hudson/job/Hive-trunk-h0.17/ws/hive/ql/src/test/results/clientpositive/ppd_outer_join2.q.out>
[junit] Done query: ppd_outer_join2.q
[junit] Begin query: ppd_outer_join3.q
[junit] diff -a -I file: -I /tmp/ -I invalidscheme: -I lastUpdateTime -I lastAccessTime -I owner -I transient_lastDdlTime -I java.lang.RuntimeException -I at org -I at sun -I at java -I at junit -I Caused by: -I [.][.][.] [0-9]* more <http://hudson.zones.apache.org/hudson/job/Hive-trunk-h0.17/ws/hive/build/ql/test/logs/clientpositive/ppd_outer_join3.q.out> <http://hudson.zones.apache.org/hudson/job/Hive-trunk-h0.17/ws/hive/ql/src/test/results/clientpositive/ppd_outer_join3.q.out>
[junit] Done query: ppd_outer_join3.q
[junit] Begin query: ppd_outer_join4.q
[junit] diff -a -I file: -I /tmp/ -I invalidscheme: -I lastUpdateTime -I lastAccessTime -I owner -I transient_lastDdlTime -I java.lang.RuntimeException -I at org -I at sun -I at java -I at junit -I Caused by: -I [.][.][.] [0-9]* more <http://hudson.zones.apache.org/hudson/job/Hive-trunk-h0.17/ws/hive/build/ql/test/logs/clientpositive/ppd_outer_join4.q.out> <http://hudson.zones.apache.org/hudson/job/Hive-trunk-h0.17/ws/hive/ql/src/test/results/clientpositive/ppd_outer_join4.q.out>
[junit] Done query: ppd_outer_join4.q
[junit] Begin query: ppd_random.q
[junit] diff -a -I file: -I /tmp/ -I invalidscheme: -I lastUpdateTime -I lastAccessTime -I owner -I transient_lastDdlTime -I java.lang.RuntimeException -I at org -I at sun -I at java -I at junit -I Caused by: -I [.][.][.] [0-9]* more <http://hudson.zones.apache.org/hudson/job/Hive-trunk-h0.17/ws/hive/build/ql/test/logs/clientpositive/ppd_random.q.out> <http://hudson.zones.apache.org/hudson/job/Hive-trunk-h0.17/ws/hive/ql/src/test/results/clientpositive/ppd_random.q.out>
[junit] Done query: ppd_random.q
[junit] Begin query: ppd_transform.q
[junit] diff -a -I file: -I /tmp/ -I invalidscheme: -I lastUpdateTime -I lastAccessTime -I owner -I transient_lastDdlTime -I java.lang.RuntimeException -I at org -I at sun -I at java -I at junit -I Caused by: -I [.][.][.] [0-9]* more <http://hudson.zones.apache.org/hudson/job/Hive-trunk-h0.17/ws/hive/build/ql/test/logs/clientpositive/ppd_transform.q.out> <http://hudson.zones.apache.org/hudson/job/Hive-trunk-h0.17/ws/hive/ql/src/test/results/clientpositive/ppd_transform.q.out>
[junit] Done query: ppd_transform.q
[junit] Begin query: ppd_udf_case.q
[junit] diff -a -I file: -I /tmp/ -I invalidscheme: -I lastUpdateTime -I lastAccessTime -I owner -I transient_lastDdlTime -I java.lang.RuntimeException -I at org -I at sun -I at java -I at junit -I Caused by: -I [.][.][.] [0-9]* more <http://hudson.zones.apache.org/hudson/job/Hive-trunk-h0.17/ws/hive/build/ql/test/logs/clientpositive/ppd_udf_case.q.out> <http://hudson.zones.apache.org/hudson/job/Hive-trunk-h0.17/ws/hive/ql/src/test/results/clientpositive/ppd_udf_case.q.out>
[junit] Done query: ppd_udf_case.q
[junit] Begin query: ppd_union.q
[junit] diff -a -I file: -I /tmp/ -I invalidscheme: -I lastUpdateTime -I lastAccessTime -I owner -I transient_lastDdlTime -I java.lang.RuntimeException -I at org -I at sun -I at java -I at junit -I Caused by: -I [.][.][.] [0-9]* more <http://hudson.zones.apache.org/hudson/job/Hive-trunk-h0.17/ws/hive/build/ql/test/logs/clientpositive/ppd_union.q.out> <http://hudson.zones.apache.org/hudson/job/Hive-trunk-h0.17/ws/hive/ql/src/test/results/clientpositive/ppd_union.q.out>
[junit] Done query: ppd_union.q
[junit] Begin query: query_with_semi.q
[junit] diff -a -I file: -I /tmp/ -I invalidscheme: -I lastUpdateTime -I lastAccessTime -I owner -I transient_lastDdlTime -I java.lang.RuntimeException -I at org -I at sun -I at java -I at junit -I Caused by: -I [.][.][.] [0-9]* more <http://hudson.zones.apache.org/hudson/job/Hive-trunk-h0.17/ws/hive/build/ql/test/logs/clientpositive/query_with_semi.q.out> <http://hudson.zones.apache.org/hudson/job/Hive-trunk-h0.17/ws/hive/ql/src/test/results/clientpositive/query_with_semi.q.out>
[junit] Done query: query_with_semi.q
[junit] Begin query: quote1.q
[junit] diff -a -I file: -I /tmp/ -I invalidscheme: -I lastUpdateTime -I lastAccessTime -I owner -I transient_lastDdlTime -I java.lang.RuntimeException -I at org -I at sun -I at java -I at junit -I Caused by: -I [.][.][.] [0-9]* more <http://hudson.zones.apache.org/hudson/job/Hive-trunk-h0.17/ws/hive/build/ql/test/logs/clientpositive/quote1.q.out> <http://hudson.zones.apache.org/hudson/job/Hive-trunk-h0.17/ws/hive/ql/src/test/results/clientpositive/quote1.q.out>
[junit] Done query: quote1.q
[junit] Begin query: quote2.q
[junit] diff -a -I file: -I /tmp/ -I invalidscheme: -I lastUpdateTime -I lastAccessTime -I owner -I transient_lastDdlTime -I java.lang.RuntimeException -I at org -I at sun -I at java -I at junit -I Caused by: -I [.][.][.] [0-9]* more <http://hudson.zones.apache.org/hudson/job/Hive-trunk-h0.17/ws/hive/build/ql/test/logs/clientpositive/quote2.q.out> <http://hudson.zones.apache.org/hudson/job/Hive-trunk-h0.17/ws/hive/ql/src/test/results/clientpositive/quote2.q.out>
[junit] Done query: quote2.q
[junit] Begin query: rand_partitionpruner1.q
[junit] diff -a -I file: -I /tmp/ -I invalidscheme: -I lastUpdateTime -I lastAccessTime -I owner -I transient_lastDdlTime -I java.lang.RuntimeException -I at org -I at sun -I at java -I at junit -I Caused by: -I [.][.][.] [0-9]* more <http://hudson.zones.apache.org/hudson/job/Hive-trunk-h0.17/ws/hive/build/ql/test/logs/clientpositive/rand_partitionpruner1.q.out> <http://hudson.zones.apache.org/hudson/job/Hive-trunk-h0.17/ws/hive/ql/src/test/results/clientpositive/rand_partitionpruner1.q.out>
[junit] Done query: rand_partitionpruner1.q
[junit] Begin query: rand_partitionpruner2.q
[junit] diff -a -I file: -I /tmp/ -I invalidscheme: -I lastUpdateTime -I lastAccessTime -I owner -I transient_lastDdlTime -I java.lang.RuntimeException -I at org -I at sun -I at java -I at junit -I Caused by: -I [.][.][.] [0-9]* more <http://hudson.zones.apache.org/hudson/job/Hive-trunk-h0.17/ws/hive/build/ql/test/logs/clientpositive/rand_partitionpruner2.q.out> <http://hudson.zones.apache.org/hudson/job/Hive-trunk-h0.17/ws/hive/ql/src/test/results/clientpositive/rand_partitionpruner2.q.out>
[junit] Done query: rand_partitionpruner2.q
[junit] Begin query: rand_partitionpruner3.q
[junit] diff -a -I file: -I /tmp/ -I invalidscheme: -I lastUpdateTime -I lastAccessTime -I owner -I transient_lastDdlTime -I java.lang.RuntimeException -I at org -I at sun -I at java -I at junit -I Caused by: -I [.][.][.] [0-9]* more <http://hudson.zones.apache.org/hudson/job/Hive-trunk-h0.17/ws/hive/build/ql/test/logs/clientpositive/rand_partitionpruner3.q.out> <http://hudson.zones.apache.org/hudson/job/Hive-trunk-h0.17/ws/hive/ql/src/test/results/clientpositive/rand_partitionpruner3.q.out>
[junit] Done query: rand_partitionpruner3.q
[junit] Begin query: rcfile_bigdata.q
[junit] diff -a -I file: -I /tmp/ -I invalidscheme: -I lastUpdateTime -I lastAccessTime -I owner -I transient_lastDdlTime -I java.lang.RuntimeException -I at org -I at sun -I at java -I at junit -I Caused by: -I [.][.][.] [0-9]* more <http://hudson.zones.apache.org/hudson/job/Hive-trunk-h0.17/ws/hive/build/ql/test/logs/clientpositive/rcfile_bigdata.q.out> <http://hudson.zones.apache.org/hudson/job/Hive-trunk-h0.17/ws/hive/ql/src/test/results/clientpositive/rcfile_bigdata.q.out>
[junit] Done query: rcfile_bigdata.q
[junit] Begin query: rcfile_columnar.q
[junit] diff -a -I file: -I /tmp/ -I invalidscheme: -I lastUpdateTime -I lastAccessTime -I owner -I transient_lastDdlTime -I java.lang.RuntimeException -I at org -I at sun -I at java -I at junit -I Caused by: -I [.][.][.] [0-9]* more <http://hudson.zones.apache.org/hudson/job/Hive-trunk-h0.17/ws/hive/build/ql/test/logs/clientpositive/rcfile_columnar.q.out> <http://hudson.zones.apache.org/hudson/job/Hive-trunk-h0.17/ws/hive/ql/src/test/results/clientpositive/rcfile_columnar.q.out>
[junit] Done query: rcfile_columnar.q
[junit] Begin query: rcfile_default_format.q
[junit] diff -a -I file: -I /tmp/ -I invalidscheme: -I lastUpdateTime -I lastAccessTime -I owner -I transient_lastDdlTime -I java.lang.RuntimeException -I at org -I at sun -I at java -I at junit -I Caused by: -I [.][.][.] [0-9]* more <http://hudson.zones.apache.org/hudson/job/Hive-trunk-h0.17/ws/hive/build/ql/test/logs/clientpositive/rcfile_default_format.q.out> <http://hudson.zones.apache.org/hudson/job/Hive-trunk-h0.17/ws/hive/ql/src/test/results/clientpositive/rcfile_default_format.q.out>
[junit] Done query: rcfile_default_format.q
[junit] Begin query: rcfile_lazydecompress.q
[junit] diff -a -I file: -I /tmp/ -I invalidscheme: -I lastUpdateTime -I lastAccessTime -I owner -I transient_lastDdlTime -I java.lang.RuntimeException -I at org -I at sun -I at java -I at junit -I Caused by: -I [.][.][.] [0-9]* more <http://hudson.zones.apache.org/hudson/job/Hive-trunk-h0.17/ws/hive/build/ql/test/logs/clientpositive/rcfile_lazydecompress.q.out> <http://hudson.zones.apache.org/hudson/job/Hive-trunk-h0.17/ws/hive/ql/src/test/results/clientpositive/rcfile_lazydecompress.q.out>
[junit] Done query: rcfile_lazydecompress.q
[junit] Begin query: rcfile_null_value.q
[junit] diff -a -I file: -I /tmp/ -I invalidscheme: -I lastUpdateTime -I lastAccessTime -I owner -I transient_lastDdlTime -I java.lang.RuntimeException -I at org -I at sun -I at java -I at junit -I Caused by: -I [.][.][.] [0-9]* more <http://hudson.zones.apache.org/hudson/job/Hive-trunk-h0.17/ws/hive/build/ql/test/logs/clientpositive/rcfile_null_value.q.out> <http://hudson.zones.apache.org/hudson/job/Hive-trunk-h0.17/ws/hive/ql/src/test/results/clientpositive/rcfile_null_value.q.out>
[junit] Done query: rcfile_null_value.q
[junit] Begin query: rcfile_union.q
[junit] diff -a -I file: -I /tmp/ -I invalidscheme: -I lastUpdateTime -I lastAccessTime -I owner -I transient_lastDdlTime -I java.lang.RuntimeException -I at org -I at sun -I at java -I at junit -I Caused by: -I [.][.][.] [0-9]* more <http://hudson.zones.apache.org/hudson/job/Hive-trunk-h0.17/ws/hive/build/ql/test/logs/clientpositive/rcfile_union.q.out> <http://hudson.zones.apache.org/hudson/job/Hive-trunk-h0.17/ws/hive/ql/src/test/results/clientpositive/rcfile_union.q.out>
[junit] Done query: rcfile_union.q
[junit] Begin query: reduce_deduplicate.q
[junit] diff -a -I file: -I /tmp/ -I invalidscheme: -I lastUpdateTime -I lastAccessTime -I owner -I transient_lastDdlTime -I java.lang.RuntimeException -I at org -I at sun -I at java -I at junit -I Caused by: -I [.][.][.] [0-9]* more <http://hudson.zones.apache.org/hudson/job/Hive-trunk-h0.17/ws/hive/build/ql/test/logs/clientpositive/reduce_deduplicate.q.out> <http://hudson.zones.apache.org/hudson/job/Hive-trunk-h0.17/ws/hive/ql/src/test/results/clientpositive/reduce_deduplicate.q.out>
[junit] Done query: reduce_deduplicate.q
[junit] Begin query: regex_col.q
[junit] diff -a -I file: -I /tmp/ -I invalidscheme: -I lastUpdateTime -I lastAccessTime -I owner -I transient_lastDdlTime -I java.lang.RuntimeException -I at org -I at sun -I at java -I at junit -I Caused by: -I [.][.][.] [0-9]* more <http://hudson.zones.apache.org/hudson/job/Hive-trunk-h0.17/ws/hive/build/ql/test/logs/clientpositive/regex_col.q.out> <http://hudson.zones.apache.org/hudson/job/Hive-trunk-h0.17/ws/hive/ql/src/test/results/clientpositive/regex_col.q.out>
[junit] Done query: regex_col.q
[junit] Begin query: regexp_extract.q
[junit] diff -a -I file: -I /tmp/ -I invalidscheme: -I lastUpdateTime -I lastAccessTime -I owner -I transient_lastDdlTime -I java.lang.RuntimeException -I at org -I at sun -I at java -I at junit -I Caused by: -I [.][.][.] [0-9]* more <http://hudson.zones.apache.org/hudson/job/Hive-trunk-h0.17/ws/hive/build/ql/test/logs/clientpositive/regexp_extract.q.out> <http://hudson.zones.apache.org/hudson/job/Hive-trunk-h0.17/ws/hive/ql/src/test/results/clientpositive/regexp_extract.q.out>
[junit] Done query: regexp_extract.q
[junit] Begin query: rename_column.q
[junit] diff -a -I file: -I /tmp/ -I invalidscheme: -I lastUpdateTime -I lastAccessTime -I owner -I transient_lastDdlTime -I java.lang.RuntimeException -I at org -I at sun -I at java -I at junit -I Caused by: -I [.][.][.] [0-9]* more <http://hudson.zones.apache.org/hudson/job/Hive-trunk-h0.17/ws/hive/build/ql/test/logs/clientpositive/rename_column.q.out> <http://hudson.zones.apache.org/hudson/job/Hive-trunk-h0.17/ws/hive/ql/src/test/results/clientpositive/rename_column.q.out>
[junit] Done query: rename_column.q
[junit] Begin query: repair.q
[junit] diff -a -I file: -I /tmp/ -I invalidscheme: -I lastUpdateTime -I lastAccessTime -I owner -I transient_lastDdlTime -I java.lang.RuntimeException -I at org -I at sun -I at java -I at junit -I Caused by: -I [.][.][.] [0-9]* more <http://hudson.zones.apache.org/hudson/job/Hive-trunk-h0.17/ws/hive/build/ql/test/logs/clientpositive/repair.q.out> <http://hudson.zones.apache.org/hudson/job/Hive-trunk-h0.17/ws/hive/ql/src/test/results/clientpositive/repair.q.out>
[junit] Done query: repair.q
[junit] Begin query: router_join_ppr.q
[junit] diff -a -I file: -I /tmp/ -I invalidscheme: -I lastUpdateTime -I lastAccessTime -I owner -I transient_lastDdlTime -I java.lang.RuntimeException -I at org -I at sun -I at java -I at junit -I Caused by: -I [.][.][.] [0-9]* more <http://hudson.zones.apache.org/hudson/job/Hive-trunk-h0.17/ws/hive/build/ql/test/logs/clientpositive/router_join_ppr.q.out> <http://hudson.zones.apache.org/hudson/job/Hive-trunk-h0.17/ws/hive/ql/src/test/results/clientpositive/router_join_ppr.q.out>
[junit] Done query: router_join_ppr.q
[junit] Begin query: sample1.q
[junit] diff -a -I file: -I /tmp/ -I invalidscheme: -I lastUpdateTime -I lastAccessTime -I owner -I transient_lastDdlTime -I java.lang.RuntimeException -I at org -I at sun -I at java -I at junit -I Caused by: -I [.][.][.] [0-9]* more <http://hudson.zones.apache.org/hudson/job/Hive-trunk-h0.17/ws/hive/build/ql/test/logs/clientpositive/sample1.q.out> <http://hudson.zones.apache.org/hudson/job/Hive-trunk-h0.17/ws/hive/ql/src/test/results/clientpositive/sample1.q.out>
[junit] Done query: sample1.q
[junit] Begin query: sample10.q
[junit] Due to the Hadoop Version (0.17), adding query sample10.q to the set of tests to skip
[junit] Begin query: sample2.q
[junit] diff -a -I file: -I /tmp/ -I invalidscheme: -I lastUpdateTime -I lastAccessTime -I owner -I transient_lastDdlTime -I java.lang.RuntimeException -I at org -I at sun -I at java -I at junit -I Caused by: -I [.][.][.] [0-9]* more <http://hudson.zones.apache.org/hudson/job/Hive-trunk-h0.17/ws/hive/build/ql/test/logs/clientpositive/sample2.q.out> <http://hudson.zones.apache.org/hudson/job/Hive-trunk-h0.17/ws/hive/ql/src/test/results/clientpositive/sample2.q.out>
[junit] Done query: sample2.q
[junit] Begin query: sample3.q
[junit] diff -a -I file: -I /tmp/ -I invalidscheme: -I lastUpdateTime -I lastAccessTime -I owner -I transient_lastDdlTime -I java.lang.RuntimeException -I at org -I at sun -I at java -I at junit -I Caused by: -I [.][.][.] [0-9]* more <http://hudson.zones.apache.org/hudson/job/Hive-trunk-h0.17/ws/hive/build/ql/test/logs/clientpositive/sample3.q.out> <http://hudson.zones.apache.org/hudson/job/Hive-trunk-h0.17/ws/hive/ql/src/test/results/clientpositive/sample3.q.out>
[junit] Done query: sample3.q
[junit] Begin query: sample4.q
[junit] diff -a -I file: -I /tmp/ -I invalidscheme: -I lastUpdateTime -I lastAccessTime -I owner -I transient_lastDdlTime -I java.lang.RuntimeException -I at org -I at sun -I at java -I at junit -I Caused by: -I [.][.][.] [0-9]* more <http://hudson.zones.apache.org/hudson/job/Hive-trunk-h0.17/ws/hive/build/ql/test/logs/clientpositive/sample4.q.out> <http://hudson.zones.apache.org/hudson/job/Hive-trunk-h0.17/ws/hive/ql/src/test/results/clientpositive/sample4.q.out>
[junit] Done query: sample4.q
[junit] Begin query: sample5.q
[junit] diff -a -I file: -I /tmp/ -I invalidscheme: -I lastUpdateTime -I lastAccessTime -I owner -I transient_lastDdlTime -I java.lang.RuntimeException -I at org -I at sun -I at java -I at junit -I Caused by: -I [.][.][.] [0-9]* more <http://hudson.zones.apache.org/hudson/job/Hive-trunk-h0.17/ws/hive/build/ql/test/logs/clientpositive/sample5.q.out> <http://hudson.zones.apache.org/hudson/job/Hive-trunk-h0.17/ws/hive/ql/src/test/results/clientpositive/sample5.q.out>
[junit] Done query: sample5.q
[junit] Begin query: sample6.q
[junit] diff -a -I file: -I /tmp/ -I invalidscheme: -I lastUpdateTime -I lastAccessTime -I owner -I transient_lastDdlTime -I java.lang.RuntimeException -I at org -I at sun -I at java -I at junit -I Caused by: -I [.][.][.] [0-9]* more <http://hudson.zones.apache.org/hudson/job/Hive-trunk-h0.17/ws/hive/build/ql/test/logs/clientpositive/sample6.q.out> <http://hudson.zones.apache.org/hudson/job/Hive-trunk-h0.17/ws/hive/ql/src/test/results/clientpositive/sample6.q.out>
[junit] Done query: sample6.q
[junit] Begin query: sample7.q
[junit] diff -a -I file: -I /tmp/ -I invalidscheme: -I lastUpdateTime -I lastAccessTime -I owner -I transient_lastDdlTime -I java.lang.RuntimeException -I at org -I at sun -I at java -I at junit -I Caused by: -I [.][.][.] [0-9]* more <http://hudson.zones.apache.org/hudson/job/Hive-trunk-h0.17/ws/hive/build/ql/test/logs/clientpositive/sample7.q.out> <http://hudson.zones.apache.org/hudson/job/Hive-trunk-h0.17/ws/hive/ql/src/test/results/clientpositive/sample7.q.out>
[junit] Done query: sample7.q
[junit] Begin query: sample8.q
[junit] diff -a -I file: -I /tmp/ -I invalidscheme: -I lastUpdateTime -I lastAccessTime -I owner -I transient_lastDdlTime -I java.lang.RuntimeException -I at org -I at sun -I at java -I at junit -I Caused by: -I [.][.][.] [0-9]* more <http://hudson.zones.apache.org/hudson/job/Hive-trunk-h0.17/ws/hive/build/ql/test/logs/clientpositive/sample8.q.out> <http://hudson.zones.apache.org/hudson/job/Hive-trunk-h0.17/ws/hive/ql/src/test/results/clientpositive/sample8.q.out>
[junit] Done query: sample8.q
[junit] Begin query: sample9.q
[junit] diff -a -I file: -I /tmp/ -I invalidscheme: -I lastUpdateTime -I lastAccessTime -I owner -I transient_lastDdlTime -I java.lang.RuntimeException -I at org -I at sun -I at java -I at junit -I Caused by: -I [.][.][.] [0-9]* more <http://hudson.zones.apache.org/hudson/job/Hive-trunk-h0.17/ws/hive/build/ql/test/logs/clientpositive/sample9.q.out> <http://hudson.zones.apache.org/hudson/job/Hive-trunk-h0.17/ws/hive/ql/src/test/results/clientpositive/sample9.q.out>
[junit] Done query: sample9.q
[junit] Begin query: script_env_var1.q
[junit] diff -a -I file: -I /tmp/ -I invalidscheme: -I lastUpdateTime -I lastAccessTime -I owner -I transient_lastDdlTime -I java.lang.RuntimeException -I at org -I at sun -I at java -I at junit -I Caused by: -I [.][.][.] [0-9]* more <http://hudson.zones.apache.org/hudson/job/Hive-trunk-h0.17/ws/hive/build/ql/test/logs/clientpositive/script_env_var1.q.out> <http://hudson.zones.apache.org/hudson/job/Hive-trunk-h0.17/ws/hive/ql/src/test/results/clientpositive/script_env_var1.q.out>
[junit] Done query: script_env_var1.q
[junit] Begin query: script_env_var2.q
[junit] diff -a -I file: -I /tmp/ -I invalidscheme: -I lastUpdateTime -I lastAccessTime -I owner -I transient_lastDdlTime -I java.lang.RuntimeException -I at org -I at sun -I at java -I at junit -I Caused by: -I [.][.][.] [0-9]* more <http://hudson.zones.apache.org/hudson/job/Hive-trunk-h0.17/ws/hive/build/ql/test/logs/clientpositive/script_env_var2.q.out> <http://hudson.zones.apache.org/hudson/job/Hive-trunk-h0.17/ws/hive/ql/src/test/results/clientpositive/script_env_var2.q.out>
[junit] Done query: script_env_var2.q
[junit] Begin query: script_pipe.q
[junit] diff -a -I file: -I /tmp/ -I invalidscheme: -I lastUpdateTime -I lastAccessTime -I owner -I transient_lastDdlTime -I java.lang.RuntimeException -I at org -I at sun -I at java -I at junit -I Caused by: -I [.][.][.] [0-9]* more <http://hudson.zones.apache.org/hudson/job/Hive-trunk-h0.17/ws/hive/build/ql/test/logs/clientpositive/script_pipe.q.out> <http://hudson.zones.apache.org/hudson/job/Hive-trunk-h0.17/ws/hive/ql/src/test/results/clientpositive/script_pipe.q.out>
[junit] Done query: script_pipe.q
[junit] Begin query: scriptfile1.q
[junit] diff -a -I file: -I /tmp/ -I invalidscheme: -I lastUpdateTime -I lastAccessTime -I owner -I transient_lastDdlTime -I java.lang.RuntimeException -I at org -I at sun -I at java -I at junit -I Caused by: -I [.][.][.] [0-9]* more <http://hudson.zones.apache.org/hudson/job/Hive-trunk-h0.17/ws/hive/build/ql/test/logs/clientpositive/scriptfile1.q.out> <http://hudson.zones.apache.org/hudson/job/Hive-trunk-h0.17/ws/hive/ql/src/test/results/clientpositive/scriptfile1.q.out>
[junit] Done query: scriptfile1.q
[junit] Begin query: select_as_omitted.q
[junit] diff -a -I file: -I /tmp/ -I invalidscheme: -I lastUpdateTime -I lastAccessTime -I owner -I transient_lastDdlTime -I java.lang.RuntimeException -I at org -I at sun -I at java -I at junit -I Caused by: -I [.][.][.] [0-9]* more <http://hudson.zones.apache.org/hudson/job/Hive-trunk-h0.17/ws/hive/build/ql/test/logs/clientpositive/select_as_omitted.q.out> <http://hudson.zones.apache.org/hudson/job/Hive-trunk-h0.17/ws/hive/ql/src/test/results/clientpositive/select_as_omitted.q.out>
[junit] Done query: select_as_omitted.q
[junit] Begin query: select_transform_hint.q
[junit] diff -a -I file: -I /tmp/ -I invalidscheme: -I lastUpdateTime -I lastAccessTime -I owner -I transient_lastDdlTime -I java.lang.RuntimeException -I at org -I at sun -I at java -I at junit -I Caused by: -I [.][.][.] [0-9]* more <http://hudson.zones.apache.org/hudson/job/Hive-trunk-h0.17/ws/hive/build/ql/test/logs/clientpositive/select_transform_hint.q.out> <http://hudson.zones.apache.org/hudson/job/Hive-trunk-h0.17/ws/hive/ql/src/test/results/clientpositive/select_transform_hint.q.out>
[junit] Done query: select_transform_hint.q
[junit] Begin query: semijoin.q
[junit] diff -a -I file: -I /tmp/ -I invalidscheme: -I lastUpdateTime -I lastAccessTime -I owner -I transient_lastDdlTime -I java.lang.RuntimeException -I at org -I at sun -I at java -I at junit -I Caused by: -I [.][.][.] [0-9]* more <http://hudson.zones.apache.org/hudson/job/Hive-trunk-h0.17/ws/hive/build/ql/test/logs/clientpositive/semijoin.q.out> <http://hudson.zones.apache.org/hudson/job/Hive-trunk-h0.17/ws/hive/ql/src/test/results/clientpositive/semijoin.q.out>
[junit] Done query: semijoin.q
[junit] Begin query: show_describe_func_quotes.q
[junit] diff -a -I file: -I /tmp/ -I invalidscheme: -I lastUpdateTime -I lastAccessTime -I owner -I transient_lastDdlTime -I java.lang.RuntimeException -I at org -I at sun -I at java -I at junit -I Caused by: -I [.][.][.] [0-9]* more <http://hudson.zones.apache.org/hudson/job/Hive-trunk-h0.17/ws/hive/build/ql/test/logs/clientpositive/show_describe_func_quotes.q.out> <http://hudson.zones.apache.org/hudson/job/Hive-trunk-h0.17/ws/hive/ql/src/test/results/clientpositive/show_describe_func_quotes.q.out>
[junit] Done query: show_describe_func_quotes.q
[junit] Begin query: show_functions.q
[junit] diff -a -I file: -I /tmp/ -I invalidscheme: -I lastUpdateTime -I lastAccessTime -I owner -I transient_lastDdlTime -I java.lang.RuntimeException -I at org -I at sun -I at java -I at junit -I Caused by: -I [.][.][.] [0-9]* more <http://hudson.zones.apache.org/hudson/job/Hive-trunk-h0.17/ws/hive/build/ql/test/logs/clientpositive/show_functions.q.out> <http://hudson.zones.apache.org/hudson/job/Hive-trunk-h0.17/ws/hive/ql/src/test/results/clientpositive/show_functions.q.out>
[junit] Done query: show_functions.q
[junit] Begin query: show_partitions.q
[junit] diff -a -I file: -I /tmp/ -I invalidscheme: -I lastUpdateTime -I lastAccessTime -I owner -I transient_lastDdlTime -I java.lang.RuntimeException -I at org -I at sun -I at java -I at junit -I Caused by: -I [.][.][.] [0-9]* more <http://hudson.zones.apache.org/hudson/job/Hive-trunk-h0.17/ws/hive/build/ql/test/logs/clientpositive/show_partitions.q.out> <http://hudson.zones.apache.org/hudson/job/Hive-trunk-h0.17/ws/hive/ql/src/test/results/clientpositive/show_partitions.q.out>
[junit] Done query: show_partitions.q
[junit] Begin query: show_tables.q
[junit] diff -a -I file: -I /tmp/ -I invalidscheme: -I lastUpdateTime -I lastAccessTime -I owner -I transient_lastDdlTime -I java.lang.RuntimeException -I at org -I at sun -I at java -I at junit -I Caused by: -I [.][.][.] [0-9]* more <http://hudson.zones.apache.org/hudson/job/Hive-trunk-h0.17/ws/hive/build/ql/test/logs/clientpositive/show_tables.q.out> <http://hudson.zones.apache.org/hudson/job/Hive-trunk-h0.17/ws/hive/ql/src/test/results/clientpositive/show_tables.q.out>
[junit] Done query: show_tables.q
[junit] Begin query: show_tablestatus.q
[junit] diff -a -I file: -I /tmp/ -I invalidscheme: -I lastUpdateTime -I lastAccessTime -I owner -I transient_lastDdlTime -I java.lang.RuntimeException -I at org -I at sun -I at java -I at junit -I Caused by: -I [.][.][.] [0-9]* more <http://hudson.zones.apache.org/hudson/job/Hive-trunk-h0.17/ws/hive/build/ql/test/logs/clientpositive/show_tablestatus.q.out> <http://hudson.zones.apache.org/hudson/job/Hive-trunk-h0.17/ws/hive/ql/src/test/results/clientpositive/show_tablestatus.q.out>
[junit] Done query: show_tablestatus.q
[junit] Begin query: showparts.q
[junit] diff -a -I file: -I /tmp/ -I invalidscheme: -I lastUpdateTime -I lastAccessTime -I owner -I transient_lastDdlTime -I java.lang.RuntimeException -I at org -I at sun -I at java -I at junit -I Caused by: -I [.][.][.] [0-9]* more <http://hudson.zones.apache.org/hudson/job/Hive-trunk-h0.17/ws/hive/build/ql/test/logs/clientpositive/showparts.q.out> <http://hudson.zones.apache.org/hudson/job/Hive-trunk-h0.17/ws/hive/ql/src/test/results/clientpositive/showparts.q.out>
[junit] Done query: showparts.q
[junit] Begin query: skewjoin.q
[junit] diff -a -I file: -I /tmp/ -I invalidscheme: -I lastUpdateTime -I lastAccessTime -I owner -I transient_lastDdlTime -I java.lang.RuntimeException -I at org -I at sun -I at java -I at junit -I Caused by: -I [.][.][.] [0-9]* more <http://hudson.zones.apache.org/hudson/job/Hive-trunk-h0.17/ws/hive/build/ql/test/logs/clientpositive/skewjoin.q.out> <http://hudson.zones.apache.org/hudson/job/Hive-trunk-h0.17/ws/hive/ql/src/test/results/clientpositive/skewjoin.q.out>
[junit] Done query: skewjoin.q
[junit] Begin query: smb_mapjoin_1.q
[junit] diff -a -I file: -I /tmp/ -I invalidscheme: -I lastUpdateTime -I lastAccessTime -I owner -I transient_lastDdlTime -I java.lang.RuntimeException -I at org -I at sun -I at java -I at junit -I Caused by: -I [.][.][.] [0-9]* more <http://hudson.zones.apache.org/hudson/job/Hive-trunk-h0.17/ws/hive/build/ql/test/logs/clientpositive/smb_mapjoin_1.q.out> <http://hudson.zones.apache.org/hudson/job/Hive-trunk-h0.17/ws/hive/ql/src/test/results/clientpositive/smb_mapjoin_1.q.out>
[junit] Done query: smb_mapjoin_1.q
[junit] Begin query: smb_mapjoin_2.q
[junit] diff -a -I file: -I /tmp/ -I invalidscheme: -I lastUpdateTime -I lastAccessTime -I owner -I transient_lastDdlTime -I java.lang.RuntimeException -I at org -I at sun -I at java -I at junit -I Caused by: -I [.][.][.] [0-9]* more <http://hudson.zones.apache.org/hudson/job/Hive-trunk-h0.17/ws/hive/build/ql/test/logs/clientpositive/smb_mapjoin_2.q.out> <http://hudson.zones.apache.org/hudson/job/Hive-trunk-h0.17/ws/hive/ql/src/test/results/clientpositive/smb_mapjoin_2.q.out>
[junit] Done query: smb_mapjoin_2.q
[junit] Begin query: smb_mapjoin_3.q
[junit] diff -a -I file: -I /tmp/ -I invalidscheme: -I lastUpdateTime -I lastAccessTime -I owner -I transient_lastDdlTime -I java.lang.RuntimeException -I at org -I at sun -I at java -I at junit -I Caused by: -I [.][.][.] [0-9]* more <http://hudson.zones.apache.org/hudson/job/Hive-trunk-h0.17/ws/hive/build/ql/test/logs/clientpositive/smb_mapjoin_3.q.out> <http://hudson.zones.apache.org/hudson/job/Hive-trunk-h0.17/ws/hive/ql/src/test/results/clientpositive/smb_mapjoin_3.q.out>
[junit] Done query: smb_mapjoin_3.q
[junit] Begin query: smb_mapjoin_4.q
[junit] diff -a -I file: -I /tmp/ -I invalidscheme: -I lastUpdateTime -I lastAccessTime -I owner -I transient_lastDdlTime -I java.lang.RuntimeException -I at org -I at sun -I at java -I at junit -I Caused by: -I [.][.][.] [0-9]* more <http://hudson.zones.apache.org/hudson/job/Hive-trunk-h0.17/ws/hive/build/ql/test/logs/clientpositive/smb_mapjoin_4.q.out> <http://hudson.zones.apache.org/hudson/job/Hive-trunk-h0.17/ws/hive/ql/src/test/results/clientpositive/smb_mapjoin_4.q.out>
[junit] Done query: smb_mapjoin_4.q
[junit] Begin query: smb_mapjoin_5.q
[junit] diff -a -I file: -I /tmp/ -I invalidscheme: -I lastUpdateTime -I lastAccessTime -I owner -I transient_lastDdlTime -I java.lang.RuntimeException -I at org -I at sun -I at java -I at junit -I Caused by: -I [.][.][.] [0-9]* more <http://hudson.zones.apache.org/hudson/job/Hive-trunk-h0.17/ws/hive/build/ql/test/logs/clientpositive/smb_mapjoin_5.q.out> <http://hudson.zones.apache.org/hudson/job/Hive-trunk-h0.17/ws/hive/ql/src/test/results/clientpositive/smb_mapjoin_5.q.out>
[junit] Done query: smb_mapjoin_5.q
[junit] Begin query: smb_mapjoin_6.q
[junit] diff -a -I file: -I /tmp/ -I invalidscheme: -I lastUpdateTime -I lastAccessTime -I owner -I transient_lastDdlTime -I java.lang.RuntimeException -I at org -I at sun -I at java -I at junit -I Caused by: -I [.][.][.] [0-9]* more <http://hudson.zones.apache.org/hudson/job/Hive-trunk-h0.17/ws/hive/build/ql/test/logs/clientpositive/smb_mapjoin_6.q.out> <http://hudson.zones.apache.org/hudson/job/Hive-trunk-h0.17/ws/hive/ql/src/test/results/clientpositive/smb_mapjoin_6.q.out>
[junit] Done query: smb_mapjoin_6.q
[junit] Begin query: smb_mapjoin_7.q
[junit] diff -a -I file: -I /tmp/ -I invalidscheme: -I lastUpdateTime -I lastAccessTime -I owner -I transient_lastDdlTime -I java.lang.RuntimeException -I at org -I at sun -I at java -I at junit -I Caused by: -I [.][.][.] [0-9]* more <http://hudson.zones.apache.org/hudson/job/Hive-trunk-h0.17/ws/hive/build/ql/test/logs/clientpositive/smb_mapjoin_7.q.out> <http://hudson.zones.apache.org/hudson/job/Hive-trunk-h0.17/ws/hive/ql/src/test/results/clientpositive/smb_mapjoin_7.q.out>
[junit] Done query: smb_mapjoin_7.q
[junit] Begin query: smb_mapjoin_8.q
FATAL: command execution failed.
hudson.util.IOException2: Failed to join the process
at hudson.Proc$RemoteProc.join(Proc.java:312)
at hudson.Launcher$ProcStarter.join(Launcher.java:275)
at hudson.tasks.Ant.perform(Ant.java:212)
at hudson.tasks.BuildStepMonitor$1.perform(BuildStepMonitor.java:19)
at hudson.model.AbstractBuild$AbstractRunner.perform(AbstractBuild.java:582)
at hudson.model.Build$RunnerImpl.build(Build.java:165)
at hudson.model.Build$RunnerImpl.doRun(Build.java:132)
at hudson.model.AbstractBuild$AbstractRunner.run(AbstractBuild.java:416)
at hudson.model.Run.run(Run.java:1243)
at hudson.model.FreeStyleBuild.run(FreeStyleBuild.java:46)
at hudson.model.ResourceController.execute(ResourceController.java:88)
at hudson.model.Executor.run(Executor.java:122)
Caused by: java.util.concurrent.ExecutionException: hudson.remoting.RequestAbortedException: java.io.EOFException
at hudson.remoting.Request$1.get(Request.java:218)
at hudson.remoting.Request$1.get(Request.java:172)
at hudson.remoting.FutureAdapter.get(FutureAdapter.java:55)
at hudson.Proc$RemoteProc.join(Proc.java:304)
... 11 more
Caused by: hudson.remoting.RequestAbortedException: java.io.EOFException
at hudson.remoting.Request.abort(Request.java:257)
at hudson.remoting.Channel.terminate(Channel.java:598)
at hudson.remoting.Channel$ReaderThread.run(Channel.java:876)
Caused by: java.io.EOFException
at java.io.ObjectInputStream$BlockDataInputStream.peekByte(ObjectInputStream.java:2554)
at java.io.ObjectInputStream.readObject0(ObjectInputStream.java:1297)
at java.io.ObjectInputStream.readObject(ObjectInputStream.java:351)
at hudson.remoting.Channel$ReaderThread.run(Channel.java:856)
FATAL: channel is already closed
hudson.remoting.ChannelClosedException: channel is already closed
at hudson.remoting.Channel.send(Channel.java:412)
at hudson.remoting.Request.call(Request.java:105)
at hudson.remoting.Channel.call(Channel.java:551)
at hudson.Launcher$RemoteLauncher.kill(Launcher.java:735)
at hudson.model.AbstractBuild$AbstractRunner.run(AbstractBuild.java:421)
at hudson.model.Run.run(Run.java:1243)
at hudson.model.FreeStyleBuild.run(FreeStyleBuild.java:46)
at hudson.model.ResourceController.execute(ResourceController.java:88)
at hudson.model.Executor.run(Executor.java:122)