You are viewing a plain text version of this content. The canonical link for it is here.
Posted to dev@lucene.apache.org by Policeman Jenkins Server <je...@thetaphi.de> on 2017/05/12 13:14:38 UTC

[JENKINS] Lucene-Solr-master-MacOSX (64bit/jdk1.8.0) - Build # 4004 - Still Unstable!

Build: https://jenkins.thetaphi.de/job/Lucene-Solr-master-MacOSX/4004/
Java: 64bit/jdk1.8.0 -XX:-UseCompressedOops -XX:+UseSerialGC

1 tests failed.
FAILED:  org.apache.solr.cloud.CustomCollectionTest.testRouteFieldForImplicitRouter

Error Message:
Collection not found: withShardField

Stack Trace:
org.apache.solr.common.SolrException: Collection not found: withShardField
	at __randomizedtesting.SeedInfo.seed([C0E1DDC6CA6224D9:95B13554669BEB29]:0)
	at org.apache.solr.client.solrj.impl.CloudSolrClient.getCollectionNames(CloudSolrClient.java:1416)
	at org.apache.solr.client.solrj.impl.CloudSolrClient.requestWithRetryOnStaleState(CloudSolrClient.java:1099)
	at org.apache.solr.client.solrj.impl.CloudSolrClient.request(CloudSolrClient.java:1074)
	at org.apache.solr.client.solrj.SolrRequest.process(SolrRequest.java:160)
	at org.apache.solr.client.solrj.request.UpdateRequest.commit(UpdateRequest.java:233)
	at org.apache.solr.cloud.CustomCollectionTest.testRouteFieldForImplicitRouter(CustomCollectionTest.java:141)
	at sun.reflect.NativeMethodAccessorImpl.invoke0(Native Method)
	at sun.reflect.NativeMethodAccessorImpl.invoke(NativeMethodAccessorImpl.java:62)
	at sun.reflect.DelegatingMethodAccessorImpl.invoke(DelegatingMethodAccessorImpl.java:43)
	at java.lang.reflect.Method.invoke(Method.java:498)
	at com.carrotsearch.randomizedtesting.RandomizedRunner.invoke(RandomizedRunner.java:1713)
	at com.carrotsearch.randomizedtesting.RandomizedRunner$8.evaluate(RandomizedRunner.java:907)
	at com.carrotsearch.randomizedtesting.RandomizedRunner$9.evaluate(RandomizedRunner.java:943)
	at com.carrotsearch.randomizedtesting.RandomizedRunner$10.evaluate(RandomizedRunner.java:957)
	at com.carrotsearch.randomizedtesting.rules.SystemPropertiesRestoreRule$1.evaluate(SystemPropertiesRestoreRule.java:57)
	at org.apache.lucene.util.TestRuleSetupTeardownChained$1.evaluate(TestRuleSetupTeardownChained.java:49)
	at org.apache.lucene.util.AbstractBeforeAfterRule$1.evaluate(AbstractBeforeAfterRule.java:45)
	at org.apache.lucene.util.TestRuleThreadAndTestName$1.evaluate(TestRuleThreadAndTestName.java:48)
	at org.apache.lucene.util.TestRuleIgnoreAfterMaxFailures$1.evaluate(TestRuleIgnoreAfterMaxFailures.java:64)
	at org.apache.lucene.util.TestRuleMarkFailure$1.evaluate(TestRuleMarkFailure.java:47)
	at com.carrotsearch.randomizedtesting.rules.StatementAdapter.evaluate(StatementAdapter.java:36)
	at com.carrotsearch.randomizedtesting.ThreadLeakControl$StatementRunner.run(ThreadLeakControl.java:368)
	at com.carrotsearch.randomizedtesting.ThreadLeakControl.forkTimeoutingTask(ThreadLeakControl.java:817)
	at com.carrotsearch.randomizedtesting.ThreadLeakControl$3.evaluate(ThreadLeakControl.java:468)
	at com.carrotsearch.randomizedtesting.RandomizedRunner.runSingleTest(RandomizedRunner.java:916)
	at com.carrotsearch.randomizedtesting.RandomizedRunner$5.evaluate(RandomizedRunner.java:802)
	at com.carrotsearch.randomizedtesting.RandomizedRunner$6.evaluate(RandomizedRunner.java:852)
	at com.carrotsearch.randomizedtesting.RandomizedRunner$7.evaluate(RandomizedRunner.java:863)
	at com.carrotsearch.randomizedtesting.rules.StatementAdapter.evaluate(StatementAdapter.java:36)
	at com.carrotsearch.randomizedtesting.rules.SystemPropertiesRestoreRule$1.evaluate(SystemPropertiesRestoreRule.java:57)
	at org.apache.lucene.util.AbstractBeforeAfterRule$1.evaluate(AbstractBeforeAfterRule.java:45)
	at com.carrotsearch.randomizedtesting.rules.StatementAdapter.evaluate(StatementAdapter.java:36)
	at org.apache.lucene.util.TestRuleStoreClassName$1.evaluate(TestRuleStoreClassName.java:41)
	at com.carrotsearch.randomizedtesting.rules.NoShadowingOrOverridesOnMethodsRule$1.evaluate(NoShadowingOrOverridesOnMethodsRule.java:40)
	at com.carrotsearch.randomizedtesting.rules.NoShadowingOrOverridesOnMethodsRule$1.evaluate(NoShadowingOrOverridesOnMethodsRule.java:40)
	at com.carrotsearch.randomizedtesting.rules.StatementAdapter.evaluate(StatementAdapter.java:36)
	at com.carrotsearch.randomizedtesting.rules.StatementAdapter.evaluate(StatementAdapter.java:36)
	at com.carrotsearch.randomizedtesting.rules.StatementAdapter.evaluate(StatementAdapter.java:36)
	at org.apache.lucene.util.TestRuleAssertionsRequired$1.evaluate(TestRuleAssertionsRequired.java:53)
	at org.apache.lucene.util.TestRuleMarkFailure$1.evaluate(TestRuleMarkFailure.java:47)
	at org.apache.lucene.util.TestRuleIgnoreAfterMaxFailures$1.evaluate(TestRuleIgnoreAfterMaxFailures.java:64)
	at org.apache.lucene.util.TestRuleIgnoreTestSuites$1.evaluate(TestRuleIgnoreTestSuites.java:54)
	at com.carrotsearch.randomizedtesting.rules.StatementAdapter.evaluate(StatementAdapter.java:36)
	at com.carrotsearch.randomizedtesting.ThreadLeakControl$StatementRunner.run(ThreadLeakControl.java:368)
	at java.lang.Thread.run(Thread.java:748)




Build Log:
[...truncated 12608 lines...]
   [junit4] Suite: org.apache.solr.cloud.CustomCollectionTest
   [junit4]   2> Creating dataDir: /Users/jenkins/workspace/Lucene-Solr-master-MacOSX/solr/build/solr-core/test/J1/temp/solr.cloud.CustomCollectionTest_C0E1DDC6CA6224D9-001/init-core-data-001
   [junit4]   2> 2628427 WARN  (SUITE-CustomCollectionTest-seed#[C0E1DDC6CA6224D9]-worker) [    ] o.a.s.SolrTestCaseJ4 startTrackingSearchers: numOpens=40 numCloses=40
   [junit4]   2> 2628428 INFO  (SUITE-CustomCollectionTest-seed#[C0E1DDC6CA6224D9]-worker) [    ] o.a.s.SolrTestCaseJ4 Using PointFields
   [junit4]   2> 2628434 INFO  (SUITE-CustomCollectionTest-seed#[C0E1DDC6CA6224D9]-worker) [    ] o.a.s.SolrTestCaseJ4 Randomized ssl (false) and clientAuth (false) via: @org.apache.solr.util.RandomizeSSL(reason=, value=NaN, ssl=NaN, clientAuth=NaN) w/ MAC_OS_X supressed clientAuth
   [junit4]   2> 2628436 INFO  (SUITE-CustomCollectionTest-seed#[C0E1DDC6CA6224D9]-worker) [    ] o.a.s.c.MiniSolrCloudCluster Starting cluster of 4 servers in /Users/jenkins/workspace/Lucene-Solr-master-MacOSX/solr/build/solr-core/test/J1/temp/solr.cloud.CustomCollectionTest_C0E1DDC6CA6224D9-001/tempDir-001
   [junit4]   2> 2628436 INFO  (SUITE-CustomCollectionTest-seed#[C0E1DDC6CA6224D9]-worker) [    ] o.a.s.c.ZkTestServer STARTING ZK TEST SERVER
   [junit4]   2> 2628437 INFO  (Thread-2963) [    ] o.a.s.c.ZkTestServer client port:0.0.0.0/0.0.0.0:0
   [junit4]   2> 2628437 INFO  (Thread-2963) [    ] o.a.s.c.ZkTestServer Starting server
   [junit4]   2> 2628441 ERROR (Thread-2963) [    ] o.a.z.s.ZooKeeperServer ZKShutdownHandler is not registered, so ZooKeeper server won't take any action on ERROR or SHUTDOWN server state changes
   [junit4]   2> 2628538 INFO  (SUITE-CustomCollectionTest-seed#[C0E1DDC6CA6224D9]-worker) [    ] o.a.s.c.ZkTestServer start zk server on port:55946
   [junit4]   2> 2628595 INFO  (jetty-launcher-2383-thread-1) [    ] o.e.j.s.Server jetty-9.3.14.v20161028
   [junit4]   2> 2628595 INFO  (jetty-launcher-2383-thread-3) [    ] o.e.j.s.Server jetty-9.3.14.v20161028
   [junit4]   2> 2628595 INFO  (jetty-launcher-2383-thread-2) [    ] o.e.j.s.Server jetty-9.3.14.v20161028
   [junit4]   2> 2628596 INFO  (jetty-launcher-2383-thread-4) [    ] o.e.j.s.Server jetty-9.3.14.v20161028
   [junit4]   2> 2628602 INFO  (jetty-launcher-2383-thread-3) [    ] o.e.j.s.h.ContextHandler Started o.e.j.s.ServletContextHandler@30fd3db5{/solr,null,AVAILABLE}
   [junit4]   2> 2628602 INFO  (jetty-launcher-2383-thread-1) [    ] o.e.j.s.h.ContextHandler Started o.e.j.s.ServletContextHandler@38da888c{/solr,null,AVAILABLE}
   [junit4]   2> 2628604 INFO  (jetty-launcher-2383-thread-4) [    ] o.e.j.s.h.ContextHandler Started o.e.j.s.ServletContextHandler@4a9f4652{/solr,null,AVAILABLE}
   [junit4]   2> 2628604 INFO  (jetty-launcher-2383-thread-2) [    ] o.e.j.s.h.ContextHandler Started o.e.j.s.ServletContextHandler@4dd1f013{/solr,null,AVAILABLE}
   [junit4]   2> 2628605 INFO  (jetty-launcher-2383-thread-3) [    ] o.e.j.s.AbstractConnector Started ServerConnector@7280210e{HTTP/1.1,[http/1.1]}{127.0.0.1:55948}
   [junit4]   2> 2628605 INFO  (jetty-launcher-2383-thread-3) [    ] o.e.j.s.Server Started @2635555ms
   [junit4]   2> 2628605 INFO  (jetty-launcher-2383-thread-2) [    ] o.e.j.s.AbstractConnector Started ServerConnector@65d05d12{HTTP/1.1,[http/1.1]}{127.0.0.1:55951}
   [junit4]   2> 2628605 INFO  (jetty-launcher-2383-thread-3) [    ] o.a.s.c.s.e.JettySolrRunner Jetty properties: {hostContext=/solr, hostPort=55948}
   [junit4]   2> 2628605 INFO  (jetty-launcher-2383-thread-2) [    ] o.e.j.s.Server Started @2635555ms
   [junit4]   2> 2628605 INFO  (jetty-launcher-2383-thread-2) [    ] o.a.s.c.s.e.JettySolrRunner Jetty properties: {hostContext=/solr, hostPort=55951}
   [junit4]   2> 2628605 INFO  (jetty-launcher-2383-thread-1) [    ] o.e.j.s.AbstractConnector Started ServerConnector@1afb887{HTTP/1.1,[http/1.1]}{127.0.0.1:55949}
   [junit4]   2> 2628605 INFO  (jetty-launcher-2383-thread-1) [    ] o.e.j.s.Server Started @2635555ms
   [junit4]   2> 2628605 ERROR (jetty-launcher-2383-thread-3) [    ] o.a.s.s.StartupLoggingUtils Missing Java Option solr.log.dir. Logging may be missing or incomplete.
   [junit4]   2> 2628605 ERROR (jetty-launcher-2383-thread-2) [    ] o.a.s.s.StartupLoggingUtils Missing Java Option solr.log.dir. Logging may be missing or incomplete.
   [junit4]   2> 2628605 INFO  (jetty-launcher-2383-thread-1) [    ] o.a.s.c.s.e.JettySolrRunner Jetty properties: {hostContext=/solr, hostPort=55949}
   [junit4]   2> 2628608 INFO  (jetty-launcher-2383-thread-2) [    ] o.a.s.s.SolrDispatchFilter  ___      _       Welcome to Apache Solr? version 7.0.0
   [junit4]   2> 2628608 INFO  (jetty-launcher-2383-thread-2) [    ] o.a.s.s.SolrDispatchFilter / __| ___| |_ _   Starting in cloud mode on port null
   [junit4]   2> 2628608 INFO  (jetty-launcher-2383-thread-2) [    ] o.a.s.s.SolrDispatchFilter \__ \/ _ \ | '_|  Install dir: null
   [junit4]   2> 2628607 INFO  (jetty-launcher-2383-thread-3) [    ] o.a.s.s.SolrDispatchFilter  ___      _       Welcome to Apache Solr? version 7.0.0
   [junit4]   2> 2628608 INFO  (jetty-launcher-2383-thread-2) [    ] o.a.s.s.SolrDispatchFilter |___/\___/_|_|    Start time: 2017-05-12T12:24:25.386Z
   [junit4]   2> 2628608 INFO  (jetty-launcher-2383-thread-3) [    ] o.a.s.s.SolrDispatchFilter / __| ___| |_ _   Starting in cloud mode on port null
   [junit4]   2> 2628608 INFO  (jetty-launcher-2383-thread-3) [    ] o.a.s.s.SolrDispatchFilter \__ \/ _ \ | '_|  Install dir: null
   [junit4]   2> 2628608 INFO  (jetty-launcher-2383-thread-3) [    ] o.a.s.s.SolrDispatchFilter |___/\___/_|_|    Start time: 2017-05-12T12:24:25.386Z
   [junit4]   2> 2628607 INFO  (jetty-launcher-2383-thread-4) [    ] o.e.j.s.AbstractConnector Started ServerConnector@5257814f{HTTP/1.1,[http/1.1]}{127.0.0.1:55950}
   [junit4]   2> 2628609 INFO  (jetty-launcher-2383-thread-4) [    ] o.e.j.s.Server Started @2635559ms
   [junit4]   2> 2628608 ERROR (jetty-launcher-2383-thread-1) [    ] o.a.s.s.StartupLoggingUtils Missing Java Option solr.log.dir. Logging may be missing or incomplete.
   [junit4]   2> 2628609 INFO  (jetty-launcher-2383-thread-4) [    ] o.a.s.c.s.e.JettySolrRunner Jetty properties: {hostContext=/solr, hostPort=55950}
   [junit4]   2> 2628610 ERROR (jetty-launcher-2383-thread-4) [    ] o.a.s.s.StartupLoggingUtils Missing Java Option solr.log.dir. Logging may be missing or incomplete.
   [junit4]   2> 2628610 INFO  (jetty-launcher-2383-thread-1) [    ] o.a.s.s.SolrDispatchFilter  ___      _       Welcome to Apache Solr? version 7.0.0
   [junit4]   2> 2628610 INFO  (jetty-launcher-2383-thread-1) [    ] o.a.s.s.SolrDispatchFilter / __| ___| |_ _   Starting in cloud mode on port null
   [junit4]   2> 2628610 INFO  (jetty-launcher-2383-thread-1) [    ] o.a.s.s.SolrDispatchFilter \__ \/ _ \ | '_|  Install dir: null
   [junit4]   2> 2628610 INFO  (jetty-launcher-2383-thread-1) [    ] o.a.s.s.SolrDispatchFilter |___/\___/_|_|    Start time: 2017-05-12T12:24:25.388Z
   [junit4]   2> 2628611 INFO  (jetty-launcher-2383-thread-4) [    ] o.a.s.s.SolrDispatchFilter  ___      _       Welcome to Apache Solr? version 7.0.0
   [junit4]   2> 2628611 INFO  (jetty-launcher-2383-thread-4) [    ] o.a.s.s.SolrDispatchFilter / __| ___| |_ _   Starting in cloud mode on port null
   [junit4]   2> 2628611 INFO  (jetty-launcher-2383-thread-4) [    ] o.a.s.s.SolrDispatchFilter \__ \/ _ \ | '_|  Install dir: null
   [junit4]   2> 2628611 INFO  (jetty-launcher-2383-thread-4) [    ] o.a.s.s.SolrDispatchFilter |___/\___/_|_|    Start time: 2017-05-12T12:24:25.389Z
   [junit4]   2> 2628617 INFO  (jetty-launcher-2383-thread-2) [    ] o.a.s.s.SolrDispatchFilter solr.xml found in ZooKeeper. Loading...
   [junit4]   2> 2628618 INFO  (jetty-launcher-2383-thread-3) [    ] o.a.s.s.SolrDispatchFilter solr.xml found in ZooKeeper. Loading...
   [junit4]   2> 2628618 INFO  (jetty-launcher-2383-thread-1) [    ] o.a.s.s.SolrDispatchFilter solr.xml found in ZooKeeper. Loading...
   [junit4]   2> 2628619 INFO  (jetty-launcher-2383-thread-4) [    ] o.a.s.s.SolrDispatchFilter solr.xml found in ZooKeeper. Loading...
   [junit4]   2> 2628671 WARN  (NIOServerCxn.Factory:0.0.0.0/0.0.0.0:0) [    ] o.a.z.s.NIOServerCnxn caught end of stream exception
   [junit4]   2> EndOfStreamException: Unable to read additional data from client sessionid 0x15bfc9e01820004, likely client has closed socket
   [junit4]   2> 	at org.apache.zookeeper.server.NIOServerCnxn.doIO(NIOServerCnxn.java:239)
   [junit4]   2> 	at org.apache.zookeeper.server.NIOServerCnxnFactory.run(NIOServerCnxnFactory.java:203)
   [junit4]   2> 	at java.lang.Thread.run(Thread.java:748)
   [junit4]   2> 2628672 WARN  (NIOServerCxn.Factory:0.0.0.0/0.0.0.0:0) [    ] o.a.z.s.NIOServerCnxn caught end of stream exception
   [junit4]   2> EndOfStreamException: Unable to read additional data from client sessionid 0x15bfc9e01820001, likely client has closed socket
   [junit4]   2> 	at org.apache.zookeeper.server.NIOServerCnxn.doIO(NIOServerCnxn.java:239)
   [junit4]   2> 	at org.apache.zookeeper.server.NIOServerCnxnFactory.run(NIOServerCnxnFactory.java:203)
   [junit4]   2> 	at java.lang.Thread.run(Thread.java:748)
   [junit4]   2> 2628674 WARN  (NIOServerCxn.Factory:0.0.0.0/0.0.0.0:0) [    ] o.a.z.s.NIOServerCnxn caught end of stream exception
   [junit4]   2> EndOfStreamException: Unable to read additional data from client sessionid 0x15bfc9e01820002, likely client has closed socket
   [junit4]   2> 	at org.apache.zookeeper.server.NIOServerCnxn.doIO(NIOServerCnxn.java:239)
   [junit4]   2> 	at org.apache.zookeeper.server.NIOServerCnxnFactory.run(NIOServerCnxnFactory.java:203)
   [junit4]   2> 	at java.lang.Thread.run(Thread.java:748)
   [junit4]   2> 2628674 INFO  (jetty-launcher-2383-thread-4) [    ] o.a.s.c.ZkContainer Zookeeper client=127.0.0.1:55946/solr
   [junit4]   2> 2628674 INFO  (jetty-launcher-2383-thread-2) [    ] o.a.s.c.ZkContainer Zookeeper client=127.0.0.1:55946/solr
   [junit4]   2> 2628676 WARN  (NIOServerCxn.Factory:0.0.0.0/0.0.0.0:0) [    ] o.a.z.s.NIOServerCnxn caught end of stream exception
   [junit4]   2> EndOfStreamException: Unable to read additional data from client sessionid 0x15bfc9e01820003, likely client has closed socket
   [junit4]   2> 	at org.apache.zookeeper.server.NIOServerCnxn.doIO(NIOServerCnxn.java:239)
   [junit4]   2> 	at org.apache.zookeeper.server.NIOServerCnxnFactory.run(NIOServerCnxnFactory.java:203)
   [junit4]   2> 	at java.lang.Thread.run(Thread.java:748)
   [junit4]   2> 2628681 INFO  (jetty-launcher-2383-thread-3) [    ] o.a.s.c.ZkContainer Zookeeper client=127.0.0.1:55946/solr
   [junit4]   2> 2628682 INFO  (jetty-launcher-2383-thread-1) [    ] o.a.s.c.ZkContainer Zookeeper client=127.0.0.1:55946/solr
   [junit4]   2> 2628686 WARN  (NIOServerCxn.Factory:0.0.0.0/0.0.0.0:0) [    ] o.a.z.s.NIOServerCnxn caught end of stream exception
   [junit4]   2> EndOfStreamException: Unable to read additional data from client sessionid 0x15bfc9e01820005, likely client has closed socket
   [junit4]   2> 	at org.apache.zookeeper.server.NIOServerCnxn.doIO(NIOServerCnxn.java:239)
   [junit4]   2> 	at org.apache.zookeeper.server.NIOServerCnxnFactory.run(NIOServerCnxnFactory.java:203)
   [junit4]   2> 	at java.lang.Thread.run(Thread.java:748)
   [junit4]   2> 2628691 WARN  (NIOServerCxn.Factory:0.0.0.0/0.0.0.0:0) [    ] o.a.z.s.NIOServerCnxn caught end of stream exception
   [junit4]   2> EndOfStreamException: Unable to read additional data from client sessionid 0x15bfc9e01820007, likely client has closed socket
   [junit4]   2> 	at org.apache.zookeeper.server.NIOServerCnxn.doIO(NIOServerCnxn.java:239)
   [junit4]   2> 	at org.apache.zookeeper.server.NIOServerCnxnFactory.run(NIOServerCnxnFactory.java:203)
   [junit4]   2> 	at java.lang.Thread.run(Thread.java:748)
   [junit4]   2> 2628692 WARN  (NIOServerCxn.Factory:0.0.0.0/0.0.0.0:0) [    ] o.a.z.s.NIOServerCnxn caught end of stream exception
   [junit4]   2> EndOfStreamException: Unable to read additional data from client sessionid 0x15bfc9e01820008, likely client has closed socket
   [junit4]   2> 	at org.apache.zookeeper.server.NIOServerCnxn.doIO(NIOServerCnxn.java:239)
   [junit4]   2> 	at org.apache.zookeeper.server.NIOServerCnxnFactory.run(NIOServerCnxnFactory.java:203)
   [junit4]   2> 	at java.lang.Thread.run(Thread.java:748)
   [junit4]   2> 2628752 INFO  (jetty-launcher-2383-thread-3) [n:127.0.0.1:55948_solr    ] o.a.s.c.Overseer Overseer (id=null) closing
   [junit4]   2> 2628752 INFO  (jetty-launcher-2383-thread-1) [n:127.0.0.1:55949_solr    ] o.a.s.c.Overseer Overseer (id=null) closing
   [junit4]   2> 2628752 INFO  (jetty-launcher-2383-thread-4) [n:127.0.0.1:55950_solr    ] o.a.s.c.Overseer Overseer (id=null) closing
   [junit4]   2> 2628752 INFO  (jetty-launcher-2383-thread-2) [n:127.0.0.1:55951_solr    ] o.a.s.c.Overseer Overseer (id=null) closing
   [junit4]   2> 2628756 INFO  (jetty-launcher-2383-thread-4) [n:127.0.0.1:55950_solr    ] o.a.s.c.ZkController Register node as live in ZooKeeper:/live_nodes/127.0.0.1:55950_solr
   [junit4]   2> 2628757 INFO  (jetty-launcher-2383-thread-1) [n:127.0.0.1:55949_solr    ] o.a.s.c.ZkController Register node as live in ZooKeeper:/live_nodes/127.0.0.1:55949_solr
   [junit4]   2> 2628757 INFO  (jetty-launcher-2383-thread-3) [n:127.0.0.1:55948_solr    ] o.a.s.c.OverseerElectionContext I am going to be the leader 127.0.0.1:55948_solr
   [junit4]   2> 2628758 INFO  (jetty-launcher-2383-thread-2) [n:127.0.0.1:55951_solr    ] o.a.s.c.ZkController Register node as live in ZooKeeper:/live_nodes/127.0.0.1:55951_solr
   [junit4]   2> 2628763 INFO  (jetty-launcher-2383-thread-3) [n:127.0.0.1:55948_solr    ] o.a.s.c.Overseer Overseer (id=97949572478926859-127.0.0.1:55948_solr-n_0000000000) starting
   [junit4]   2> 2628808 INFO  (zkCallback-2405-thread-1-processing-n:127.0.0.1:55949_solr) [n:127.0.0.1:55949_solr    ] o.a.s.c.c.ZkStateReader Updated live nodes from ZooKeeper... (0) -> (3)
   [junit4]   2> 2628808 INFO  (zkCallback-2404-thread-1-processing-n:127.0.0.1:55948_solr) [n:127.0.0.1:55948_solr    ] o.a.s.c.c.ZkStateReader Updated live nodes from ZooKeeper... (0) -> (3)
   [junit4]   2> 2628810 INFO  (zkCallback-2402-thread-1-processing-n:127.0.0.1:55950_solr) [n:127.0.0.1:55950_solr    ] o.a.s.c.c.ZkStateReader Updated live nodes from ZooKeeper... (0) -> (3)
   [junit4]   2> 2628810 INFO  (zkCallback-2403-thread-1-processing-n:127.0.0.1:55951_solr) [n:127.0.0.1:55951_solr    ] o.a.s.c.c.ZkStateReader Updated live nodes from ZooKeeper... (0) -> (3)
   [junit4]   2> 2628829 INFO  (jetty-launcher-2383-thread-3) [n:127.0.0.1:55948_solr    ] o.a.s.c.ZkController Register node as live in ZooKeeper:/live_nodes/127.0.0.1:55948_solr
   [junit4]   2> 2628836 INFO  (zkCallback-2405-thread-1-processing-n:127.0.0.1:55949_solr) [n:127.0.0.1:55949_solr    ] o.a.s.c.c.ZkStateReader Updated live nodes from ZooKeeper... (3) -> (4)
   [junit4]   2> 2628836 INFO  (zkCallback-2404-thread-2-processing-n:127.0.0.1:55948_solr) [n:127.0.0.1:55948_solr    ] o.a.s.c.c.ZkStateReader Updated live nodes from ZooKeeper... (3) -> (4)
   [junit4]   2> 2628836 INFO  (zkCallback-2403-thread-2-processing-n:127.0.0.1:55951_solr) [n:127.0.0.1:55951_solr    ] o.a.s.c.c.ZkStateReader Updated live nodes from ZooKeeper... (3) -> (4)
   [junit4]   2> 2628836 INFO  (zkCallback-2402-thread-2-processing-n:127.0.0.1:55950_solr) [n:127.0.0.1:55950_solr    ] o.a.s.c.c.ZkStateReader Updated live nodes from ZooKeeper... (3) -> (4)
   [junit4]   2> 2629204 INFO  (jetty-launcher-2383-thread-2) [n:127.0.0.1:55951_solr    ] o.a.s.m.r.SolrJmxReporter JMX monitoring for 'solr_55951.solr.node' (registry 'solr.node') enabled at server: com.sun.jmx.mbeanserver.JmxMBeanServer@6559939e
   [junit4]   2> 2629205 INFO  (jetty-launcher-2383-thread-3) [n:127.0.0.1:55948_solr    ] o.a.s.m.r.SolrJmxReporter JMX monitoring for 'solr_55948.solr.node' (registry 'solr.node') enabled at server: com.sun.jmx.mbeanserver.JmxMBeanServer@6559939e
   [junit4]   2> 2629205 INFO  (jetty-launcher-2383-thread-1) [n:127.0.0.1:55949_solr    ] o.a.s.m.r.SolrJmxReporter JMX monitoring for 'solr_55949.solr.node' (registry 'solr.node') enabled at server: com.sun.jmx.mbeanserver.JmxMBeanServer@6559939e
   [junit4]   2> 2629214 INFO  (jetty-launcher-2383-thread-3) [n:127.0.0.1:55948_solr    ] o.a.s.m.r.SolrJmxReporter JMX monitoring for 'solr_55948.solr.jvm' (registry 'solr.jvm') enabled at server: com.sun.jmx.mbeanserver.JmxMBeanServer@6559939e
   [junit4]   2> 2629218 INFO  (jetty-launcher-2383-thread-3) [n:127.0.0.1:55948_solr    ] o.a.s.m.r.SolrJmxReporter JMX monitoring for 'solr_55948.solr.jetty' (registry 'solr.jetty') enabled at server: com.sun.jmx.mbeanserver.JmxMBeanServer@6559939e
   [junit4]   2> 2629220 INFO  (jetty-launcher-2383-thread-2) [n:127.0.0.1:55951_solr    ] o.a.s.m.r.SolrJmxReporter JMX monitoring for 'solr_55951.solr.jvm' (registry 'solr.jvm') enabled at server: com.sun.jmx.mbeanserver.JmxMBeanServer@6559939e
   [junit4]   2> 2629220 INFO  (jetty-launcher-2383-thread-4) [n:127.0.0.1:55950_solr    ] o.a.s.m.r.SolrJmxReporter JMX monitoring for 'solr_55950.solr.node' (registry 'solr.node') enabled at server: com.sun.jmx.mbeanserver.JmxMBeanServer@6559939e
   [junit4]   2> 2629221 INFO  (jetty-launcher-2383-thread-2) [n:127.0.0.1:55951_solr    ] o.a.s.m.r.SolrJmxReporter JMX monitoring for 'solr_55951.solr.jetty' (registry 'solr.jetty') enabled at server: com.sun.jmx.mbeanserver.JmxMBeanServer@6559939e
   [junit4]   2> 2629222 INFO  (jetty-launcher-2383-thread-3) [n:127.0.0.1:55948_solr    ] o.a.s.c.CorePropertiesLocator Found 0 core definitions underneath /Users/jenkins/workspace/Lucene-Solr-master-MacOSX/solr/build/solr-core/test/J1/temp/solr.cloud.CustomCollectionTest_C0E1DDC6CA6224D9-001/tempDir-001/node3/.
   [junit4]   2> 2629222 INFO  (jetty-launcher-2383-thread-2) [n:127.0.0.1:55951_solr    ] o.a.s.c.CorePropertiesLocator Found 0 core definitions underneath /Users/jenkins/workspace/Lucene-Solr-master-MacOSX/solr/build/solr-core/test/J1/temp/solr.cloud.CustomCollectionTest_C0E1DDC6CA6224D9-001/tempDir-001/node2/.
   [junit4]   2> 2629225 INFO  (jetty-launcher-2383-thread-1) [n:127.0.0.1:55949_solr    ] o.a.s.m.r.SolrJmxReporter JMX monitoring for 'solr_55949.solr.jvm' (registry 'solr.jvm') enabled at server: com.sun.jmx.mbeanserver.JmxMBeanServer@6559939e
   [junit4]   2> 2629226 INFO  (jetty-launcher-2383-thread-1) [n:127.0.0.1:55949_solr    ] o.a.s.m.r.SolrJmxReporter JMX monitoring for 'solr_55949.solr.jetty' (registry 'solr.jetty') enabled at server: com.sun.jmx.mbeanserver.JmxMBeanServer@6559939e
   [junit4]   2> 2629226 INFO  (jetty-launcher-2383-thread-4) [n:127.0.0.1:55950_solr    ] o.a.s.m.r.SolrJmxReporter JMX monitoring for 'solr_55950.solr.jvm' (registry 'solr.jvm') enabled at server: com.sun.jmx.mbeanserver.JmxMBeanServer@6559939e
   [junit4]   2> 2629226 INFO  (jetty-launcher-2383-thread-4) [n:127.0.0.1:55950_solr    ] o.a.s.m.r.SolrJmxReporter JMX monitoring for 'solr_55950.solr.jetty' (registry 'solr.jetty') enabled at server: com.sun.jmx.mbeanserver.JmxMBeanServer@6559939e
   [junit4]   2> 2629228 INFO  (jetty-launcher-2383-thread-1) [n:127.0.0.1:55949_solr    ] o.a.s.c.CorePropertiesLocator Found 0 core definitions underneath /Users/jenkins/workspace/Lucene-Solr-master-MacOSX/solr/build/solr-core/test/J1/temp/solr.cloud.CustomCollectionTest_C0E1DDC6CA6224D9-001/tempDir-001/node1/.
   [junit4]   2> 2629229 INFO  (jetty-launcher-2383-thread-4) [n:127.0.0.1:55950_solr    ] o.a.s.c.CorePropertiesLocator Found 0 core definitions underneath /Users/jenkins/workspace/Lucene-Solr-master-MacOSX/solr/build/solr-core/test/J1/temp/solr.cloud.CustomCollectionTest_C0E1DDC6CA6224D9-001/tempDir-001/node4/.
   [junit4]   2> 2629418 INFO  (SUITE-CustomCollectionTest-seed#[C0E1DDC6CA6224D9]-worker) [    ] o.a.s.c.c.ZkStateReader Updated live nodes from ZooKeeper... (0) -> (4)
   [junit4]   2> 2629422 INFO  (SUITE-CustomCollectionTest-seed#[C0E1DDC6CA6224D9]-worker) [    ] o.a.s.c.s.i.ZkClientClusterStateProvider Cluster at 127.0.0.1:55946/solr ready
   [junit4]   2> 2629522 INFO  (TEST-CustomCollectionTest.testCustomCollectionsAPI-seed#[C0E1DDC6CA6224D9]) [    ] o.a.s.SolrTestCaseJ4 ###Starting testCustomCollectionsAPI
   [junit4]   2> 2629525 INFO  (TEST-CustomCollectionTest.testCustomCollectionsAPI-seed#[C0E1DDC6CA6224D9]) [    ] o.a.s.c.c.ZkStateReader Updated live nodes from ZooKeeper... (0) -> (4)
   [junit4]   2> 2629532 INFO  (qtp803897428-14189) [n:127.0.0.1:55949_solr    ] o.a.s.h.a.CollectionsHandler Invoked Collection Action :create with params shards=a,b,c&replicationFactor=3&collection.configName=conf&maxShardsPerNode=4&name=implicitcoll&router.name=implicit&action=CREATE&wt=javabin&version=2 and sendToOCPQueue=true
   [junit4]   2> 2629535 INFO  (OverseerThreadFactory-6943-thread-1-processing-n:127.0.0.1:55948_solr) [n:127.0.0.1:55948_solr    ] o.a.s.c.CreateCollectionCmd Create collection implicitcoll
   [junit4]   2> 2629657 INFO  (qtp803897428-14190) [n:127.0.0.1:55949_solr    ] o.a.s.h.a.CoreAdminOperation core create command qt=/admin/cores&collection.configName=conf&newCollection=true&name=implicitcoll_b_replica2&action=CREATE&numShards=3&collection=implicitcoll&shard=b&wt=javabin&version=2
   [junit4]   2> 2629661 INFO  (qtp174535955-14185) [n:127.0.0.1:55951_solr    ] o.a.s.h.a.CoreAdminOperation core create command qt=/admin/cores&collection.configName=conf&newCollection=true&name=implicitcoll_c_replica1&action=CREATE&numShards=3&collection=implicitcoll&shard=c&wt=javabin&version=2
   [junit4]   2> 2629662 INFO  (qtp174535955-14185) [n:127.0.0.1:55951_solr    ] o.a.s.c.TransientSolrCoreCacheDefault Allocating transient cache for 2147483647 transient cores
   [junit4]   2> 2629662 INFO  (qtp803897428-14190) [n:127.0.0.1:55949_solr    ] o.a.s.c.TransientSolrCoreCacheDefault Allocating transient cache for 2147483647 transient cores
   [junit4]   2> 2629663 INFO  (qtp2045127857-14182) [n:127.0.0.1:55948_solr    ] o.a.s.h.a.CoreAdminOperation core create command qt=/admin/cores&collection.configName=conf&newCollection=true&name=implicitcoll_b_replica3&action=CREATE&numShards=3&collection=implicitcoll&shard=b&wt=javabin&version=2
   [junit4]   2> 2629664 INFO  (qtp803897428-14191) [n:127.0.0.1:55949_solr    ] o.a.s.h.a.CoreAdminOperation core create command qt=/admin/cores&collection.configName=conf&newCollection=true&name=implicitcoll_c_replica3&action=CREATE&numShards=3&collection=implicitcoll&shard=c&wt=javabin&version=2
   [junit4]   2> 2629664 INFO  (qtp2045127857-14182) [n:127.0.0.1:55948_solr    ] o.a.s.c.TransientSolrCoreCacheDefault Allocating transient cache for 2147483647 transient cores
   [junit4]   2> 2629665 INFO  (qtp803897428-14192) [n:127.0.0.1:55949_solr    ] o.a.s.h.a.CoreAdminOperation core create command qt=/admin/cores&collection.configName=conf&newCollection=true&name=implicitcoll_a_replica1&action=CREATE&numShards=3&collection=implicitcoll&shard=a&wt=javabin&version=2
   [junit4]   2> 2629668 INFO  (qtp174535955-14186) [n:127.0.0.1:55951_solr    ] o.a.s.h.a.CoreAdminOperation core create command qt=/admin/cores&collection.configName=conf&newCollection=true&name=implicitcoll_a_replica3&action=CREATE&numShards=3&collection=implicitcoll&shard=a&wt=javabin&version=2
   [junit4]   2> 2629673 INFO  (qtp554229827-14206) [n:127.0.0.1:55950_solr    ] o.a.s.h.a.CoreAdminOperation core create command qt=/admin/cores&collection.configName=conf&newCollection=true&name=implicitcoll_b_replica1&action=CREATE&numShards=3&collection=implicitcoll&shard=b&wt=javabin&version=2
   [junit4]   2> 2629674 INFO  (qtp2045127857-14197) [n:127.0.0.1:55948_solr    ] o.a.s.h.a.CoreAdminOperation core create command qt=/admin/cores&collection.configName=conf&newCollection=true&name=implicitcoll_a_replica2&action=CREATE&numShards=3&collection=implicitcoll&shard=a&wt=javabin&version=2
   [junit4]   2> 2629674 INFO  (qtp554229827-14206) [n:127.0.0.1:55950_solr    ] o.a.s.c.TransientSolrCoreCacheDefault Allocating transient cache for 2147483647 transient cores
   [junit4]   2> 2629675 INFO  (qtp554229827-14208) [n:127.0.0.1:55950_solr    ] o.a.s.h.a.CoreAdminOperation core create command qt=/admin/cores&collection.configName=conf&newCollection=true&name=implicitcoll_c_replica2&action=CREATE&numShards=3&collection=implicitcoll&shard=c&wt=javabin&version=2
   [junit4]   2> 2629813 INFO  (zkCallback-2403-thread-2-processing-n:127.0.0.1:55951_solr) [n:127.0.0.1:55951_solr    ] o.a.s.c.c.ZkStateReader A cluster state change: [WatchedEvent state:SyncConnected type:NodeDataChanged path:/collections/implicitcoll/state.json] for collection [implicitcoll] has occurred - updating... (live nodes size: [4])
   [junit4]   2> 2629813 INFO  (zkCallback-2404-thread-2-processing-n:127.0.0.1:55948_solr) [n:127.0.0.1:55948_solr    ] o.a.s.c.c.ZkStateReader A cluster state change: [WatchedEvent state:SyncConnected type:NodeDataChanged path:/collections/implicitcoll/state.json] for collection [implicitcoll] has occurred - updating... (live nodes size: [4])
   [junit4]   2> 2629813 INFO  (zkCallback-2405-thread-1-processing-n:127.0.0.1:55949_solr) [n:127.0.0.1:55949_solr    ] o.a.s.c.c.ZkStateReader A cluster state change: [WatchedEvent state:SyncConnected type:NodeDataChanged path:/collections/implicitcoll/state.json] for collection [implicitcoll] has occurred - updating... (live nodes size: [4])
   [junit4]   2> 2629813 INFO  (zkCallback-2402-thread-2-processing-n:127.0.0.1:55950_solr) [n:127.0.0.1:55950_solr    ] o.a.s.c.c.ZkStateReader A cluster state change: [WatchedEvent state:SyncConnected type:NodeDataChanged path:/collections/implicitcoll/state.json] for collection [implicitcoll] has occurred - updating... (live nodes size: [4])
   [junit4]   2> 2630729 INFO  (qtp803897428-14192) [n:127.0.0.1:55949_solr c:implicitcoll s:a  x:implicitcoll_a_replica1] o.a.s.c.SolrConfig Using Lucene MatchVersion: 7.0.0
   [junit4]   2> 2630733 INFO  (qtp2045127857-14197) [n:127.0.0.1:55948_solr c:implicitcoll s:a  x:implicitcoll_a_replica2] o.a.s.c.SolrConfig Using Lucene MatchVersion: 7.0.0
   [junit4]   2> 2630733 INFO  (qtp803897428-14191) [n:127.0.0.1:55949_solr c:implicitcoll s:c  x:implicitcoll_c_replica3] o.a.s.c.SolrConfig Using Lucene MatchVersion: 7.0.0
   [junit4]   2> 2630735 INFO  (qtp554229827-14208) [n:127.0.0.1:55950_solr c:implicitcoll s:c  x:implicitcoll_c_replica2] o.a.s.c.SolrConfig Using Lucene MatchVersion: 7.0.0
   [junit4]   2> 2630760 INFO  (qtp174535955-14186) [n:127.0.0.1:55951_solr c:implicitcoll s:a  x:implicitcoll_a_replica3] o.a.s.c.SolrConfig Using Lucene MatchVersion: 7.0.0
   [junit4]   2> 2630762 INFO  (qtp174535955-14185) [n:127.0.0.1:55951_solr c:implicitcoll s:c  x:implicitcoll_c_replica1] o.a.s.c.SolrConfig Using Lucene MatchVersion: 7.0.0
   [junit4]   2> 2630768 INFO  (qtp2045127857-14182) [n:127.0.0.1:55948_solr c:implicitcoll s:b  x:implicitcoll_b_replica3] o.a.s.c.SolrConfig Using Lucene MatchVersion: 7.0.0
   [junit4]   2> 2630770 INFO  (qtp554229827-14208) [n:127.0.0.1:55950_solr c:implicitcoll s:c  x:implicitcoll_c_replica2] o.a.s.s.IndexSchema [implicitcoll_c_replica2] Schema name=cloud-dynamic
   [junit4]   2> 2630771 INFO  (qtp803897428-14191) [n:127.0.0.1:55949_solr c:implicitcoll s:c  x:implicitcoll_c_replica3] o.a.s.s.IndexSchema [implicitcoll_c_replica3] Schema name=cloud-dynamic
   [junit4]   2> 2630801 INFO  (qtp803897428-14190) [n:127.0.0.1:55949_solr c:implicitcoll s:b  x:implicitcoll_b_replica2] o.a.s.c.SolrConfig Using Lucene MatchVersion: 7.0.0
   [junit4]   2> 2630802 INFO  (qtp554229827-14206) [n:127.0.0.1:55950_solr c:implicitcoll s:b  x:implicitcoll_b_replica1] o.a.s.c.SolrConfig Using Lucene MatchVersion: 7.0.0
   [junit4]   2> 2630805 INFO  (qtp174535955-14185) [n:127.0.0.1:55951_solr c:implicitcoll s:c  x:implicitcoll_c_replica1] o.a.s.s.IndexSchema [implicitcoll_c_replica1] Schema name=cloud-dynamic
   [junit4]   2> 2630839 INFO  (qtp803897428-14192) [n:127.0.0.1:55949_solr c:implicitcoll s:a  x:implicitcoll_a_replica1] o.a.s.s.IndexSchema [implicitcoll_a_replica1] Schema name=cloud-dynamic
   [junit4]   2> 2630873 INFO  (qtp2045127857-14182) [n:127.0.0.1:55948_solr c:implicitcoll s:b  x:implicitcoll_b_replica3] o.a.s.s.IndexSchema [implicitcoll_b_replica3] Schema name=cloud-dynamic
   [junit4]   2> 2630880 INFO  (qtp803897428-14190) [n:127.0.0.1:55949_solr c:implicitcoll s:b  x:implicitcoll_b_replica2] o.a.s.s.IndexSchema [implicitcoll_b_replica2] Schema name=cloud-dynamic
   [junit4]   2> 2630917 INFO  (qtp2045127857-14197) [n:127.0.0.1:55948_solr c:implicitcoll s:a  x:implicitcoll_a_replica2] o.a.s.s.IndexSchema [implicitcoll_a_replica2] Schema name=cloud-dynamic
   [junit4]   2> 2630920 INFO  (qtp174535955-14185) [n:127.0.0.1:55951_solr c:implicitcoll s:c  x:implicitcoll_c_replica1] o.a.s.s.IndexSchema Loaded schema cloud-dynamic/1.6 with uniqueid field id
   [junit4]   2> 2630921 INFO  (qtp174535955-14185) [n:127.0.0.1:55951_solr c:implicitcoll s:c  x:implicitcoll_c_replica1] o.a.s.c.CoreContainer Creating SolrCore 'implicitcoll_c_replica1' using configuration from collection implicitcoll, trusted=true
   [junit4]   2> 2630922 INFO  (qtp174535955-14185) [n:127.0.0.1:55951_solr c:implicitcoll s:c  x:implicitcoll_c_replica1] o.a.s.m.r.SolrJmxReporter JMX monitoring for 'solr_55951.solr.core.implicitcoll.c.replica1' (registry 'solr.core.implicitcoll.c.replica1') enabled at server: com.sun.jmx.mbeanserver.JmxMBeanServer@6559939e
   [junit4]   2> 2630922 INFO  (qtp174535955-14185) [n:127.0.0.1:55951_solr c:implicitcoll s:c  x:implicitcoll_c_replica1] o.a.s.c.SolrCore solr.RecoveryStrategy.Builder
   [junit4]   2> 2630922 INFO  (qtp174535955-14185) [n:127.0.0.1:55951_solr c:implicitcoll s:c  x:implicitcoll_c_replica1] o.a.s.c.SolrCore [[implicitcoll_c_replica1] ] Opening new SolrCore at [/Users/jenkins/workspace/Lucene-Solr-master-MacOSX/solr/build/solr-core/test/J1/temp/solr.cloud.CustomCollectionTest_C0E1DDC6CA6224D9-001/tempDir-001/node2/implicitcoll_c_replica1], dataDir=[/Users/jenkins/workspace/Lucene-Solr-master-MacOSX/solr/build/solr-core/test/J1/temp/solr.cloud.CustomCollectionTest_C0E1DDC6CA6224D9-001/tempDir-001/node2/./implicitcoll_c_replica1/data/]
   [junit4]   2> 2630923 INFO  (qtp554229827-14206) [n:127.0.0.1:55950_solr c:implicitcoll s:b  x:implicitcoll_b_replica1] o.a.s.s.IndexSchema [implicitcoll_b_replica1] Schema name=cloud-dynamic
   [junit4]   2> 2630954 INFO  (qtp2045127857-14182) [n:127.0.0.1:55948_solr c:implicitcoll s:b  x:implicitcoll_b_replica3] o.a.s.s.IndexSchema Loaded schema cloud-dynamic/1.6 with uniqueid field id
   [junit4]   2> 2630954 INFO  (qtp2045127857-14182) [n:127.0.0.1:55948_solr c:implicitcoll s:b  x:implicitcoll_b_replica3] o.a.s.c.CoreContainer Creating SolrCore 'implicitcoll_b_replica3' using configuration from collection implicitcoll, trusted=true
   [junit4]   2> 2630956 INFO  (qtp2045127857-14182) [n:127.0.0.1:55948_solr c:implicitcoll s:b  x:implicitcoll_b_replica3] o.a.s.m.r.SolrJmxReporter JMX monitoring for 'solr_55948.solr.core.implicitcoll.b.replica3' (registry 'solr.core.implicitcoll.b.replica3') enabled at server: com.sun.jmx.mbeanserver.JmxMBeanServer@6559939e
   [junit4]   2> 2630956 INFO  (qtp2045127857-14182) [n:127.0.0.1:55948_solr c:implicitcoll s:b  x:implicitcoll_b_replica3] o.a.s.c.SolrCore solr.RecoveryStrategy.Builder
   [junit4]   2> 2630956 INFO  (qtp2045127857-14182) [n:127.0.0.1:55948_solr c:implicitcoll s:b  x:implicitcoll_b_replica3] o.a.s.c.SolrCore [[implicitcoll_b_replica3] ] Opening new SolrCore at [/Users/jenkins/workspace/Lucene-Solr-master-MacOSX/solr/build/solr-core/test/J1/temp/solr.cloud.CustomCollectionTest_C0E1DDC6CA6224D9-001/tempDir-001/node3/implicitcoll_b_replica3], dataDir=[/Users/jenkins/workspace/Lucene-Solr-master-MacOSX/solr/build/solr-core/test/J1/temp/solr.cloud.CustomCollectionTest_C0E1DDC6CA6224D9-001/tempDir-001/node3/./implicitcoll_b_replica3/data/]
   [junit4]   2> 2630964 INFO  (qtp174535955-14186) [n:127.0.0.1:55951_solr c:implicitcoll s:a  x:implicitcoll_a_replica3] o.a.s.s.IndexSchema [implicitcoll_a_replica3] Schema name=cloud-dynamic
   [junit4]   2> 2630975 INFO  (qtp554229827-14206) [n:127.0.0.1:55950_solr c:implicitcoll s:b  x:implicitcoll_b_replica1] o.a.s.s.IndexSchema Loaded schema cloud-dynamic/1.6 with uniqueid field id
   [junit4]   2> 2630975 INFO  (qtp554229827-14206) [n:127.0.0.1:55950_solr c:implicitcoll s:b  x:implicitcoll_b_replica1] o.a.s.c.CoreContainer Creating SolrCore 'implicitcoll_b_replica1' using configuration from collection implicitcoll, trusted=true
   [junit4]   2> 2630989 INFO  (qtp554229827-14206) [n:127.0.0.1:55950_solr c:implicitcoll s:b  x:implicitcoll_b_replica1] o.a.s.m.r.SolrJmxReporter JMX monitoring for 'solr_55950.solr.core.implicitcoll.b.replica1' (registry 'solr.core.implicitcoll.b.replica1') enabled at server: com.sun.jmx.mbeanserver.JmxMBeanServer@6559939e
   [junit4]   2> 2630989 INFO  (qtp554229827-14206) [n:127.0.0.1:55950_solr c:implicitcoll s:b  x:implicitcoll_b_replica1] o.a.s.c.SolrCore solr.RecoveryStrategy.Builder
   [junit4]   2> 2630989 INFO  (qtp554229827-14206) [n:127.0.0.1:55950_solr c:implicitcoll s:b  x:implicitcoll_b_replica1] o.a.s.c.SolrCore [[implicitcoll_b_replica1] ] Opening new SolrCore at [/Users/jenkins/workspace/Lucene-Solr-master-MacOSX/solr/build/solr-core/test/J1/temp/solr.cloud.CustomCollectionTest_C0E1DDC6CA6224D9-001/tempDir-001/node4/implicitcoll_b_replica1], dataDir=[/Users/jenkins/workspace/Lucene-Solr-master-MacOSX/solr/build/solr-core/test/J1/temp/solr.cloud.CustomCollectionTest_C0E1DDC6CA6224D9-001/tempDir-001/node4/./implicitcoll_b_replica1/data/]
   [junit4]   2> 2631002 INFO  (qtp174535955-14186) [n:127.0.0.1:55951_solr c:implicitcoll s:a  x:implicitcoll_a_replica3] o.a.s.s.IndexSchema Loaded schema cloud-dynamic/1.6 with uniqueid field id
   [junit4]   2> 2631002 INFO  (qtp174535955-14186) [n:127.0.0.1:55951_solr c:implicitcoll s:a  x:implicitcoll_a_replica3] o.a.s.c.CoreContainer Creating SolrCore 'implicitcoll_a_replica3' using configuration from collection implicitcoll, trusted=true
   [junit4]   2> 2631002 INFO  (qtp174535955-14186) [n:127.0.0.1:55951_solr c:implicitcoll s:a  x:implicitcoll_a_replica3] o.a.s.m.r.SolrJmxReporter JMX monitoring for 'solr_55951.solr.core.implicitcoll.a.replica3' (registry 'solr.core.implicitcoll.a.replica3') enabled at server: com.sun.jmx.mbeanserver.JmxMBeanServer@6559939e
   [junit4]   2> 2631002 INFO  (qtp174535955-14186) [n:127.0.0.1:55951_solr c:implicitcoll s:a  x:implicitcoll_a_replica3] o.a.s.c.SolrCore solr.RecoveryStrategy.Builder
   [junit4]   2> 2631002 INFO  (qtp174535955-14186) [n:127.0.0.1:55951_solr c:implicitcoll s:a  x:implicitcoll_a_replica3] o.a.s.c.SolrCore [[implicitcoll_a_replica3] ] Opening new SolrCore at [/Users/jenkins/workspace/Lucene-Solr-master-MacOSX/solr/build/solr-core/test/J1/temp/solr.cloud.CustomCollectionTest_C0E1DDC6CA6224D9-001/tempDir-001/node2/implicitcoll_a_replica3], dataDir=[/Users/jenkins/workspace/Lucene-Solr-master-MacOSX/solr/build/solr-core/test/J1/temp/solr.cloud.CustomCollectionTest_C0E1DDC6CA6224D9-001/tempDir-001/node2/./implicitcoll_a_replica3/data/]
   [junit4]   2> 2631047 INFO  (qtp2045127857-14197) [n:127.0.0.1:55948_solr c:implicitcoll s:a  x:implicitcoll_a_replica2] o.a.s.s.IndexSchema Loaded schema cloud-dynamic/1.6 with uniqueid field id
   [junit4]   2> 2631047 INFO  (qtp2045127857-14197) [n:127.0.0.1:55948_solr c:implicitcoll s:a  x:implicitcoll_a_replica2] o.a.s.c.CoreContainer Creating SolrCore 'implicitcoll_a_replica2' using configuration from collection implicitcoll, trusted=true
   [junit4]   2> 2631047 INFO  (qtp2045127857-14197) [n:127.0.0.1:55948_solr c:implicitcoll s:a  x:implicitcoll_a_replica2] o.a.s.m.r.SolrJmxReporter JMX monitoring for 'solr_55948.solr.core.implicitcoll.a.replica2' (registry 'solr.core.implicitcoll.a.replica2') enabled at server: com.sun.jmx.mbeanserver.JmxMBeanServer@6559939e
   [junit4]   2> 2631048 INFO  (qtp2045127857-14197) [n:127.0.0.1:55948_solr c:implicitcoll s:a  x:implicitcoll_a_replica2] o.a.s.c.SolrCore solr.RecoveryStrategy.Builder
   [junit4]   2> 2631048 INFO  (qtp2045127857-14197) [n:127.0.0.1:55948_solr c:implicitcoll s:a  x:implicitcoll_a_replica2] o.a.s.c.SolrCore [[implicitcoll_a_replica2] ] Opening new SolrCore at [/Users/jenkins/workspace/Lucene-Solr-master-MacOSX/solr/build/solr-core/test/J1/temp/solr.cloud.CustomCollectionTest_C0E1DDC6CA6224D9-001/tempDir-001/node3/implicitcoll_a_replica2], dataDir=[/Users/jenkins/workspace/Lucene-Solr-master-MacOSX/solr/build/solr-core/test/J1/temp/solr.cloud.CustomCollectionTest_C0E1DDC6CA6224D9-001/tempDir-001/node3/./implicitcoll_a_replica2/data/]
   [junit4]   2> 2631068 INFO  (qtp803897428-14190) [n:127.0.0.1:55949_solr c:implicitcoll s:b  x:implicitcoll_b_replica2] o.a.s.s.IndexSchema Loaded schema cloud-dynamic/1.6 with uniqueid field id
   [junit4]   2> 2631068 INFO  (qtp803897428-14190) [n:127.0.0.1:55949_solr c:implicitcoll s:b  x:implicitcoll_b_replica2] o.a.s.c.CoreContainer Creating SolrCore 'implicitcoll_b_replica2' using configuration from collection implicitcoll, trusted=true
   [junit4]   2> 2631076 INFO  (qtp803897428-14190) [n:127.0.0.1:55949_solr c:implicitcoll s:b  x:implicitcoll_b_replica2] o.a.s.m.r.SolrJmxReporter JMX monitoring for 'solr_55949.solr.core.implicitcoll.b.replica2' (registry 'solr.core.implicitcoll.b.replica2') enabled at server: com.sun.jmx.mbeanserver.JmxMBeanServer@6559939e
   [junit4]   2> 2631076 INFO  (qtp803897428-14190) [n:127.0.0.1:55949_solr c:implicitcoll s:b  x:implicitcoll_b_replica2] o.a.s.c.SolrCore solr.RecoveryStrategy.Builder
   [junit4]   2> 2631076 INFO  (qtp803897428-14190) [n:127.0.0.1:55949_solr c:implicitcoll s:b  x:implicitcoll_b_replica2] o.a.s.c.SolrCore [[implicitcoll_b_replica2] ] Opening new SolrCore at [/Users/jenkins/workspace/Lucene-Solr-master-MacOSX/solr/build/solr-core/test/J1/temp/solr.cloud.CustomCollectionTest_C0E1DDC6CA6224D9-001/tempDir-001/node1/implicitcoll_b_replica2], dataDir=[/Users/jenkins/workspace/Lucene-Solr-master-MacOSX/solr/build/solr-core/test/J1/temp/solr.cloud.CustomCollectionTest_C0E1DDC6CA6224D9-001/tempDir-001/node1/./implicitcoll_b_replica2/data/]
   [junit4]   2> 2631080 INFO  (qtp803897428-14192) [n:127.0.0.1:55949_solr c:implicitcoll s:a  x:implicitcoll_a_replica1] o.a.s.s.IndexSchema Loaded schema cloud-dynamic/1.6 with uniqueid field id
   [junit4]   2> 2631080 INFO  (qtp803897428-14192) [n:127.0.0.1:55949_solr c:implicitcoll s:a  x:implicitcoll_a_replica1] o.a.s.c.CoreContainer Creating SolrCore 'implicitcoll_a_replica1' using configuration from collection implicitcoll, trusted=true
   [junit4]   2> 2631080 INFO  (qtp803897428-14192) [n:127.0.0.1:55949_solr c:implicitcoll s:a  x:implicitcoll_a_replica1] o.a.s.m.r.SolrJmxReporter JMX monitoring for 'solr_55949.solr.core.implicitcoll.a.replica1' (registry 'solr.core.implicitcoll.a.replica1') enabled at server: com.sun.jmx.mbeanserver.JmxMBeanServer@6559939e
   [junit4]   2> 2631080 INFO  (qtp803897428-14192) [n:127.0.0.1:55949_solr c:implicitcoll s:a  x:implicitcoll_a_replica1] o.a.s.c.SolrCore solr.RecoveryStrategy.Builder
   [junit4]   2> 2631080 INFO  (qtp803897428-14192) [n:127.0.0.1:55949_solr c:implicitcoll s:a  x:implicitcoll_a_replica1] o.a.s.c.SolrCore [[implicitcoll_a_replica1] ] Opening new SolrCore at [/Users/jenkins/workspace/Lucene-Solr-master-MacOSX/solr/build/solr-core/test/J1/temp/solr.cloud.CustomCollectionTest_C0E1DDC6CA6224D9-001/tempDir-001/node1/implicitcoll_a_replica1], dataDir=[/Users/jenkins/workspace/Lucene-Solr-master-MacOSX/solr/build/solr-core/test/J1/temp/solr.cloud.CustomCollectionTest_C0E1DDC6CA6224D9-001/tempDir-001/node1/./implicitcoll_a_replica1/data/]
   [junit4]   2> 2631114 INFO  (qtp554229827-14208) [n:127.0.0.1:55950_solr c:implicitcoll s:c  x:implicitcoll_c_replica2] o.a.s.s.IndexSchema Loaded schema cloud-dynamic/1.6 with uniqueid field id
   [junit4]   2> 2631114 INFO  (qtp554229827-14208) [n:127.0.0.1:55950_solr c:implicitcoll s:c  x:implicitcoll_c_replica2] o.a.s.c.CoreContainer Creating SolrCore 'implicitcoll_c_replica2' using configuration from collection implicitcoll, trusted=true
   [junit4]   2> 2631114 INFO  (qtp554229827-14208) [n:127.0.0.1:55950_solr c:implicitcoll s:c  x:implicitcoll_c_replica2] o.a.s.m.r.SolrJmxReporter JMX monitoring for 'solr_55950.solr.core.implicitcoll.c.replica2' (registry 'solr.core.implicitcoll.c.replica2') enabled at server: com.sun.jmx.mbeanserver.JmxMBeanServer@6559939e
   [junit4]   2> 2631114 INFO  (qtp554229827-14208) [n:127.0.0.1:55950_solr c:implicitcoll s:c  x:implicitcoll_c_replica2] o.a.s.c.SolrCore solr.RecoveryStrategy.Builder
   [junit4]   2> 2631115 INFO  (qtp554229827-14208) [n:127.0.0.1:55950_solr c:implicitcoll s:c  x:implicitcoll_c_replica2] o.a.s.c.SolrCore [[implicitcoll_c_replica2] ] Opening new SolrCore at [/Users/jenkins/workspace/Lucene-Solr-master-MacOSX/solr/build/solr-core/test/J1/temp/solr.cloud.CustomCollectionTest_C0E1DDC6CA6224D9-001/tempDir-001/node4/implicitcoll_c_replica2], dataDir=[/Users/jenkins/workspace/Lucene-Solr-master-MacOSX/solr/build/solr-core/test/J1/temp/solr.cloud.CustomCollectionTest_C0E1DDC6CA6224D9-001/tempDir-001/node4/./implicitcoll_c_replica2/data/]
   [junit4]   2> 2631117 INFO  (qtp803897428-14191) [n:127.0.0.1:55949_solr c:implicitcoll s:c  x:implicitcoll_c_replica3] o.a.s.s.IndexSchema Loaded schema cloud-dynamic/1.6 with uniqueid field id
   [junit4]   2> 2631117 INFO  (qtp803897428-14191) [n:127.0.0.1:55949_solr c:implicitcoll s:c  x:implicitcoll_c_replica3] o.a.s.c.CoreContainer Creating SolrCore 'implicitcoll_c_replica3' using configuration from collection implicitcoll, trusted=true
   [junit4]   2> 2631118 INFO  (qtp803897428-14191) [n:127.0.0.1:55949_solr c:implicitcoll s:c  x:implicitcoll_c_replica3] o.a.s.m.r.SolrJmxReporter JMX monitoring for 'solr_55949.solr.core.implicitcoll.c.replica3' (registry 'solr.core.implicitcoll.c.replica3') enabled at server: com.sun.jmx.mbeanserver.JmxMBeanServer@6559939e
   [junit4]   2> 2631118 INFO  (qtp803897428-14191) [n:127.0.0.1:55949_solr c:implicitcoll s:c  x:implicitcoll_c_replica3] o.a.s.c.SolrCore solr.RecoveryStrategy.Builder
   [junit4]   2> 2631118 INFO  (qtp803897428-14191) [n:127.0.0.1:55949_solr c:implicitcoll s:c  x:implicitcoll_c_replica3] o.a.s.c.SolrCore [[implicitcoll_c_replica3] ] Opening new SolrCore at [/Users/jenkins/workspace/Lucene-Solr-master-MacOSX/solr/build/solr-core/test/J1/temp/solr.cloud.CustomCollectionTest_C0E1DDC6CA6224D9-001/tempDir-001/node1/implicitcoll_c_replica3], dataDir=[/Users/jenkins/workspace/Lucene-Solr-master-MacOSX/solr/build/solr-core/test/J1/temp/solr.cloud.CustomCollectionTest_C0E1DDC6CA6224D9-001/tempDir-001/node1/./implicitcoll_c_replica3/data/]
   [junit4]   2> 2631248 INFO  (qtp174535955-14185) [n:127.0.0.1:55951_solr c:implicitcoll s:c  x:implicitcoll_c_replica1] o.a.s.u.UpdateHandler Using UpdateLog implementation: org.apache.solr.update.UpdateLog
   [junit4]   2> 2631248 INFO  (qtp174535955-14185) [n:127.0.0.1:55951_solr c:implicitcoll s:c  x:implicitcoll_c_replica1] o.a.s.u.UpdateLog Initializing UpdateLog: dataDir=null defaultSyncLevel=FLUSH numRecordsToKeep=100 maxNumLogsToKeep=10 numVersionBuckets=65536
   [junit4]   2> 2631252 INFO  (qtp174535955-14185) [n:127.0.0.1:55951_solr c:implicitcoll s:c  x:implicitcoll_c_replica1] o.a.s.u.CommitTracker Hard AutoCommit: disabled
   [junit4]   2> 2631252 INFO  (qtp174535955-14185) [n:127.0.0.1:55951_solr c:implicitcoll s:c  x:implicitcoll_c_replica1] o.a.s.u.CommitTracker Soft AutoCommit: disabled
   [junit4]   2> 2631269 INFO  (qtp2045127857-14182) [n:127.0.0.1:55948_solr c:implicitcoll s:b  x:implicitcoll_b_replica3] o.a.s.u.UpdateHandler Using UpdateLog implementation: org.apache.solr.update.UpdateLog
   [junit4]   2> 2631269 INFO  (qtp2045127857-14182) [n:127.0.0.1:55948_solr c:implicitcoll s:b  x:implicitcoll_b_replica3] o.a.s.u.UpdateLog Initializing UpdateLog: dataDir=null defaultSyncLevel=FLUSH numRecordsToKeep=100 maxNumLogsToKeep=10 numVersionBuckets=65536
   [junit4]   2> 2631277 INFO  (qtp174535955-14185) [n:127.0.0.1:55951_solr c:implicitcoll s:c  x:implicitcoll_c_replica1] o.a.s.s.SolrIndexSearcher Opening [Searcher@353ddf27[implicitcoll_c_replica1] main]
   [junit4]   2> 2631289 INFO  (qtp554229827-14206) [n:127.0.0.1:55950_solr c:implicitcoll s:b  x:implicitcoll_b_replica1] o.a.s.u.UpdateHandler Using UpdateLog implementation: org.apache.solr.update.UpdateLog
   [junit4]   2> 2631289 INFO  (qtp554229827-14206) [n:127.0.0.1:55950_solr c:implicitcoll s:b  x:implicitcoll_b_replica1] o.a.s.u.UpdateLog Initializing UpdateLog: dataDir=null defaultSyncLevel=FLUSH numRecordsToKeep=100 maxNumLogsToKeep=10 numVersionBuckets=65536
   [junit4]   2> 2631289 INFO  (qtp2045127857-14182) [n:127.0.0.1:55948_solr c:implicitcoll s:b  x:implicitcoll_b_replica3] o.a.s.u.CommitTracker Hard AutoCommit: disabled
   [junit4]   2> 2631289 INFO  (qtp2045127857-14182) [n:127.0.0.1:55948_solr c:implicitcoll s:b  x:implicitcoll_b_replica3] o.a.s.u.CommitTracker Soft AutoCommit: disabled
   [junit4]   2> 2631290 INFO  (qtp174535955-14185) [n:127.0.0.1:55951_solr c:implicitcoll s:c  x:implicitcoll_c_replica1] o.a.s.r.ManagedResourceStorage Configured ZooKeeperStorageIO with znodeBase: /configs/conf
   [junit4]   2> 2631292 INFO  (qtp174535955-14185) [n:127.0.0.1:55951_solr c:implicitcoll s:c  x:implicitcoll_c_replica1] o.a.s.r.ManagedResourceStorage Loaded null at path _rest_managed.json using ZooKeeperStorageIO:path=/configs/conf
   [junit4]   2> 2631292 INFO  (qtp554229827-14206) [n:127.0.0.1:55950_solr c:implicitcoll s:b  x:implicitcoll_b_replica1] o.a.s.u.CommitTracker Hard AutoCommit: disabled
   [junit4]   2> 2631292 INFO  (qtp554229827-14206) [n:127.0.0.1:55950_solr c:implicitcoll s:b  x:implicitcoll_b_replica1] o.a.s.u.CommitTracker Soft AutoCommit: disabled
   [junit4]   2> 2631293 INFO  (qtp174535955-14185) [n:127.0.0.1:55951_solr c:implicitcoll s:c  x:implicitcoll_c_replica1] o.a.s.h.ReplicationHandler Commits will be reserved for  10000
   [junit4]   2> 2631293 INFO  (qtp174535955-14185) [n:127.0.0.1:55951_solr c:implicitcoll s:c  x:implicitcoll_c_replica1] o.a.s.u.UpdateLog Could not find max version in index or recent updates, using new clock 1567193162654416896
   [junit4]   2> 2631294 INFO  (searcherExecutor-6952-thread-1-processing-n:127.0.0.1:55951_solr x:implicitcoll_c_replica1 s:c c:implicitcoll) [n:127.0.0.1:55951_solr c:implicitcoll s:c  x:implicitcoll_c_replica1] o.a.s.c.SolrCore [implicitcoll_c_replica1] Registered new searcher Searcher@353ddf27[implicitcoll_c_replica1] main{ExitableDirectoryReader(UninvertingDirectoryReader())}
   [junit4]   2> 2631296 INFO  (qtp2045127857-14182) [n:127.0.0.1:55948_solr c:implicitcoll s:b  x:implicitcoll_b_replica3] o.a.s.s.SolrIndexSearcher Opening [Searcher@79381b57[implicitcoll_b_replica3] main]
   [junit4]   2> 2631316 INFO  (qtp2045127857-14182) [n:127.0.0.1:55948_solr c:implicitcoll s:b  x:implicitcoll_b_replica3] o.a.s.r.ManagedResourceStorage Configured ZooKeeperStorageIO with znodeBase: /configs/conf
   [junit4]   2> 2631317 INFO  (qtp2045127857-14182) [n:127.0.0.1:55948_solr c:implicitcoll s:b  x:implicitcoll_b_replica3] o.a.s.r.ManagedResourceStorage Loaded null at path _rest_managed.json using ZooKeeperStorageIO:path=/configs/conf
   [junit4]   2> 2631319 INFO  (qtp2045127857-14182) [n:127.0.0.1:55948_solr c:implicitcoll s:b  x:implicitcoll_b_replica3] o.a.s.h.ReplicationHandler Commits will be reserved for  10000
   [junit4]   2> 2631319 INFO  (qtp2045127857-14182) [n:127.0.0.1:55948_solr c:implicitcoll s:b  x:implicitcoll_b_replica3] o.a.s.u.UpdateLog Could not find max version in index or recent updates, using new clock 1567193162681679872
   [junit4]   2> 2631321 INFO  (qtp554229827-14206) [n:127.0.0.1:55950_solr c:implicitcoll s:b  x:implicitcoll_b_replica1] o.a.s.s.SolrIndexSearcher Opening [Searcher@9e42e85[implicitcoll_b_replica1] main]
   [junit4]   2> 2631329 INFO  (qtp554229827-14206) [n:127.0.0.1:55950_solr c:implicitcoll s:b  x:implicitcoll_b_replica1] o.a.s.r.ManagedResourceStorage Configured ZooKeeperStorageIO with znodeBase: /configs/conf
   [junit4]   2> 2631330 INFO  (qtp554229827-14206) [n:127.0.0.1:55950_solr c:implicitcoll s:b  x:implicitcoll_b_replica1] o.a.s.r.ManagedResourceStorage Loaded null at path _rest_managed.json using ZooKeeperStorageIO:path=/configs/conf
   [junit4]   2> 2631333 INFO  (qtp554229827-14206) [n:127.0.0.1:55950_solr c:implicitcoll s:b  x:implicitcoll_b_replica1] o.a.s.h.ReplicationHandler Commits will be reserved for  10000
   [junit4]   2> 2631335 INFO  (qtp174535955-14185) [n:127.0.0.1:55951_solr c:implicitcoll s:c  x:implicitcoll_c_replica1] o.a.s.c.ShardLeaderElectionContext Waiting until we see more replicas up for shard c: total=3 found=1 timeoutin=9999ms
   [junit4]   2> 2631341 INFO  (searcherExecutor-6953-thread-1-processing-n:127.0.0.1:55948_solr x:implicitcoll_b_replica3 s:b c:implicitcoll) [n:127.0.0.1:55948_solr c:implicitcoll s:b  x:implicitcoll_b_replica3] o.a.s.c.SolrCore [implicitcoll_b_replica3] Registered new searcher Searcher@79381b57[implicitcoll_b_replica3] main{ExitableDirectoryReader(UninvertingDirectoryReader())}
   [junit4]   2> 2631342 INFO  (searcherExecutor-6954-thread-1-processing-n:127.0.0.1:55950_solr x:implicitcoll_b_replica1 s:b c:implicitcoll) [n:127.0.0.1:55950_solr c:implicitcoll s:b  x:implicitcoll_b_replica1] o.a.s.c.SolrCore [implicitcoll_b_replica1] Registered new searcher Searcher@9e42e85[implicitcoll_b_replica1] main{ExitableDirectoryReader(UninvertingDirectoryReader())}
   [junit4]   2> 2631342 INFO  (qtp554229827-14206) [n:127.0.0.1:55950_solr c:implicitcoll s:b  x:implicitcoll_b_replica1] o.a.s.u.UpdateLog Could not find max version in index or recent updates, using new clock 1567193162705797120
   [junit4]   2> 2631350 INFO  (qtp2045127857-14182) [n:127.0.0.1:55948_solr c:implicitcoll s:b  x:implicitcoll_b_replica3] o.a.s.c.ShardLeaderElectionContext Waiting until we see more replicas up for shard b: total=3 found=1 timeoutin=9998ms
   [junit4]   2> 2631428 INFO  (qtp803897428-14192) [n:127.0.0.1:55949_solr c:implicitcoll s:a  x:implicitcoll_a_replica1] o.a.s.u.UpdateHandler Using UpdateLog implementation: org.apache.solr.update.UpdateLog
   [junit4]   2> 2631428 INFO  (qtp803897428-14192) [n:127.0.0.1:55949_solr c:implicitcoll s:a  x:implicitcoll_a_replica1] o.a.s.u.UpdateLog Initializing UpdateLog: dataDir=null defaultSyncLevel=FLUSH numRecordsToKeep=100 maxNumLogsToKeep=10 numVersionBuckets=65536
   [junit4]   2> 2631431 INFO  (qtp2045127857-14197) [n:127.0.0.1:55948_solr c:implicitcoll s:a  x:implicitcoll_a_replica2] o.a.s.u.UpdateHandler Using UpdateLog implementation: org.apache.solr.update.UpdateLog
   [junit4]   2> 2631431 INFO  (qtp2045127857-14197) [n:127.0.0.1:55948_solr c:implicitcoll s:a  x:implicitcoll_a_replica2] o.a.s.u.UpdateLog Initializing UpdateLog: dataDir=null defaultSyncLevel=FLUSH numRecordsToKeep=100 maxNumLogsToKeep=10 numVersionBuckets=65536
   [junit4]   2> 2631432 INFO  (qtp803897428-14192) [n:127.0.0.1:55949_solr c:implicitcoll s:a  x:implicitcoll_a_replica1] o.a.s.u.CommitTracker Hard AutoCommit: disabled
   [junit4]   2> 2631432 INFO  (qtp803897428-14192) [n:127.0.0.1:55949_solr c:implicitcoll s:a  x:implicitcoll_a_replica1] o.a.s.u.CommitTracker Soft AutoCommit: disabled
   [junit4]   2> 2631436 INFO  (qtp2045127857-14197) [n:127.0.0.1:55948_solr c:implicitcoll s:a  x:implicitcoll_a_replica2] o.a.s.u.CommitTracker Hard AutoCommit: disabled
   [junit4]   2> 2631436 INFO  (qtp2045127857-14197) [n:127.0.0.1:55948_solr c:implicitcoll s:a  x:implicitcoll_a_replica2] o.a.s.u.CommitTracker Soft AutoCommit: disabled
   [junit4]   2> 2631441 INFO  (qtp174535955-14186) [n:127.0.0.1:55951_solr c:implicitcoll s:a  x:implicitcoll_a_replica3] o.a.s.u.UpdateHandler Using UpdateLog implementation: org.apache.solr.update.UpdateLog
   [junit4]   2> 2631442 INFO  (qtp174535955-14186) [n:127.0.0.1:55951_solr c:implicitcoll s:a  x:implicitcoll_a_replica3] o.a.s.u.UpdateLog Initializing UpdateLog: dataDir=null defaultSyncLevel=FLUSH numRecordsToKeep=100 maxNumLogsToKeep=10 numVersionBuckets=65536
   [junit4]   2> 2631445 INFO  (qtp174535955-14186) [n:127.0.0.1:55951_solr c:implicitcoll s:a  x:implicitcoll_a_replica3] o.a.s.u.CommitTracker Hard AutoCommit: disabled
   [junit4]   2> 2631445 INFO  (qtp174535955-14186) [n:127.0.0.1:55951_solr c:implicitcoll s:a  x:implicitcoll_a_replica3] o.a.s.u.CommitTracker Soft AutoCommit: disabled
   [junit4]   2> 2631449 INFO  (qtp803897428-14192) [n:127.0.0.1:55949_solr c:implicitcoll s:a  x:implicitcoll_a_replica1] o.a.s.s.SolrIndexSearcher Opening [Searcher@4731c405[implicitcoll_a_replica1] main]
   [junit4]   2> 2631452 INFO  (qtp803897428-14192) [n:127.0.0.1:55949_solr c:implicitcoll s:a  x:implicitcoll_a_replica1] o.a.s.r.ManagedResourceStorage Configured ZooKeeperStorageIO with znodeBase: /configs/conf
   [junit4]   2> 2631453 INFO  (qtp803897428-14191) [n:127.0.0.1:55949_solr c:implicitcoll s:c  x:implicitcoll_c_replica3] o.a.s.u.UpdateHandler Using UpdateLog implementation: org.apache.solr.update.UpdateLog
   [junit4]   2> 2631453 INFO  (qtp803897428-14191) [n:127.0.0.1:55949_solr c:implicitcoll s:c  x:implicitcoll_c_replica3] o.a.s.u.UpdateLog Initializing UpdateLog: dataDir=null defaultSyncLevel=FLUSH numRecordsToKeep=100 maxNumLogsToKeep=10 numVersionBuckets=65536
   [junit4]   2> 2631453 INFO  (qtp803897428-14192) [n:127.0.0.1:55949_solr c:implicitcoll s:a  x:implicitcoll_a_replica1] o.a.s.r.ManagedResourceStorage Loaded null at path _rest_managed.json using ZooKeeperStorageIO:path=/configs/conf
   [junit4]   2> 2631454 INFO  (qtp803897428-14192) [n:127.0.0.1:55949_solr c:implicitcoll s:a  x:implicitcoll_a_replica1] o.a.s.h.ReplicationHandler Commits will be reserved for  10000
   [junit4]   2> 2631454 INFO  (qtp803897428-14192) [n:127.0.0.1:55949_solr c:implicitcoll s:a  x:implicitcoll_a_replica1] o.a.s.u.UpdateLog Could not find max version in index or recent updates, using new clock 1567193162823237632
   [junit4]   2> 2631456 INFO  (searcherExecutor-6958-thread-1-processing-n:127.0.0.1:55949_solr x:implicitcoll_a_replica1 s:a c:implicitcoll) [n:127.0.0.1:55949_solr c:implicitcoll s:a  x:implicitcoll_a_replica1] o.a.s.c.SolrCore [implicitcoll_a_replica1] Registered new searcher Searcher@4731c405[implicitcoll_a_replica1] main{ExitableDirectoryReader(UninvertingDirectoryReader())}
   [junit4]   2> 2631457 INFO  (zkCallback-2404-thread-2-processing-n:127.0.0.1:55948_solr) [n:127.0.0.1:55948_solr    ] o.a.s.c.c.ZkStateReader A cluster state change: [WatchedEvent state:SyncConnected type:NodeDataChanged path:/collections/implicitcoll/state.json] for collection [implicitcoll] has occurred - updating... (live nodes size: [4])
   [junit4]   2> 2631457 INFO  (zkCallback-2405-thread-1-processing-n:127.0.0.1:55949_solr) [n:127.0.0.1:55949_solr    ] o.a.s.c.c.ZkStateReader A cluster state change: [WatchedEvent state:SyncConnected type:NodeDataChanged path:/collections/implicitcoll/state.json] for collection [implicitcoll] has occurred - updating... (live nodes size: [4])
   [junit4]   2> 2631457 INFO  (zkCallback-2402-thread-2-processing-n:127.0.0.1:55950_solr) [n:127.0.0.1:55950_solr    ] o.a.s.c.c.ZkStateReader A cluster state change: [WatchedEvent state:SyncConnected type:NodeDataChanged path:/collections/implicitcoll/state.json] for collection [implicitcoll] has occurred - updating... (live nodes size: [4])
   [junit4]   2> 2631457 INFO  (zkCallback-2403-thread-2-processing-n:127.0.0.1:55951_solr) [n:127.0.0.1:55951_solr    ] o.a.s.c.c.ZkStateReader A cluster state change: [WatchedEvent state:SyncConnected type:NodeDataChanged path:/collections/implicitcoll/state.json] for collection [implicitcoll] has occurred - updating... (live nodes size: [4])
   [junit4]   2> 2631460 INFO  (qtp803897428-14191) [n:127.0.0.1:55949_solr c:implicitcoll s:c  x:implicitcoll_c_replica3] o.a.s.u.CommitTracker Hard AutoCommit: disabled
   [junit4]   2> 2631460 INFO  (qtp803897428-14191) [n:127.0.0.1:55949_solr c:implicitcoll s:c  x:implicitcoll_c_replica3] o.a.s.u.CommitTracker Soft AutoCommit: disabled
   [junit4]   2> 2631463 INFO  (qtp2045127857-14197) [n:127.0.0.1:55948_solr c:implicitcoll s:a  x:implicitcoll_a_replica2] o.a.s.s.SolrIndexSearcher Opening [Searcher@4e87a94e[implicitcoll_a_replica2] main]
   [junit4]   2> 2631467 INFO  (qtp2045127857-14197) [n:127.0.0.1:55948_solr c:implicitcoll s:a  x:implicitcoll_a_replica2] o.a.s.r.ManagedResourceStorage Configured ZooKeeperStorageIO with znodeBase: /configs/conf
   [junit4]   2> 2631469 INFO  (qtp2045127857-14197) [n:127.0.0.1:55948_solr c:implicitcoll s:a  x:implicitcoll_a_replica2] o.a.s.r.ManagedResourceStorage Loaded null at path _rest_managed.json using ZooKeeperStorageIO:path=/configs/conf
   [junit4]   2> 2631472 INFO  (qtp803897428-14192) [n:127.0.0.1:55949_solr c:implicitcoll s:a  x:implicitcoll_a_replica1] o.a.s.c.ShardLeaderElectionContext Waiting until we see more replicas up for shard a: total=3 found=1 timeoutin=9998ms
   [junit4]   2> 2631472 INFO  (qtp2045127857-14197) [n:127.0.0.1:55948_solr c:implicitcoll s:a  x:implicitcoll_a_replica2] o.a.s.h.ReplicationHandler Commits will be reserved for  10000
   [junit4]   2> 2631472 INFO  (qtp554229827-14208) [n:127.0.0.1:55950_solr c:implicitcoll s:c  x:implicitcoll_c_replica2] o.a.s.u.UpdateHandler Using UpdateLog implementation: org.apache.solr.update.UpdateLog
   [junit4]   2> 2631472 INFO  (qtp554229827-14208) [n:127.0.0.1:55950_solr c:implicitcoll s:c  x:implicitcoll_c_replica2] o.a.s.u.UpdateLog Initializing UpdateLog: dataDir=null defaultSyncLevel=FLUSH numRecordsToKeep=100 maxNumLogsToKeep=10 numVersionBuckets=65536
   [junit4]   2> 2631474 INFO  (searcherExecutor-6956-thread-1-processing-n:127.0.0.1:55948_solr x:implicitcoll_a_replica2 s:a c:implicitcoll) [n:127.0.0.1:55948_solr c:implicitcoll s:a  x:implicitcoll_a_replica2] o.a.s.c.SolrCore [implicitcoll_a_replica2] Registered new searcher Searcher@4e87a94e[implicitcoll_a_replica2] main{ExitableDirectoryReader(UninvertingDirectoryReader())}
   [junit4]   2> 2631474 INFO  (qtp174535955-14186) [n:127.0.0.1:55951_solr c:implicitcoll s:a  x:implicitcoll_a_replica3] o.a.s.s.SolrIndexSearcher Opening [Searcher@32432bdc[implicitcoll_a_replica3] main]
   [junit4]   2> 2631475 INFO  (qtp2045127857-14197) [n:127.0.0.1:55948_solr c:implicitcoll s:a  x:implicitcoll_a_replica2] o.a.s.u.UpdateLog Could not find max version in index or recent updates, using new clock 1567193162845257728
   [junit4]   2> 2631477 INFO  (qtp554229827-14208) [n:127.0.0.1:55950_solr c:implicitcoll s:c  x:implicitcoll_c_replica2] o.a.s.u.CommitTracker Hard AutoCommit: disabled
   [junit4]   2> 2631477 INFO  (qtp554229827-14208) [n:127.0.0.1:55950_solr c:implicitcoll s:c  x:implicitcoll_c_replica2] o.a.s.u.CommitTracker Soft AutoCommit: disabled
   [junit4]   2> 2631478 INFO  (qtp174535955-14186) [n:127.0.0.1:55951_solr c:implicitcoll s:a  x:implicitcoll_a_replica3] o.a.s.r.ManagedResourceStorage Configured ZooKeeperStorageIO with znodeBase: /configs/conf
   [junit4]   2> 2631479 INFO  (qtp174535955-14186) [n:127.0.0.1:55951_solr c:implicitcoll s:a  x:implicitcoll_a_replica3] o.a.s.r.ManagedResourceStorage Loaded null at path _rest_managed.json using ZooKeeperStorageIO:path=/configs/conf
   [junit4]   2> 2631481 INFO  (qtp174535955-14186) [n:127.0.0.1:55951_solr c:implicitcoll s:a  x:implicitcoll_a_replica3] o.a.s.h.ReplicationHandler Commits will be reserved for  10000
   [junit4]   2> 2631481 INFO  (qtp174535955-14186) [n:127.0.0.1:55951_solr c:implicitcoll s:a  x:implicitcoll_a_replica3] o.a.s.u.UpdateLog Could not find max version in index or recent updates, using new clock 1567193162851549184
   [junit4]   2> 2631484 INFO  (qtp803897428-14191) [n:127.0.0.1:55949_solr c:implicitcoll s:c  x:implicitcoll_c_replica3] o.a.s.s.SolrIndexSearcher Opening [Searcher@4dcb0dee[implicitcoll_c_replica3] main]
   [junit4]   2> 2631484 INFO  (searcherExecutor-6955-thread-1-processing-n:127.0.0.1:55951_solr x:implicitcoll_a_replica3 s:a c:implicitcoll) [n:127.0.0.1:55951_solr c:implicitcoll s:a  x:implicitcoll_a_replica3] o.a.s.c.SolrCore [implicitcoll_a_replica3] Registered new searcher Searcher@32432bdc[implicitcoll_a_replica3] main{ExitableDirectoryReader(UninvertingDirectoryReader())}
   [junit4]   2> 2631486 INFO  (qtp803897428-14191) [n:127.0.0.1:55949_solr c:implicitcoll s:c  x:implicitcoll_c_replica3] o.a.s.r.ManagedResourceStorage Configured ZooKeeperStorageIO with znodeBase: /configs/conf
   [junit4]   2> 2631487 INFO  (qtp803897428-14191) [n:127.0.0.1:55949_solr c:implicitcoll s:c  x:implicitcoll_c_replica3] o.a.s.r.ManagedResourceStorage Loaded null at path _rest_managed.json using ZooKeeperStorageIO:path=/configs/conf
   [junit4]   2> 2631488 INFO  (qtp803897428-14191) [n:127.0.0.1:55949_solr c:implicitcoll s:c  x:implicitcoll_c_replica3] o.a.s.h.ReplicationHandler Commits will be reserved for  10000
   [junit4]   2> 2631488 INFO  (qtp803897428-14191) [n:127.0.0.1:55949_solr c:implicitcoll s:c  x:implicitcoll_c_replica3] o.a.s.u.UpdateLog Could not find max version in index or recent updates, using new clock 1567193162858889216
   [junit4]   2> 2631489 INFO  (searcherExecutor-6960-thread-1-processing-n:127.0.0.1:55949_solr x:implicitcoll_c_replica3 s:c c:implicitcoll) [n:127.0.0.1:55949_solr c:implicitcoll s:c  x:implicitcoll_c_replica3] o.a.s.c.SolrCore [implicitcoll_c_replica3] Registered new searcher Searcher@4dcb0dee[implicitcoll_c_replica3] main{ExitableDirectoryReader(UninvertingDirectoryReader())}
   [junit4]   2> 2631489 INFO  (qtp554229827-14208) [n:127.0.0.1:55950_solr c:implicitcoll s:c  x:implicitcoll_c_replica2] o.a.s.s.SolrIndexSearcher Opening [Searcher@1760dfc5[implicitcoll_c_replica2] main]
   [junit4]   2> 2631492 INFO  (qtp554229827-14208) [n:127.0.0.1:55950_solr c:implicitcoll s:c  x:implicitcoll_c_replica2] o.a.s.r.ManagedResourceStorage Configured ZooKeeperStorageIO with znodeBase: /configs/conf
   [junit4]   2> 2631494 INFO  (qtp554229827-14208) [n:127.0.0.1:55950_solr c:implicitcoll s:c  x:implicitcoll_c_replica2] o.a.s.r.ManagedResourceStorage Loaded null at path _rest_managed.json using ZooKeeperStorageIO:path=/configs/conf
   [junit4]   2> 2631497 INFO  (qtp554229827-14208) [n:127.0.0.1:55950_solr c:implicitcoll s:c  x:implicitcoll_c_replica2] o.a.s.h.ReplicationHandler Commits will be reserved for  10000
   [junit4]   2> 2631497 INFO  (qtp554229827-14208) [n:127.0.0.1:55950_solr c:implicitcoll s:c  x:implicitcoll_c_replica2] o.a.s.u.UpdateLog Could not find max version in index or recent updates, using new clock 1567193162868326400
   [junit4]   2> 2631500 INFO  (searcherExecutor-6959-thread-1-processing-n:127.0.0.1:55950_solr x:implicitcoll_c_replica2 s:c c:implicitcoll) [n:127.0.0.1:55950_solr c:implicitcoll s:c  x:implicitcoll_c_replica2] o.a.s.c.SolrCore [implicitcoll_c_replica2] Registered new searcher Searcher@1760dfc5[implicitcoll_c_replica2] main{ExitableDirectoryReader(UninvertingDirectoryReader())}
   [junit4]   2> 2631518 INFO  (qtp803897428-14190) [n:127.0.0.1:55949_solr c:implicitcoll s:b  x:implicitcoll_b_replica2] o.a.s.u.UpdateHandler Using UpdateLog implementation: org.apache.solr.update.UpdateLog
   [junit4]   2> 2631518 INFO  (qtp803897428-14190) [n:127.0.0.1:55949_solr c:implicitcoll s:b  x:implicitcoll_b_replica2] o.a.s.u.UpdateLog Initializing UpdateLog: dataDir=null defaultSyncLevel=FLUSH numRecordsToKeep=100 maxNumLogsToKeep=10 numVersionBuckets=65536
   [junit4]   2> 2631522 INFO  (qtp803897428-14190) [n:127.0.0.1:55949_solr c:implicitcoll s:b  x:implicitcoll_b_replica2] o.a.s.u.CommitTracker Hard AutoCommit: disabled
   [junit4]   2> 2631523 INFO  (qtp803897428-14190) [n:127.0.0.1:55949_solr c:implicitcoll s:b  x:implicitcoll_b_replica2] o.a.s.u.CommitTracker Soft AutoCommit: disabled
   [junit4]   2> 2631524 INFO  (qtp803897428-14190) [n:127.0.0.1:55949_solr c:implicitcoll s:b  x:implicitcoll_b_replica2] o.a.s.s.SolrIndexSearcher Opening [Searcher@328f1f6d[implicitcoll_b_replica2] main]
   [junit4]   2> 2631527 INFO  (qtp803897428-14190) [n:127.0.0.1:55949_solr c:implicitcoll s:b  x:implicitcoll_b_replica2] o.a.s.r.ManagedResourceStorage Configured ZooKeeperStorageIO with znodeBase: /configs/conf
   [junit4]   2> 2631528 INFO  (qtp803897428-14190) [n:127.0.0.1:55949_solr c:implicitcoll s:b  x:implicitcoll_b_replica2] o.a.s.r.ManagedResourceStorage Loaded null at path _rest_managed.json using ZooKeeperStorageIO:path=/configs/conf
   [junit4]   2> 2631529 INFO  (qtp803897428-14190) [n:127.0.0.1:55949_solr c:implicitcoll s:b  x:implicitcoll_b_replica2] o.a.s.h.ReplicationHandler Commits will be reserved for  10000
   [junit4]   2> 2631529 INFO  (qtp803897428-14190) [n:127.0.0.1:55949_solr c:implicitcoll s:b  x:implicitcoll_b_replica2] o.a.s.u.UpdateLog Could not find max version in index or recent updates, using new clock 1567193162901880832
   [junit4]   2> 2631531 INFO  (searcherExecutor-6957-thread-1-processing-n:127.0.0.1:55949_solr x:implicitcoll_b_replica2 s:b c:implicitcoll) [n:127.0.0.1:55949_solr c:implicitcoll s:b  x:implicitcoll_b_replica2] o.a.s.c.SolrCore [implicitcoll_b_replica2] Registered new searcher Searcher@328f1f6d[implicitcoll_b_replica2] main{ExitableDirectoryReader(UninvertingDirectoryReader())}
   [junit4]   2> 2631587 INFO  (zkCallback-2405-thread-1-processing-n:127.0.0.1:55949_solr) [n:127.0.0.1:55949_solr    ] o.a.s.c.c.ZkStateReader A cluster state change: [WatchedEvent state:SyncConnected type:NodeDataChanged path:/collections/implicitcoll/state.json] for collection [implicitcoll] has occurred - updating... (live nodes size: [4])
   [junit4]   2> 2631587 INFO  (zkCallback-2403-thread-2-processing-n:127.0.0.1:55951_solr) [n:127.0.0.1:55951_solr    ] o.a.s.c.c.ZkStateReader A cluster state change: [WatchedEvent state:SyncConnected type:NodeDataChanged path:/collections/implicitcoll/state.json] for collection [implicitcoll] has occurred - updating... (live nodes size: [4])
   [junit4]   2> 2631587 INFO  (zkCallback-2404-thread-2-processing-n:127.0.0.1:55948_solr) [n:127.0.0.1:55948_solr    ] o.a.s.c.c.ZkStateReader A cluster state change: [WatchedEvent state:SyncConnected type:NodeDataChanged path:/collections/implicitcoll/state.json] for collection [implicitcoll] has occurred - updating... (live nodes size: [4])
   [junit4]   2> 2631587 INFO  (zkCallback-2402-thread-2-processing-n:127.0.0.1:55950_solr) [n:127.0.0.1:55950_solr    ] o.a.s.c.c.ZkStateReader A cluster state change: [WatchedEvent state:SyncConnected type:NodeDataChanged path:/collections/implicitcoll/state.json] for collection [implicitcoll] has occurred - updating... (live nodes size: [4])
   [junit4]   2> 2631838 INFO  (qtp174535955-14185) [n:127.0.0.1:55951_solr c:implicitcoll s:c  x:implicitcoll_c_replica1] o.a.s.c.ShardLeaderElectionContext Enough replicas found to continue.
   [junit4]   2> 2631838 INFO  (qtp174535955-14185) [n:127.0.0.1:55951_solr c:implicitcoll s:c  x:implicitcoll_c_replica1] o.a.s.c.ShardLeaderElectionContext I may be the new leader - try and sync
   [junit4]   2> 2631838 INFO  (qtp174535955-14185) [n:127.0.0.1:55951_solr c:implicitcoll s:c  x:implicitcoll_c_replica1] o.a.s.c.SyncStrategy Sync replicas to http://127.0.0.1:55951/solr/implicitcoll_c_replica1/
   [junit4]   2> 2631839 INFO  (qtp174535955-14185) [n:127.0.0.1:55951_solr c:implicitcoll s:c  x:implicitcoll_c_replica1] o.a.s.u.PeerSync PeerSync: core=implicitcoll_c_replica1 url=http://127.0.0.1:55951/solr START replicas=[http://127.0.0.1:55949/solr/implicitcoll_c_replica3/, http://127.0.0.1:55950/solr/implicitcoll_c_replica2/] nUpdates=100
   [junit4]   2> 2631840 INFO  (qtp174535955-14185) [n:127.0.0.1:55951_solr c:implicitcoll s:c  x:implicitcoll_c_replica1] o.a.s.u.PeerSync PeerSync: core=implicitcoll_c_replica1 url=http://127.0.0.1:55951/solr DONE.  We have no versions.  sync failed.
   [junit4]   2> 2631844 INFO  (qtp803897428-14194) [n:127.0.0.1:55949_solr c:implicitcoll s:c r:core_node4 x:implicitcoll_c_replica3] o.a.s.c.S.Request [implicitcoll_c_replica3]  webapp=/solr path=/get params={distrib=false&qt=/get&fingerprint=false&getVersions=100&wt=javabin&version=2} status=0 QTime=1
   [junit4]   2> 2631844 INFO  (qtp554229827-14213) [n:127.0.0.1:55950_solr c:implicitcoll s:c r:core_node9 x:implicitcoll_c_replica2] o.a.s.c.S.Request [implicitcoll_c_replica2]  webapp=/solr path=/get params={distrib=false&qt=/get&fingerprint=false&getVersions=100&wt=javabin&version=2} status=0 QTime=1
   [junit4]   2> 2631844 INFO  (qtp174535955-14185) [n:127.0.0.1:55951_solr c:implicitcoll s:c  x:implicitcoll_c_replica1] o.a.s.c.SyncStrategy Leader's attempt to sync with shard failed, moving to the next candidate
   [junit4]   2> 2631844 INFO  (qtp174535955-14185) [n:127.0.0.1:55951_solr c:implicitcoll s:c  x:implicitcoll_c_replica1] o.a.s.c.ShardLeaderElectionContext We failed sync, but we have no versions - we can't sync in that case - we were active before, so become leader anyway
   [junit4]   2> 2631845 INFO  (qtp174535955-14185) [n:127.0.0.1:55951_solr c:implicitcoll s:c  x:implicitcoll_c_replica1] o.a.s.c.ShardLeaderElectionContext Found all replicas participating in election, clear LIR
   [junit4]   2> 2631852 INFO  (qtp2045127857-14182) [n:127.0.0.1:55948_solr c:implicitcoll s:b  x:implicitcoll_b_replica3] o.a.s.c.ShardLeaderElectionContext Enough replicas found to continue.
   [junit4]   2> 2631852 INFO  (qtp2045127857-14182) [n:127.0.0.1:55948_solr c:implicitcoll s:b  x:implicitcoll_b_replica3] o.a.s.c.ShardLeaderElectionContext I may be the new leader - try and sync
   [junit4]   2> 2631852 INFO  (qtp2045127857-14182) [n:127.0.0.1:55948_solr c:implicitcoll s:b  x:implicitcoll_b_replica3] o.a.s.c.SyncStrategy Sync replicas to http://127.0.0.1:55948/solr/implicitcoll_b_replica3/
   [junit4]   2> 2631852 INFO  (qtp174535955-14185) [n:127.0.0.1:55951_solr c:implicitcoll s:c  x:implicitcoll_c_replica1] o.a.s.c.ShardLeaderElectionContext I am the new leader: http://127.0.0.1:55951/solr/implicitcoll_c_replica1/ c
   [junit4]   2> 2631853 INFO  (qtp2045127857-14182) [n:127.0.0.1:55948_solr c:implicitcoll s:b  x:implicitcoll_b_replica3] o.a.s.u.PeerSync PeerSync: core=implicitcoll_b_replica3 url=http://127.0.0.1:55948/solr START replicas=[http://127.0.0.1:55949/solr/implicitcoll_b_replica2/, http://127.0.0.1:55950/solr/implicitcoll_b_replica1/] nUpdates=100
   [junit4]   2> 2631853 INFO  (qtp2045127857-14182) [n:127.0.0.1:55948_solr c:implicitcoll s:b  x:implicitcoll_b_replica3] o.a.s.u.PeerSync PeerSync: core=implicitcoll_b_replica3 url=http://127.0.0.1:55948/solr DONE.  We have no versions.  sync failed.
   [junit4]   2> 2631857 INFO  (qtp554229827-14195) [n:127.0.0.1:55950_solr c:implicitcoll s:b r:core_node8 x:implicitcoll_b_replica1] o.a.s.c.S.Request [implicitcoll_b_replica1]  webapp=/solr path=/get params={distrib=false&qt=/get&fingerprint=false&getVersions=100&wt=javabin&version=2} status=0 QTime=0
   [junit4]   2> 2631857 INFO  (qtp803897428-14193) [n:127.0.0.1:55949_solr c:implicitcoll s:b r:core_node1 x:implicitcoll_b_replica2] o.a.s.c.S.Request [implicitcoll_b_replica2]  webapp=/solr path=/get params={distrib=false&qt=/get&fingerprint=false&getVersions=100&wt=javabin&version=2} status=0 QTime=1
   [junit4]   2> 2631858 INFO  (qtp2045127857-14182) [n:127.0.0.1:55948_solr c:implicitcoll s:b  x:implicitcoll_b_replica3] o.a.s.c.SyncStrategy Leader's attempt to sync with shard failed, moving to the next candidate
   [junit4]   2> 2631858 INFO  (qtp2045127857-14182) [n:127.0.0.1:55948_solr c:implicitcoll s:b  x:implicitcoll_b_replica3] o.a.s.c.ShardLeaderElectionContext We failed sync, but we have no versions - we can't sync in that case - we were active before, so become leader anyway
   [junit4]   2> 2631858 INFO  (qtp2045127857-14182) [n:127.0.0.1:55948_solr c:implicitcoll s:b  x:implicitcoll_b_replica3] o.a.s.c.ShardLeaderElectionContext Found all replicas participating in election, clear LIR
   [junit4]   2> 2631869 INFO  (qtp2045127857-14182) [n:127.0.0.1:55948_solr c:implicitcoll s:b  x:implicitcoll_b_replica3] o.a.s.c.ShardLeaderElectionContext I am the new leader: http://127.0.0.1:55948/solr/implicitcoll_b_replica3/ b
   [junit4]   2> 2631976 INFO  (qtp803897428-14192) [n:127.0.0.1:55949_solr c:implicitcoll s:a  x:implicitcoll_a_replica1] o.a.s.c.ShardLeaderElectionContext Enough replicas found to continue.
   [junit4]   2> 2631976 INFO  (qtp803897428-14192) [n:127.0.0.1:55949_solr c:implicitcoll s:a  x:implicitcoll_a_replica1] o.a.s.c.ShardLeaderElectionContext I may be the new leader - try and sync
   [junit4]   2> 2631976 INFO  (qtp803897428-14192) [n:127.0.0.1:55949_solr c:implicitcoll s:a  x:implicitcoll_a_replica1] o.a.s.c.SyncStrategy Sync replicas to http://127.0.0.1:55949/solr/implicitcoll_a_replica1/
   [junit4]   2> 2631977 INFO  (qtp803897428-14192) [n:127.0.0.1:55949_solr c:implicitcoll s:a  x:implicitcoll_a_replica1] o.a.s.u.PeerSync PeerSync: core=implicitcoll_a_replica1 url=http://127.0.0.1:55949/solr START replicas=[http://127.0.0.1:55951/solr/implicitcoll_a_replica3/, http://127.0.0.1:55948/solr/implicitcoll_a_replica2/] nUpdates=100
   [junit4]   2> 2631977 INFO  (zkCallback-2404-thread-2-processing-n:127.0.0.1:55948_solr) [n:127.0.0.1:55948_solr    ] o.a.s.c.c.ZkStateReader A cluster state change: [WatchedEvent state:SyncConnected type:NodeDataChanged path:/collections/implicitcoll/state.json] for collection [implicitcoll] has occurred - updating... (live nodes size: [4])
   [junit4]   2> 2631978 INFO  (zkCallback-2405-thread-1-processing-n:127.0.0.1:55949_solr) [n:127.0.0.1:55949_solr    ] o.a.s.c.c.ZkStateReader A cluster state change: [WatchedEvent state:SyncConnected type:NodeDataChanged path:/collections/implicitcoll/state.json] for collection [implicitcoll] has occurred - updating... (live nodes size: [4])
   [junit4]   2> 2631978 INFO  (zkCallback-2402-thread-2-processing-n:127.0.0.1:55950_solr) [n:127.0.0.1:55950_solr    ] o.a.s.c.c.ZkStateReader A cluster state change: [WatchedEvent state:SyncConnected type:NodeDataChanged path:/collections/implicitcoll/state.json] for collection [implicitcoll] has occurred - updating... (live nodes size: [4])
   [junit4]   2> 2631977 INFO  (zkCallback-2403-thread-2-processing-n:127.0.0.1:55951_solr) [n:127.0.0.1:55951_solr    ] o.a.s.c.c.ZkStateReader A cluster state change: [WatchedEvent state:SyncConnected type:NodeDataChanged path:/collections/implicitcoll/state.json] for collection [implicitcoll] has occurred - updating... (live nodes size: [4])
   [junit4]   2> 2631979 INFO  (qtp803897428-14192) [n:127.0.0.1:55949_solr c:implicitcoll s:a  x:implicitcoll_a_replica1] o.a.s.u.PeerSync PeerSync: core=implicitcoll_a_replica1 url=http://127.0.0.1:55949/solr DONE.  We have no versions.  sync failed.
   [junit4]   2> 2631983 INFO  (qtp174535955-14188) [n:127.0.0.1:55951_solr c:implicitcoll s:a r:core_node6 x:implicitcoll_a_replica3] o.a.s.c.S.Request [implicitcoll_a_replica3]  webapp=/solr path=/get params={distrib=false&qt=/get&fingerprint=false&getVersions=100&wt=javabin&version=2} status=0 QTime=1
   [junit4]   2> 2631988 INFO  (qtp2045127857-14200) [n:127.0.0.1:55948_solr c:implicitcoll s:a r:core_node7 x:implicitcoll_a_replica2] o.a.s.c.S.Request [implicitcoll_a_replica2]  webapp=/solr path=/get params={distrib=false&qt=/get&fingerprint=false&getVersions=100&wt=javabin&version=2} status=0 QTime=2
   [junit4]   2> 2631988 INFO  (qtp803897428-14192) [n:127.0.0.1:55949_solr c:implicitcoll s:a  x:implicitcoll_a_replica1] o.a.s.c.SyncStrategy Leader's attempt to sync with shard failed, moving to the next candidate
   [junit4]   2> 2631988 INFO  (qtp803897428-14192) [n:127.0.0.1:55949_solr c:implicitcoll s:a  x:implicitcoll_a_replica1] o.a.s.c.ShardLeaderElectionContext We failed sync, but we have no versions - we can't sync in that case - we were active before, so become leader anyway
   [junit4]   2> 2631989 INFO  (qtp803897428-14192) [n:127.0.0.1:55949_solr c:implicitcoll s:a  x:implicitcoll_a_replica1] o.a.s.c.ShardLeaderElectionContext Found all replicas participating in election, clear LIR
   [junit4]   2> 2631997 INFO  (qtp803897428-14192) [n:127.0.0.1:55949_solr c:implicitcoll s:a  x:implicitcoll_a_replica1] o.a.s.c.ShardLeaderElectionContext I am the new leader: http://127.0.0.1:55949/solr/implicitcoll_a_replica1/ a
   [junit4]   2> 2632020 INFO  (qtp174535955-14185) [n:127.0.0.1:55951_solr c:implicitcoll s:c  x:implicitcoll_c_replica1] o.a.s.c.ZkController I am the leader, no recovery necessary
   [junit4]   2> 2632024 INFO  (qtp2045127857-14182) [n:127.0.0.1:55948_solr c:implicitcoll s:b  x:implicitcoll_b_replica3] o.a.s.c.ZkController I am the leader, no recovery necessary
   [junit4]   2> 2632025 INFO  (qtp174535955-14185) [n:127.0.0.1:55951_solr c:implicitcoll s:c  x:implicitcoll_c_replica1] o.a.s.s.HttpSolrCall [admin] webapp=null path=/admin/cores params={qt=/admin/cores&collection.configName=conf&newCollection=true&name=implicitcoll_c_replica1&action=CREATE&numShards=3&collection=implicitcoll&shard=c&wt=javabin&version=2} status=0 QTime=2364
   [junit4]   2> 2632029 INFO  (qtp2045127857-14182) [n:127.0.0.1:55948_solr c:implicitcoll s:b  x:implicitcoll_b_replica3] o.a.s.s.HttpSolrCall [admin] webapp=null path=/admin/cores params={qt=/admin/cores&collection.configName=conf&newCollection=true&name=implicitcoll_b_replica3&action=CREATE&numShards=3&collection=implicitcoll&shard=b&wt=javabin&version=2} status=0 QTime=2365
   [junit4]   2> 2632138 INFO  (zkCallback-2405-thread-1-processing-n:127.0.0.1:55949_solr) [n:127.0.0.1:55949_solr    ] o.a.s.c.c.ZkStateReader A cluster state change: [WatchedEvent state:SyncConnected type:NodeDataChanged path:/collections/implicitcoll/state.json] for collection [implicitcoll] has occurred - updating... (live nodes size: [4])
   [junit4]   2> 2632138 INFO  (zkCallback-2404-thread-2-processing-n:127.0.0.1:55948_solr) [n:127.0.0.1:55948_solr    ] o.a.s.c.c.ZkStateReader A cluster state change: [WatchedEvent state:SyncConnected type:NodeDataChanged path:/collections/implicitcoll/state.json] for collection [implicitcoll] has occurred - updating... (live nodes size: [4])
   [junit4]   2> 2632138 INFO  (zkCallback-2402-thread-2-processing-n:127.0.0.1:55950_solr) [n:127.0.0.1:55950_solr    ] o.a.s.c.c.ZkStateReader A cluster state change: [WatchedEvent state:SyncConnected type:NodeDataChanged path:/collections/implicitcoll/state.json] for collection [implicitcoll] has occurred - updating... (live nodes size: [4])
   [junit4]   2> 2632138 INFO  (zkCallback-2403-thread-2-processing-n:127.0.0.1:55951_solr) [n:127.0.0.1:55951_solr    ] o.a.s.c.c.ZkStateReader A cluster state change: [WatchedEvent state:SyncConnected type:NodeDataChanged path:/collections/implicitcoll/state.json] for collection [implicitcoll] has occurred - updating... (live nodes size: [4])
   [junit4]   2> 2632158 INFO  (qtp803897428-14192) [n:127.0.0.1:55949_solr c:implicitcoll s:a  x:implicitcoll_a_replica1] o.a.s.c.ZkController I am the leader, no recovery necessary
   [junit4]   2> 2632163 INFO  (qtp803897428-14192) [n:127.0.0.1:55949_solr c:implicitcoll s:a  x:implicitcoll_a_replica1] o.a.s.s.HttpSolrCall [admin] webapp=null path=/admin/cores params={qt=/admin/cores&collection.configName=conf&newCollection=true&name=implicitcoll_a_replica1&action=CREATE&numShards=3&collection=implicitcoll&shard=a&wt=javabin&version=2} status=0 QTime=2498
   [junit4]   2> 2632271 INFO  (zkCallback-2404-thread-2-processing-n:127.0.0.1:55948_solr) [n:127.0.0.1:55948_solr    ] o.a.s.c.c.ZkStateReader A cluster state change: [WatchedEvent state:SyncConnected type:NodeDataChanged path:/collections/implicitcoll/state.json] for collection [implicitcoll] has occurred - updating... (live nodes size: [4])
   [junit4]   2> 2632271 INFO  (zkCallback-2405-thread-1-processing-n:127.0.0.1:55949_solr) [n:127.0.0.1:55949_solr    ] o.a.s.c.c.ZkStateReader A cluster state change: [WatchedEvent state:SyncConnected type:NodeDataChanged path:/collections/implicitcoll/state.json] for collection [implicitcoll] has occurred - updating... (live nodes size: [4])
   [junit4]   2> 2632271 INFO  (zkCallback-2402-thread-2-processing-n:127.0.0.1:55950_solr) [n:127.0.0.1:55950_solr    ] o.a.s.c.c.ZkStateReader A cluster state change: [WatchedEvent state:SyncConnected type:NodeDataChanged path:/collections/implicitcoll/state.json] for collection [implicitcoll] has occurred - updating... (live nodes size: [4])
   [junit4]   2> 2632271 INFO  (zkCallback-2403-thread-2-processing-n:127.0.0.1:55951_solr) [n:127.0.0.1:55951_solr    ] o.a.s.c.c.ZkStateReader A cluster state change: [WatchedEvent state:SyncConnected type:NodeDataChanged path:/collections/implicitcoll/state.json] for collection [implicitcoll] has occurred - updating... (live nodes size: [4])
   [junit4]   2> 2632379 INFO  (qtp554229827-14206) [n:127.0.0.1:55950_solr c:implicitcoll s:b  x:implicitcoll_b_replica1] o.a.s.s.HttpSolrCall [admin] webapp=null path=/admin/cores params={qt=/admin/cores&collection.configName=conf&newCollection=true&name=implicitcoll_b_replica1&action=CREATE&numShards=3&collection=implicitcoll&shard=b&wt=javabin&version=2} status=0 QTime=2706
   [junit4]   2> 2632466 INFO  (zkCallback-2404-thread-2-processing-n:127.0.0.1:55948_solr) [n:127.0.0.1:55948_solr    ] o.a.s.c.c.ZkStateReader A cluster state change: [WatchedEvent state:SyncConnected type:NodeDataChanged path:/collections/implicitcoll/state.json] for collection [implicitcoll] has occurred - updating... (live nodes size: [4])
   [junit4]   2> 2632467 INFO  (zkCallback-2403-thread-2-processing-n:127.0.0.1:55951_solr) [n:127.0.0.1:55951_solr    ] o.a.s.c.c.ZkStateReader A cluster state change: [WatchedEvent state:SyncConnected type:NodeDataChanged path:/collections/implicitcoll/state.json] for collection [implicitcoll] has occurred - updating... (live nodes size: [4])
   [junit4]   2> 2632467 INFO  (zkCallback-2402-thread-2-processing-n:127.0.0.1:55950_solr) [n:127.0.0.1:55950_solr    ] o.a.s.c.c.ZkStateReader A cluster state change: [WatchedEvent state:SyncConnected type:NodeDataChanged path:/collections/implicitcoll/state.json] for collection [implicitcoll] has occurred - updating... (live nodes size: [4])
   [junit4]   2> 2632467 INFO  (zkCallback-2405-thread-1-processing-n:127.0.0.1:55949_solr) [n:127.0.0.1:55949_solr    ] o.a.s.c.c.ZkStateReader A cluster state change: [WatchedEvent state:SyncConnected type:NodeDataChanged path:/collections/implicitcoll/state.json] for collection [implicitcoll] has occurred - updating... (live nodes size: [4])
   [junit4]   2> 2632504 INFO  (qtp2045127857-14197) [n:127.0.0.1:55948_solr c:implicitcoll s:a  x:implicitcoll_a_replica2] o.a.s.s.HttpSolrCall [admin] webapp=null path=/admin/cores params={qt=/admin/cores&collection.configName=conf&newCollection=true&name=implicitcoll_a_replica2&action=CREATE&numShards=3&collection=implicitcoll&shard=a&wt=javabin&version=2} status=0 QTime=2830
   [junit4]   2> 2632505 INFO  (qtp174535955-14186) [n:127.0.0.1:55951_solr c:implicitcoll s:a  x:implicitcoll_a_replica3] o.a.s.s.HttpSolrCall [admin] webapp=null path=/admin/cores params={qt=/admin/cores&collection.configName=conf&newCollection=true&name=implicitcoll_a_replica3&action=CREATE&numShards=3&collection=implicitcoll&shard=a&wt=javabin&version=2} status=0 QTime=2837
   [junit4]   2> 2632508 INFO  (qtp803897428-14191) [n:127.0.0.1:55949_solr c:implicitcoll s:c  x:implicitcoll_c_replica3] o.a.s.s.HttpSolrCall [admin] webapp=null path=/admin/cores params={qt=/admin/cores&collection.configName=conf&newCollection=true&name=implicitcoll_c_replica3&action=CREATE&numShards=3&collection=implicitcoll&shard=c&wt=javabin&version=2} status=0 QTime=2844
   [junit4]   2> 2632510 INFO  (qtp554229827-14208) [n:127.0.0.1:55950_solr c:implicitcoll s:c  x:implicitcoll_c_replica2] o.a.s.s.HttpSolrCall [admin] webapp=null path=/admin/cores params={qt=/admin/cores&collection.configName=conf&newCollection=true&name=implicitcoll_c_replica2&action=CREATE&numShards=3&collection=implicitcoll&shard=c&wt=javabin&version=2} status=0 QTime=2835
   [junit4]   2> 2632549 INFO  (qtp803897428-14190) [n:127.0.0.1:55949_solr c:implicitcoll s:b  x:implicitcoll_b_replica2] o.a.s.s.HttpSolrCall [admin] webapp=null path=/admin/cores params={qt=/admin/cores&collection.configName=conf&newCollection=true&name=implicitcoll_b_replica2&action=CREATE&numShards=3&collection=implicitcoll&shard=b&wt=javabin&version=2} status=0 QTime=2892
   [junit4]   2> 2632553 INFO  (qtp803897428-14189) [n:127.0.0.1:55949_solr    ] o.a.s.h.a.CollectionsHandler Wait for new collection to be active for at most 30 seconds. Check all shard replicas
   [junit4]   2> 2632656 INFO  (zkCallback-2404-thread-2-processing-n:127.0.0.1:55948_solr) [n:127.0.0.1:55948_solr    ] o.a.s.c.c.ZkStateReader A cluster state change: [WatchedEvent state:SyncConnected type:NodeDataChanged path:/collections/implicitcoll/state.j

[...truncated too long message...]

per watch triggered, but Solr cannot talk to ZK: [KeeperErrorCode = Session expired for /live_nodes]
   [junit4]   2> 2682433 INFO  (jetty-closer-2384-thread-2) [    ] o.e.j.s.h.ContextHandler Stopped o.e.j.s.ServletContextHandler@4a9f4652{/solr,null,UNAVAILABLE}
   [junit4]   2> 2682433 INFO  (zkCallback-2403-thread-1-processing-n:127.0.0.1:55951_solr) [n:127.0.0.1:55951_solr    ] o.a.s.c.c.ZkStateReader Updated live nodes from ZooKeeper... (2) -> (1)
   [junit4]   2> 2682433 INFO  (zkCallback-2403-thread-2-processing-n:127.0.0.1:55951_solr) [n:127.0.0.1:55951_solr    ] o.a.s.c.OverseerElectionContext I am going to be the leader 127.0.0.1:55951_solr
   [junit4]   2> 2682434 WARN  (zkCallback-2403-thread-1-processing-n:127.0.0.1:55951_solr) [n:127.0.0.1:55951_solr    ] o.a.s.c.c.ZkStateReader ZooKeeper watch triggered, but Solr cannot talk to ZK: [KeeperErrorCode = Session expired for /live_nodes]
   [junit4]   2> 2683869 WARN  (zkCallback-2404-thread-1-processing-n:127.0.0.1:55948_solr) [n:127.0.0.1:55948_solr    ] o.a.s.c.c.ZkStateReader ZooKeeper watch triggered, but Solr cannot talk to ZK: [KeeperErrorCode = Session expired for /live_nodes]
   [junit4]   2> 2683869 INFO  (jetty-closer-2384-thread-4) [    ] o.e.j.s.h.ContextHandler Stopped o.e.j.s.ServletContextHandler@30fd3db5{/solr,null,UNAVAILABLE}
   [junit4]   2> 2683929 WARN  (zkCallback-2405-thread-1-processing-n:127.0.0.1:55949_solr) [n:127.0.0.1:55949_solr    ] o.a.s.c.c.ZkStateReader ZooKeeper watch triggered, but Solr cannot talk to ZK: [KeeperErrorCode = Session expired for /live_nodes]
   [junit4]   2> 2683929 INFO  (jetty-closer-2384-thread-1) [    ] o.e.j.s.h.ContextHandler Stopped o.e.j.s.ServletContextHandler@38da888c{/solr,null,UNAVAILABLE}
   [junit4]   2> 2683937 INFO  (jetty-closer-2384-thread-3) [    ] o.e.j.s.h.ContextHandler Stopped o.e.j.s.ServletContextHandler@4dd1f013{/solr,null,UNAVAILABLE}
   [junit4]   2> 2683938 ERROR (SUITE-CustomCollectionTest-seed#[C0E1DDC6CA6224D9]-worker) [    ] o.a.z.s.ZooKeeperServer ZKShutdownHandler is not registered, so ZooKeeper server won't take any action on ERROR or SHUTDOWN server state changes
   [junit4]   2> 2683939 INFO  (SUITE-CustomCollectionTest-seed#[C0E1DDC6CA6224D9]-worker) [    ] o.a.s.c.ZkTestServer connecting to 127.0.0.1:55946 55946
   [junit4]   2> 2683947 INFO  (Thread-2963) [    ] o.a.s.c.ZkTestServer connecting to 127.0.0.1:55946 55946
   [junit4]   2> 2690593 WARN  (Thread-2963) [    ] o.a.s.c.ZkTestServer Watch limit violations: 
   [junit4]   2> Maximum concurrent create/delete watches above limit:
   [junit4]   2> 
   [junit4]   2> 	11	/solr/configs/conf
   [junit4]   2> 	9	/solr/clusterprops.json
   [junit4]   2> 	9	/solr/aliases.json
   [junit4]   2> 	4	/solr/security.json
   [junit4]   2> 
   [junit4]   2> Maximum concurrent data watches above limit:
   [junit4]   2> 
   [junit4]   2> 	9	/solr/clusterstate.json
   [junit4]   2> 	5	/solr/collections/implicitcoll/state.json
   [junit4]   2> 	4	/solr/collections/testCreateShardRepFactor/state.json
   [junit4]   2> 	4	/solr/collections/routeFieldColl/state.json
   [junit4]   2> 	4	/solr/collections/withShardField/state.json
   [junit4]   2> 	2	/solr/collections/implicitcoll/leader_elect/x/election/97949572478926859-core_node10-n_0000000000
   [junit4]   2> 
   [junit4]   2> Maximum concurrent children watches above limit:
   [junit4]   2> 
   [junit4]   2> 	27	/solr/collections
   [junit4]   2> 	9	/solr/live_nodes
   [junit4]   2> 
   [junit4]   2> 2690593 INFO  (SUITE-CustomCollectionTest-seed#[C0E1DDC6CA6224D9]-worker) [    ] o.a.s.SolrTestCaseJ4 ###deleteCore
   [junit4]   2> NOTE: leaving temporary files on disk at: /Users/jenkins/workspace/Lucene-Solr-master-MacOSX/solr/build/solr-core/test/J1/temp/solr.cloud.CustomCollectionTest_C0E1DDC6CA6224D9-001
   [junit4]   2> NOTE: test params are: codec=Asserting(Lucene70): {shard_s=PostingsFormat(name=Memory), _version_=PostingsFormat(name=Memory), id=PostingsFormat(name=Asserting), _route_=Lucene50(blocksize=128)}, docValues:{}, maxPointsInLeafNode=705, maxMBSortInHeap=7.4194373559424776, sim=RandomSimilarity(queryNorm=true): {}, locale=ar-DZ, timezone=Africa/Mbabane
   [junit4]   2> NOTE: Mac OS X 10.11.6 x86_64/Oracle Corporation 1.8.0_131 (64-bit)/cpus=3,threads=1,free=73797600,total=482914304
   [junit4]   2> NOTE: All tests run in this JVM: [OpenCloseCoreStressTest, MinimalSchemaTest, OverseerStatusTest, DistanceFunctionTest, TestSolrCoreProperties, CacheHeaderTest, TestCoreDiscovery, TestLuceneMatchVersion, TestFieldCacheWithThreads, AnalyticsQueryTest, CreateCollectionCleanupTest, TestRecovery, DistribCursorPagingTest, SliceStateTest, SpatialRPTFieldTypeTest, TestTolerantUpdateProcessorRandomCloud, TestSolr4Spatial, CloneFieldUpdateProcessorFactoryTest, SuggesterTSTTest, FileBasedSpellCheckerTest, TestCodecSupport, TestLeaderInitiatedRecoveryThread, DeleteShardTest, ChaosMonkeyNothingIsSafeTest, ZkSolrClientTest, TestBadConfig, TestTrieFacet, DistanceUnitsTest, SpellPossibilityIteratorTest, TestSolrQueryParser, RankQueryTest, SystemInfoHandlerTest, TestFieldCollectionResource, TermVectorComponentTest, TimeZoneUtilsTest, TestValueSourceCache, TestCrossCoreJoin, TestFastLRUCache, TestObjectReleaseTracker, SolrMetricManagerTest, SolrMetricsIntegrationTest, WrapperMergePolicyFactoryTest, LeaderElectionIntegrationTest, GraphQueryTest, TestDFRSimilarityFactory, MissingSegmentRecoveryTest, TestJoin, TestPointFields, TestFuzzyAnalyzedSuggestions, TestFieldCacheSortRandom, TestWriterPerf, TestBackupRepositoryFactory, CoreMergeIndexesAdminHandlerTest, TestBinaryResponseWriter, TestReqParamsAPI, ForceLeaderTest, StressHdfsTest, TestInitParams, TestNestedDocsSort, TestIndexingPerformance, TolerantUpdateProcessorTest, SolrIndexMetricsTest, BlockJoinFacetRandomTest, TestRecoveryHdfs, SecurityConfHandlerTest, HighlighterMaxOffsetTest, TestCollectionAPIs, TestQueryUtils, LeaderInitiatedRecoveryOnShardRestartTest, MetricsHandlerTest, TestStressRecovery, DistributedVersionInfoTest, TestSearchPerf, TestQueryWrapperFilter, DistributedExpandComponentTest, TestHalfAndHalfDocValues, CurrencyFieldOpenExchangeTest, UpdateRequestProcessorFactoryTest, DOMUtilTest, TestDocSet, TestSlowCompositeReaderWrapper, HdfsRestartWhileUpdatingTest, LoggingHandlerTest, SolrShardReporterTest, OverriddenZkACLAndCredentialsProvidersTest, HdfsCollectionsAPIDistributedZkTest, LargeFieldTest, AddSchemaFieldsUpdateProcessorFactoryTest, TestDocTermOrds, ChangedSchemaMergeTest, ConnectionReuseTest, TestImplicitCoreProperties, DistributedFacetPivotWhiteBoxTest, TestSolrCoreParser, TestRandomFaceting, CdcrBootstrapTest, TestUninvertingReader, TestSchemalessBufferedUpdates, UUIDFieldTest, TestCloudRecovery, SparseHLLTest, TestDistribIDF, HLLSerializationTest, TestFieldTypeCollectionResource, ExplicitHLLTest, TestDocumentBuilder, FullSolrCloudDistribCmdsTest, TestSchemaSimilarityResource, TestRequestStatusCollectionAPI, TestReplicaProperties, DataDrivenBlockJoinTest, TestOmitPositions, TestExpandComponent, BigEndianAscendingWordSerializerTest, StatsComponentTest, TestSystemCollAutoCreate, HdfsBasicDistributedZk2Test, CollectionReloadTest, RollingRestartTest, TestClassNameShortening, BadComponentTest, TestOnReconnectListenerSupport, DeleteInactiveReplicaTest, PrimUtilsTest, CollectionTooManyReplicasTest, ClassificationUpdateProcessorIntegrationTest, HdfsRecoverLeaseTest, TestCloudManagedSchema, TestSimpleTrackingShardHandler, NotRequiredUniqueKeyTest, TestFileDictionaryLookup, TestRawTransformer, AnalysisErrorHandlingTest, ZkStateReaderTest, BasicZkTest, BasicAuthIntegrationTest, HdfsThreadLeakTest, CloudMLTQParserTest, CoreAdminCreateDiscoverTest, CollectionsAPIDistributedZkTest, PreAnalyzedUpdateProcessorTest, TestImpersonationWithHadoopAuth, ResponseLogComponentTest, RegexBoostProcessorTest, TermVectorComponentDistributedTest, TestJsonFacets, TestSearcherReuse, SuggesterWFSTTest, TestPHPSerializedResponseWriter, WordBreakSolrSpellCheckerTest, DistributedFacetPivotLargeTest, NoCacheHeaderTest, MetricsConfigTest, HdfsDirectoryFactoryTest, PreAnalyzedFieldTest, TestLMJelinekMercerSimilarityFactory, TestIndexSearcher, ShowFileRequestHandlerTest, TestLockTree, DistributedTermsComponentTest, TestManagedResource, TestPKIAuthenticationPlugin, TestNoOpRegenerator, BlockDirectoryTest, TestSha256AuthenticationProvider, ConfigSetsAPITest, TestExactStatsCache, TestDynamicFieldCollectionResource, TestComplexPhraseLeadingWildcard, TestAddFieldRealTimeGet, ConjunctionSolrSpellCheckerTest, ChaosMonkeySafeLeaderTest, BasicDistributedZk2Test, OverseerTest, ShardRoutingTest, TestZkChroot, TestRandomDVFaceting, ZkCLITest, BasicFunctionalityTest, SoftAutoCommitTest, SuggesterTest, SpatialFilterTest, SolrCoreCheckLockOnStartupTest, TestAtomicUpdateErrorCases, QueryEqualityTest, SortByFunctionTest, DebugComponentTest, IndexBasedSpellCheckerTest, TestSurroundQueryParser, DisMaxRequestHandlerTest, DirectSolrSpellCheckerTest, TestReversedWildcardFilterFactory, TestQueryTypes, TermsComponentTest, RequestHandlersTest, PathHierarchyTokenizerFactoryTest, FieldAnalysisRequestHandlerTest, SolrPluginUtilsTest, TestCollationField, MBeansHandlerTest, TestAnalyzedSuggestions, PingRequestHandlerTest, HighlighterConfigTest, TestQuerySenderListener, UpdateParamsTest, AlternateDirectoryTest, TestSolrIndexConfig, SolrIndexConfigTest, TestSolrDeletionPolicy2, MultiTermTest, SampleTest, TestConfig, DirectSolrConnectionTest, EchoParamsTest, TestLMDirichletSimilarityFactory, ScriptEngineTest, URLClassifyProcessorTest, TestSystemIdResolver, SpellingQueryConverterTest, TestLRUCache, FileUtilsTest, TestCursorMarkWithoutUniqueKey, TestDistributedMissingSort, TestHighlightDedupGrouping, TestPathTrie, TestEmbeddedSolrServerSchemaAPI, AliasIntegrationTest, CleanupOldIndexTest, CloudExitableDirectoryReaderTest, CollectionsAPISolrJTest, CustomCollectionTest]
   [junit4] Completed [503/710 (1!)] on J1 in 62.19s, 4 tests, 1 error <<< FAILURES!

[...truncated 44094 lines...]

[JENKINS] Lucene-Solr-master-MacOSX (64bit/jdk1.8.0) - Build # 4005 - Still Unstable!

Posted by Policeman Jenkins Server <je...@thetaphi.de>.
Build: https://jenkins.thetaphi.de/job/Lucene-Solr-master-MacOSX/4005/
Java: 64bit/jdk1.8.0 -XX:-UseCompressedOops -XX:+UseParallelGC

1 tests failed.
FAILED:  org.apache.solr.cloud.FullSolrCloudDistribCmdsTest.test

Error Message:
Could not find collection:collection2

Stack Trace:
java.lang.AssertionError: Could not find collection:collection2
	at __randomizedtesting.SeedInfo.seed([42F7B56EFB5076C2:CAA38AB455AC1B3A]:0)
	at org.junit.Assert.fail(Assert.java:93)
	at org.junit.Assert.assertTrue(Assert.java:43)
	at org.junit.Assert.assertNotNull(Assert.java:526)
	at org.apache.solr.cloud.AbstractDistribZkTestBase.waitForRecoveriesToFinish(AbstractDistribZkTestBase.java:159)
	at org.apache.solr.cloud.AbstractDistribZkTestBase.waitForRecoveriesToFinish(AbstractDistribZkTestBase.java:144)
	at org.apache.solr.cloud.AbstractDistribZkTestBase.waitForRecoveriesToFinish(AbstractDistribZkTestBase.java:139)
	at org.apache.solr.cloud.AbstractFullDistribZkTestBase.waitForRecoveriesToFinish(AbstractFullDistribZkTestBase.java:861)
	at org.apache.solr.cloud.FullSolrCloudDistribCmdsTest.testIndexingBatchPerRequestWithHttpSolrClient(FullSolrCloudDistribCmdsTest.java:620)
	at org.apache.solr.cloud.FullSolrCloudDistribCmdsTest.test(FullSolrCloudDistribCmdsTest.java:152)
	at sun.reflect.NativeMethodAccessorImpl.invoke0(Native Method)
	at sun.reflect.NativeMethodAccessorImpl.invoke(NativeMethodAccessorImpl.java:62)
	at sun.reflect.DelegatingMethodAccessorImpl.invoke(DelegatingMethodAccessorImpl.java:43)
	at java.lang.reflect.Method.invoke(Method.java:498)
	at com.carrotsearch.randomizedtesting.RandomizedRunner.invoke(RandomizedRunner.java:1713)
	at com.carrotsearch.randomizedtesting.RandomizedRunner$8.evaluate(RandomizedRunner.java:907)
	at com.carrotsearch.randomizedtesting.RandomizedRunner$9.evaluate(RandomizedRunner.java:943)
	at com.carrotsearch.randomizedtesting.RandomizedRunner$10.evaluate(RandomizedRunner.java:957)
	at org.apache.solr.BaseDistributedSearchTestCase$ShardsRepeatRule$ShardsFixedStatement.callStatement(BaseDistributedSearchTestCase.java:985)
	at org.apache.solr.BaseDistributedSearchTestCase$ShardsRepeatRule$ShardsStatement.evaluate(BaseDistributedSearchTestCase.java:960)
	at com.carrotsearch.randomizedtesting.rules.SystemPropertiesRestoreRule$1.evaluate(SystemPropertiesRestoreRule.java:57)
	at org.apache.lucene.util.TestRuleSetupTeardownChained$1.evaluate(TestRuleSetupTeardownChained.java:49)
	at org.apache.lucene.util.AbstractBeforeAfterRule$1.evaluate(AbstractBeforeAfterRule.java:45)
	at org.apache.lucene.util.TestRuleThreadAndTestName$1.evaluate(TestRuleThreadAndTestName.java:48)
	at org.apache.lucene.util.TestRuleIgnoreAfterMaxFailures$1.evaluate(TestRuleIgnoreAfterMaxFailures.java:64)
	at org.apache.lucene.util.TestRuleMarkFailure$1.evaluate(TestRuleMarkFailure.java:47)
	at com.carrotsearch.randomizedtesting.rules.StatementAdapter.evaluate(StatementAdapter.java:36)
	at com.carrotsearch.randomizedtesting.ThreadLeakControl$StatementRunner.run(ThreadLeakControl.java:368)
	at com.carrotsearch.randomizedtesting.ThreadLeakControl.forkTimeoutingTask(ThreadLeakControl.java:817)
	at com.carrotsearch.randomizedtesting.ThreadLeakControl$3.evaluate(ThreadLeakControl.java:468)
	at com.carrotsearch.randomizedtesting.RandomizedRunner.runSingleTest(RandomizedRunner.java:916)
	at com.carrotsearch.randomizedtesting.RandomizedRunner$5.evaluate(RandomizedRunner.java:802)
	at com.carrotsearch.randomizedtesting.RandomizedRunner$6.evaluate(RandomizedRunner.java:852)
	at com.carrotsearch.randomizedtesting.RandomizedRunner$7.evaluate(RandomizedRunner.java:863)
	at com.carrotsearch.randomizedtesting.rules.StatementAdapter.evaluate(StatementAdapter.java:36)
	at com.carrotsearch.randomizedtesting.rules.SystemPropertiesRestoreRule$1.evaluate(SystemPropertiesRestoreRule.java:57)
	at org.apache.lucene.util.AbstractBeforeAfterRule$1.evaluate(AbstractBeforeAfterRule.java:45)
	at com.carrotsearch.randomizedtesting.rules.StatementAdapter.evaluate(StatementAdapter.java:36)
	at org.apache.lucene.util.TestRuleStoreClassName$1.evaluate(TestRuleStoreClassName.java:41)
	at com.carrotsearch.randomizedtesting.rules.NoShadowingOrOverridesOnMethodsRule$1.evaluate(NoShadowingOrOverridesOnMethodsRule.java:40)
	at com.carrotsearch.randomizedtesting.rules.NoShadowingOrOverridesOnMethodsRule$1.evaluate(NoShadowingOrOverridesOnMethodsRule.java:40)
	at com.carrotsearch.randomizedtesting.rules.StatementAdapter.evaluate(StatementAdapter.java:36)
	at com.carrotsearch.randomizedtesting.rules.StatementAdapter.evaluate(StatementAdapter.java:36)
	at com.carrotsearch.randomizedtesting.rules.StatementAdapter.evaluate(StatementAdapter.java:36)
	at org.apache.lucene.util.TestRuleAssertionsRequired$1.evaluate(TestRuleAssertionsRequired.java:53)
	at org.apache.lucene.util.TestRuleMarkFailure$1.evaluate(TestRuleMarkFailure.java:47)
	at org.apache.lucene.util.TestRuleIgnoreAfterMaxFailures$1.evaluate(TestRuleIgnoreAfterMaxFailures.java:64)
	at org.apache.lucene.util.TestRuleIgnoreTestSuites$1.evaluate(TestRuleIgnoreTestSuites.java:54)
	at com.carrotsearch.randomizedtesting.rules.StatementAdapter.evaluate(StatementAdapter.java:36)
	at com.carrotsearch.randomizedtesting.ThreadLeakControl$StatementRunner.run(ThreadLeakControl.java:368)
	at java.lang.Thread.run(Thread.java:748)




Build Log:
[...truncated 12163 lines...]
   [junit4] Suite: org.apache.solr.cloud.FullSolrCloudDistribCmdsTest
   [junit4]   2> Creating dataDir: /Users/jenkins/workspace/Lucene-Solr-master-MacOSX/solr/build/solr-core/test/J0/temp/solr.cloud.FullSolrCloudDistribCmdsTest_42F7B56EFB5076C2-001/init-core-data-001
   [junit4]   2> 2164623 WARN  (SUITE-FullSolrCloudDistribCmdsTest-seed#[42F7B56EFB5076C2]-worker) [    ] o.a.s.SolrTestCaseJ4 startTrackingSearchers: numOpens=7 numCloses=7
   [junit4]   2> 2164623 INFO  (SUITE-FullSolrCloudDistribCmdsTest-seed#[42F7B56EFB5076C2]-worker) [    ] o.a.s.SolrTestCaseJ4 Using PointFields
   [junit4]   2> 2164627 INFO  (SUITE-FullSolrCloudDistribCmdsTest-seed#[42F7B56EFB5076C2]-worker) [    ] o.a.s.SolrTestCaseJ4 Randomized ssl (false) and clientAuth (false) via: @org.apache.solr.SolrTestCaseJ4$SuppressSSL(bugUrl=https://issues.apache.org/jira/browse/SOLR-5776) w/ MAC_OS_X supressed clientAuth
   [junit4]   2> 2164627 INFO  (SUITE-FullSolrCloudDistribCmdsTest-seed#[42F7B56EFB5076C2]-worker) [    ] o.a.s.BaseDistributedSearchTestCase Setting hostContext system property: /
   [junit4]   2> 2164629 INFO  (TEST-FullSolrCloudDistribCmdsTest.test-seed#[42F7B56EFB5076C2]) [    ] o.a.s.c.ZkTestServer STARTING ZK TEST SERVER
   [junit4]   2> 2164629 INFO  (Thread-3080) [    ] o.a.s.c.ZkTestServer client port:0.0.0.0/0.0.0.0:0
   [junit4]   2> 2164629 INFO  (Thread-3080) [    ] o.a.s.c.ZkTestServer Starting server
   [junit4]   2> 2164634 ERROR (Thread-3080) [    ] o.a.z.s.ZooKeeperServer ZKShutdownHandler is not registered, so ZooKeeper server won't take any action on ERROR or SHUTDOWN server state changes
   [junit4]   2> 2164739 INFO  (TEST-FullSolrCloudDistribCmdsTest.test-seed#[42F7B56EFB5076C2]) [    ] o.a.s.c.ZkTestServer start zk server on port:60457
   [junit4]   2> 2164795 INFO  (TEST-FullSolrCloudDistribCmdsTest.test-seed#[42F7B56EFB5076C2]) [    ] o.a.s.c.AbstractZkTestCase put /Users/jenkins/workspace/Lucene-Solr-master-MacOSX/solr/core/src/test-files/solr/collection1/conf/solrconfig-tlog.xml to /configs/conf1/solrconfig.xml
   [junit4]   2> 2164828 INFO  (TEST-FullSolrCloudDistribCmdsTest.test-seed#[42F7B56EFB5076C2]) [    ] o.a.s.c.AbstractZkTestCase put /Users/jenkins/workspace/Lucene-Solr-master-MacOSX/solr/core/src/test-files/solr/collection1/conf/schema15.xml to /configs/conf1/schema.xml
   [junit4]   2> 2164852 INFO  (TEST-FullSolrCloudDistribCmdsTest.test-seed#[42F7B56EFB5076C2]) [    ] o.a.s.c.AbstractZkTestCase put /Users/jenkins/workspace/Lucene-Solr-master-MacOSX/solr/core/src/test-files/solr/collection1/conf/solrconfig.snippet.randomindexconfig.xml to /configs/conf1/solrconfig.snippet.randomindexconfig.xml
   [junit4]   2> 2164855 INFO  (TEST-FullSolrCloudDistribCmdsTest.test-seed#[42F7B56EFB5076C2]) [    ] o.a.s.c.AbstractZkTestCase put /Users/jenkins/workspace/Lucene-Solr-master-MacOSX/solr/core/src/test-files/solr/collection1/conf/stopwords.txt to /configs/conf1/stopwords.txt
   [junit4]   2> 2164858 INFO  (TEST-FullSolrCloudDistribCmdsTest.test-seed#[42F7B56EFB5076C2]) [    ] o.a.s.c.AbstractZkTestCase put /Users/jenkins/workspace/Lucene-Solr-master-MacOSX/solr/core/src/test-files/solr/collection1/conf/protwords.txt to /configs/conf1/protwords.txt
   [junit4]   2> 2164862 INFO  (TEST-FullSolrCloudDistribCmdsTest.test-seed#[42F7B56EFB5076C2]) [    ] o.a.s.c.AbstractZkTestCase put /Users/jenkins/workspace/Lucene-Solr-master-MacOSX/solr/core/src/test-files/solr/collection1/conf/currency.xml to /configs/conf1/currency.xml
   [junit4]   2> 2164866 INFO  (TEST-FullSolrCloudDistribCmdsTest.test-seed#[42F7B56EFB5076C2]) [    ] o.a.s.c.AbstractZkTestCase put /Users/jenkins/workspace/Lucene-Solr-master-MacOSX/solr/core/src/test-files/solr/collection1/conf/enumsConfig.xml to /configs/conf1/enumsConfig.xml
   [junit4]   2> 2164869 INFO  (TEST-FullSolrCloudDistribCmdsTest.test-seed#[42F7B56EFB5076C2]) [    ] o.a.s.c.AbstractZkTestCase put /Users/jenkins/workspace/Lucene-Solr-master-MacOSX/solr/core/src/test-files/solr/collection1/conf/open-exchange-rates.json to /configs/conf1/open-exchange-rates.json
   [junit4]   2> 2164874 INFO  (TEST-FullSolrCloudDistribCmdsTest.test-seed#[42F7B56EFB5076C2]) [    ] o.a.s.c.AbstractZkTestCase put /Users/jenkins/workspace/Lucene-Solr-master-MacOSX/solr/core/src/test-files/solr/collection1/conf/mapping-ISOLatin1Accent.txt to /configs/conf1/mapping-ISOLatin1Accent.txt
   [junit4]   2> 2164877 INFO  (TEST-FullSolrCloudDistribCmdsTest.test-seed#[42F7B56EFB5076C2]) [    ] o.a.s.c.AbstractZkTestCase put /Users/jenkins/workspace/Lucene-Solr-master-MacOSX/solr/core/src/test-files/solr/collection1/conf/old_synonyms.txt to /configs/conf1/old_synonyms.txt
   [junit4]   2> 2164881 INFO  (TEST-FullSolrCloudDistribCmdsTest.test-seed#[42F7B56EFB5076C2]) [    ] o.a.s.c.AbstractZkTestCase put /Users/jenkins/workspace/Lucene-Solr-master-MacOSX/solr/core/src/test-files/solr/collection1/conf/synonyms.txt to /configs/conf1/synonyms.txt
   [junit4]   2> 2168568 INFO  (TEST-FullSolrCloudDistribCmdsTest.test-seed#[42F7B56EFB5076C2]) [    ] o.a.s.SolrTestCaseJ4 Writing core.properties file to /Users/jenkins/workspace/Lucene-Solr-master-MacOSX/solr/build/solr-core/test/J0/temp/solr.cloud.FullSolrCloudDistribCmdsTest_42F7B56EFB5076C2-001/control-001/cores/collection1
   [junit4]   2> 2168571 INFO  (TEST-FullSolrCloudDistribCmdsTest.test-seed#[42F7B56EFB5076C2]) [    ] o.e.j.s.Server jetty-9.3.14.v20161028
   [junit4]   2> 2168574 INFO  (TEST-FullSolrCloudDistribCmdsTest.test-seed#[42F7B56EFB5076C2]) [    ] o.e.j.s.h.ContextHandler Started o.e.j.s.ServletContextHandler@1ef2791f{/,null,AVAILABLE}
   [junit4]   2> 2168576 INFO  (TEST-FullSolrCloudDistribCmdsTest.test-seed#[42F7B56EFB5076C2]) [    ] o.e.j.s.AbstractConnector Started ServerConnector@3002b8b8{HTTP/1.1,[http/1.1]}{127.0.0.1:60460}
   [junit4]   2> 2168576 INFO  (TEST-FullSolrCloudDistribCmdsTest.test-seed#[42F7B56EFB5076C2]) [    ] o.e.j.s.Server Started @2175095ms
   [junit4]   2> 2168576 INFO  (TEST-FullSolrCloudDistribCmdsTest.test-seed#[42F7B56EFB5076C2]) [    ] o.a.s.c.s.e.JettySolrRunner Jetty properties: {solr.data.dir=/Users/jenkins/workspace/Lucene-Solr-master-MacOSX/solr/build/solr-core/test/J0/temp/solr.cloud.FullSolrCloudDistribCmdsTest_42F7B56EFB5076C2-001/tempDir-001/control/data, hostContext=/, hostPort=60460, coreRootDirectory=/Users/jenkins/workspace/Lucene-Solr-master-MacOSX/solr/build/solr-core/test/J0/temp/solr.cloud.FullSolrCloudDistribCmdsTest_42F7B56EFB5076C2-001/control-001/cores}
   [junit4]   2> 2168577 ERROR (TEST-FullSolrCloudDistribCmdsTest.test-seed#[42F7B56EFB5076C2]) [    ] o.a.s.s.StartupLoggingUtils Missing Java Option solr.log.dir. Logging may be missing or incomplete.
   [junit4]   2> 2168577 INFO  (TEST-FullSolrCloudDistribCmdsTest.test-seed#[42F7B56EFB5076C2]) [    ] o.a.s.s.SolrDispatchFilter  ___      _       Welcome to Apache Solr™ version 7.0.0
   [junit4]   2> 2168577 INFO  (TEST-FullSolrCloudDistribCmdsTest.test-seed#[42F7B56EFB5076C2]) [    ] o.a.s.s.SolrDispatchFilter / __| ___| |_ _   Starting in cloud mode on port null
   [junit4]   2> 2168577 INFO  (TEST-FullSolrCloudDistribCmdsTest.test-seed#[42F7B56EFB5076C2]) [    ] o.a.s.s.SolrDispatchFilter \__ \/ _ \ | '_|  Install dir: null
   [junit4]   2> 2168577 INFO  (TEST-FullSolrCloudDistribCmdsTest.test-seed#[42F7B56EFB5076C2]) [    ] o.a.s.s.SolrDispatchFilter |___/\___/_|_|    Start time: 2017-05-13T13:44:58.704Z
   [junit4]   2> 2168585 INFO  (TEST-FullSolrCloudDistribCmdsTest.test-seed#[42F7B56EFB5076C2]) [    ] o.a.s.s.SolrDispatchFilter Loading solr.xml from SolrHome (not found in ZooKeeper)
   [junit4]   2> 2168585 INFO  (TEST-FullSolrCloudDistribCmdsTest.test-seed#[42F7B56EFB5076C2]) [    ] o.a.s.c.SolrXmlConfig Loading container configuration from /Users/jenkins/workspace/Lucene-Solr-master-MacOSX/solr/build/solr-core/test/J0/temp/solr.cloud.FullSolrCloudDistribCmdsTest_42F7B56EFB5076C2-001/control-001/solr.xml
   [junit4]   2> 2168600 INFO  (TEST-FullSolrCloudDistribCmdsTest.test-seed#[42F7B56EFB5076C2]) [    ] o.a.s.c.SolrXmlConfig MBean server found: com.sun.jmx.mbeanserver.JmxMBeanServer@64048510, but no JMX reporters were configured - adding default JMX reporter.
   [junit4]   2> 2168608 INFO  (TEST-FullSolrCloudDistribCmdsTest.test-seed#[42F7B56EFB5076C2]) [    ] o.a.s.c.ZkContainer Zookeeper client=127.0.0.1:60457/solr
   [junit4]   2> 2168671 INFO  (TEST-FullSolrCloudDistribCmdsTest.test-seed#[42F7B56EFB5076C2]) [n:127.0.0.1:60460_    ] o.a.s.c.Overseer Overseer (id=null) closing
   [junit4]   2> 2168673 INFO  (TEST-FullSolrCloudDistribCmdsTest.test-seed#[42F7B56EFB5076C2]) [n:127.0.0.1:60460_    ] o.a.s.c.OverseerElectionContext I am going to be the leader 127.0.0.1:60460_
   [junit4]   2> 2168676 INFO  (TEST-FullSolrCloudDistribCmdsTest.test-seed#[42F7B56EFB5076C2]) [n:127.0.0.1:60460_    ] o.a.s.c.Overseer Overseer (id=97955551298191364-127.0.0.1:60460_-n_0000000000) starting
   [junit4]   2> 2168697 INFO  (TEST-FullSolrCloudDistribCmdsTest.test-seed#[42F7B56EFB5076C2]) [n:127.0.0.1:60460_    ] o.a.s.c.ZkController Register node as live in ZooKeeper:/live_nodes/127.0.0.1:60460_
   [junit4]   2> 2168702 INFO  (zkCallback-2151-thread-1-processing-n:127.0.0.1:60460_) [n:127.0.0.1:60460_    ] o.a.s.c.c.ZkStateReader Updated live nodes from ZooKeeper... (0) -> (1)
   [junit4]   2> 2168862 INFO  (TEST-FullSolrCloudDistribCmdsTest.test-seed#[42F7B56EFB5076C2]) [n:127.0.0.1:60460_    ] o.a.s.m.r.SolrJmxReporter JMX monitoring for 'solr.node' (registry 'solr.node') enabled at server: com.sun.jmx.mbeanserver.JmxMBeanServer@64048510
   [junit4]   2> 2168869 INFO  (TEST-FullSolrCloudDistribCmdsTest.test-seed#[42F7B56EFB5076C2]) [n:127.0.0.1:60460_    ] o.a.s.m.r.SolrJmxReporter JMX monitoring for 'solr.jvm' (registry 'solr.jvm') enabled at server: com.sun.jmx.mbeanserver.JmxMBeanServer@64048510
   [junit4]   2> 2168869 INFO  (TEST-FullSolrCloudDistribCmdsTest.test-seed#[42F7B56EFB5076C2]) [n:127.0.0.1:60460_    ] o.a.s.m.r.SolrJmxReporter JMX monitoring for 'solr.jetty' (registry 'solr.jetty') enabled at server: com.sun.jmx.mbeanserver.JmxMBeanServer@64048510
   [junit4]   2> 2168872 INFO  (TEST-FullSolrCloudDistribCmdsTest.test-seed#[42F7B56EFB5076C2]) [n:127.0.0.1:60460_    ] o.a.s.c.CorePropertiesLocator Found 1 core definitions underneath /Users/jenkins/workspace/Lucene-Solr-master-MacOSX/solr/build/solr-core/test/J0/temp/solr.cloud.FullSolrCloudDistribCmdsTest_42F7B56EFB5076C2-001/control-001/cores
   [junit4]   2> 2168873 INFO  (TEST-FullSolrCloudDistribCmdsTest.test-seed#[42F7B56EFB5076C2]) [n:127.0.0.1:60460_    ] o.a.s.c.CorePropertiesLocator Cores are: [collection1]
   [junit4]   2> 2168874 INFO  (coreLoadExecutor-5848-thread-1-processing-n:127.0.0.1:60460_) [n:127.0.0.1:60460_ c:control_collection   x:collection1] o.a.s.c.TransientSolrCoreCacheDefault Allocating transient cache for 4 transient cores
   [junit4]   2> 2168880 INFO  (OverseerStateUpdate-97955551298191364-127.0.0.1:60460_-n_0000000000) [n:127.0.0.1:60460_    ] o.a.s.c.o.ReplicaMutator Assigning new node to shard shard=shard1
   [junit4]   2> 2169910 INFO  (coreLoadExecutor-5848-thread-1-processing-n:127.0.0.1:60460_) [n:127.0.0.1:60460_ c:control_collection   x:collection1] o.a.s.c.SolrConfig Using Lucene MatchVersion: 7.0.0
   [junit4]   2> 2169923 INFO  (coreLoadExecutor-5848-thread-1-processing-n:127.0.0.1:60460_) [n:127.0.0.1:60460_ c:control_collection   x:collection1] o.a.s.s.IndexSchema [collection1] Schema name=test
   [junit4]   2> 2170021 INFO  (coreLoadExecutor-5848-thread-1-processing-n:127.0.0.1:60460_) [n:127.0.0.1:60460_ c:control_collection   x:collection1] o.a.s.s.IndexSchema Loaded schema test/1.6 with uniqueid field id
   [junit4]   2> 2170061 INFO  (coreLoadExecutor-5848-thread-1-processing-n:127.0.0.1:60460_) [n:127.0.0.1:60460_ c:control_collection   x:collection1] o.a.s.c.CoreContainer Creating SolrCore 'collection1' using configuration from collection control_collection, trusted=true
   [junit4]   2> 2170061 INFO  (coreLoadExecutor-5848-thread-1-processing-n:127.0.0.1:60460_) [n:127.0.0.1:60460_ c:control_collection   x:collection1] o.a.s.m.r.SolrJmxReporter JMX monitoring for 'solr.core.control_collection.shard1.core_node1' (registry 'solr.core.control_collection.shard1.core_node1') enabled at server: com.sun.jmx.mbeanserver.JmxMBeanServer@64048510
   [junit4]   2> 2170061 INFO  (coreLoadExecutor-5848-thread-1-processing-n:127.0.0.1:60460_) [n:127.0.0.1:60460_ c:control_collection   x:collection1] o.a.s.c.SolrCore solr.RecoveryStrategy.Builder
   [junit4]   2> 2170061 INFO  (coreLoadExecutor-5848-thread-1-processing-n:127.0.0.1:60460_) [n:127.0.0.1:60460_ c:control_collection   x:collection1] o.a.s.c.SolrCore [[collection1] ] Opening new SolrCore at [/Users/jenkins/workspace/Lucene-Solr-master-MacOSX/solr/build/solr-core/test/J0/temp/solr.cloud.FullSolrCloudDistribCmdsTest_42F7B56EFB5076C2-001/control-001/cores/collection1], dataDir=[/Users/jenkins/workspace/Lucene-Solr-master-MacOSX/solr/build/solr-core/test/J0/temp/solr.cloud.FullSolrCloudDistribCmdsTest_42F7B56EFB5076C2-001/control-001/cores/collection1/data/]
   [junit4]   2> 2170063 INFO  (coreLoadExecutor-5848-thread-1-processing-n:127.0.0.1:60460_) [n:127.0.0.1:60460_ c:control_collection   x:collection1] o.a.s.u.RandomMergePolicy RandomMergePolicy wrapping class org.apache.lucene.index.TieredMergePolicy: [TieredMergePolicy: maxMergeAtOnce=50, maxMergeAtOnceExplicit=46, maxMergedSegmentMB=69.5166015625, floorSegmentMB=0.8525390625, forceMergeDeletesPctAllowed=10.29656691783481, segmentsPerTier=26.0, maxCFSSegmentSizeMB=8.796093022207999E12, noCFSRatio=0.0
   [junit4]   2> 2170066 WARN  (coreLoadExecutor-5848-thread-1-processing-n:127.0.0.1:60460_) [n:127.0.0.1:60460_ c:control_collection   x:collection1] o.a.s.c.RequestHandlers INVALID paramSet a in requestHandler {type = requestHandler,name = /dump,class = DumpRequestHandler,attributes = {initParams=a, name=/dump, class=DumpRequestHandler},args = {defaults={a=A,b=B}}}
   [junit4]   2> 2170131 INFO  (coreLoadExecutor-5848-thread-1-processing-n:127.0.0.1:60460_) [n:127.0.0.1:60460_ c:control_collection   x:collection1] o.a.s.u.UpdateHandler Using UpdateLog implementation: org.apache.solr.update.UpdateLog
   [junit4]   2> 2170131 INFO  (coreLoadExecutor-5848-thread-1-processing-n:127.0.0.1:60460_) [n:127.0.0.1:60460_ c:control_collection   x:collection1] o.a.s.u.UpdateLog Initializing UpdateLog: dataDir= defaultSyncLevel=FLUSH numRecordsToKeep=100 maxNumLogsToKeep=10 numVersionBuckets=65536
   [junit4]   2> 2170133 INFO  (coreLoadExecutor-5848-thread-1-processing-n:127.0.0.1:60460_) [n:127.0.0.1:60460_ c:control_collection   x:collection1] o.a.s.u.CommitTracker Hard AutoCommit: disabled
   [junit4]   2> 2170133 INFO  (coreLoadExecutor-5848-thread-1-processing-n:127.0.0.1:60460_) [n:127.0.0.1:60460_ c:control_collection   x:collection1] o.a.s.u.CommitTracker Soft AutoCommit: disabled
   [junit4]   2> 2170133 INFO  (coreLoadExecutor-5848-thread-1-processing-n:127.0.0.1:60460_) [n:127.0.0.1:60460_ c:control_collection   x:collection1] o.a.s.u.RandomMergePolicy RandomMergePolicy wrapping class org.apache.lucene.index.LogDocMergePolicy: [LogDocMergePolicy: minMergeSize=1000, mergeFactor=24, maxMergeSize=9223372036854775807, maxMergeSizeForForcedMerge=9223372036854775807, calibrateSizeByDeletes=true, maxMergeDocs=2147483647, maxCFSSegmentSizeMB=8.796093022207999E12, noCFSRatio=1.0]
   [junit4]   2> 2170134 INFO  (coreLoadExecutor-5848-thread-1-processing-n:127.0.0.1:60460_) [n:127.0.0.1:60460_ c:control_collection   x:collection1] o.a.s.s.SolrIndexSearcher Opening [Searcher@16611242[collection1] main]
   [junit4]   2> 2170136 INFO  (coreLoadExecutor-5848-thread-1-processing-n:127.0.0.1:60460_) [n:127.0.0.1:60460_ c:control_collection   x:collection1] o.a.s.r.ManagedResourceStorage Configured ZooKeeperStorageIO with znodeBase: /configs/conf1
   [junit4]   2> 2170137 INFO  (coreLoadExecutor-5848-thread-1-processing-n:127.0.0.1:60460_) [n:127.0.0.1:60460_ c:control_collection   x:collection1] o.a.s.r.ManagedResourceStorage Loaded null at path _rest_managed.json using ZooKeeperStorageIO:path=/configs/conf1
   [junit4]   2> 2170137 INFO  (coreLoadExecutor-5848-thread-1-processing-n:127.0.0.1:60460_) [n:127.0.0.1:60460_ c:control_collection   x:collection1] o.a.s.h.ReplicationHandler Commits will be reserved for  10000
   [junit4]   2> 2170137 INFO  (coreLoadExecutor-5848-thread-1-processing-n:127.0.0.1:60460_) [n:127.0.0.1:60460_ c:control_collection   x:collection1] o.a.s.u.UpdateLog Could not find max version in index or recent updates, using new clock 1567288826542424064
   [junit4]   2> 2170139 INFO  (searcherExecutor-5849-thread-1-processing-n:127.0.0.1:60460_ x:collection1 c:control_collection) [n:127.0.0.1:60460_ c:control_collection   x:collection1] o.a.s.c.SolrCore [collection1] Registered new searcher Searcher@16611242[collection1] main{ExitableDirectoryReader(UninvertingDirectoryReader())}
   [junit4]   2> 2170150 INFO  (coreZkRegister-5841-thread-1-processing-n:127.0.0.1:60460_ x:collection1 c:control_collection) [n:127.0.0.1:60460_ c:control_collection s:shard1 r:core_node1 x:collection1] o.a.s.c.ShardLeaderElectionContext Enough replicas found to continue.
   [junit4]   2> 2170150 INFO  (coreZkRegister-5841-thread-1-processing-n:127.0.0.1:60460_ x:collection1 c:control_collection) [n:127.0.0.1:60460_ c:control_collection s:shard1 r:core_node1 x:collection1] o.a.s.c.ShardLeaderElectionContext I may be the new leader - try and sync
   [junit4]   2> 2170150 INFO  (coreZkRegister-5841-thread-1-processing-n:127.0.0.1:60460_ x:collection1 c:control_collection) [n:127.0.0.1:60460_ c:control_collection s:shard1 r:core_node1 x:collection1] o.a.s.c.SyncStrategy Sync replicas to http://127.0.0.1:60460/collection1/
   [junit4]   2> 2170151 INFO  (coreZkRegister-5841-thread-1-processing-n:127.0.0.1:60460_ x:collection1 c:control_collection) [n:127.0.0.1:60460_ c:control_collection s:shard1 r:core_node1 x:collection1] o.a.s.c.SyncStrategy Sync Success - now sync replicas to me
   [junit4]   2> 2170151 INFO  (coreZkRegister-5841-thread-1-processing-n:127.0.0.1:60460_ x:collection1 c:control_collection) [n:127.0.0.1:60460_ c:control_collection s:shard1 r:core_node1 x:collection1] o.a.s.c.SyncStrategy http://127.0.0.1:60460/collection1/ has no replicas
   [junit4]   2> 2170151 INFO  (coreZkRegister-5841-thread-1-processing-n:127.0.0.1:60460_ x:collection1 c:control_collection) [n:127.0.0.1:60460_ c:control_collection s:shard1 r:core_node1 x:collection1] o.a.s.c.ShardLeaderElectionContext Found all replicas participating in election, clear LIR
   [junit4]   2> 2170159 INFO  (coreZkRegister-5841-thread-1-processing-n:127.0.0.1:60460_ x:collection1 c:control_collection) [n:127.0.0.1:60460_ c:control_collection s:shard1 r:core_node1 x:collection1] o.a.s.c.ShardLeaderElectionContext I am the new leader: http://127.0.0.1:60460/collection1/ shard1
   [junit4]   2> 2170325 INFO  (coreZkRegister-5841-thread-1-processing-n:127.0.0.1:60460_ x:collection1 c:control_collection) [n:127.0.0.1:60460_ c:control_collection s:shard1 r:core_node1 x:collection1] o.a.s.c.ZkController I am the leader, no recovery necessary
   [junit4]   2> 2170428 INFO  (TEST-FullSolrCloudDistribCmdsTest.test-seed#[42F7B56EFB5076C2]) [    ] o.a.s.c.c.ZkStateReader Updated live nodes from ZooKeeper... (0) -> (1)
   [junit4]   2> 2170430 INFO  (TEST-FullSolrCloudDistribCmdsTest.test-seed#[42F7B56EFB5076C2]) [    ] o.a.s.c.s.i.ZkClientClusterStateProvider Cluster at 127.0.0.1:60457/solr ready
   [junit4]   2> 2170430 INFO  (TEST-FullSolrCloudDistribCmdsTest.test-seed#[42F7B56EFB5076C2]) [    ] o.a.s.c.ChaosMonkey monkey: init - expire sessions:false cause connection loss:false
   [junit4]   2> 2170431 INFO  (TEST-FullSolrCloudDistribCmdsTest.test-seed#[42F7B56EFB5076C2]) [    ] o.a.s.c.AbstractFullDistribZkTestBase Creating collection1 with stateFormat=2
   [junit4]   2> 2172101 INFO  (TEST-FullSolrCloudDistribCmdsTest.test-seed#[42F7B56EFB5076C2]) [    ] o.a.s.SolrTestCaseJ4 Writing core.properties file to /Users/jenkins/workspace/Lucene-Solr-master-MacOSX/solr/build/solr-core/test/J0/temp/solr.cloud.FullSolrCloudDistribCmdsTest_42F7B56EFB5076C2-001/shard-1-001/cores/collection1
   [junit4]   2> 2172103 INFO  (TEST-FullSolrCloudDistribCmdsTest.test-seed#[42F7B56EFB5076C2]) [    ] o.a.s.c.AbstractFullDistribZkTestBase create jetty 1 in directory /Users/jenkins/workspace/Lucene-Solr-master-MacOSX/solr/build/solr-core/test/J0/temp/solr.cloud.FullSolrCloudDistribCmdsTest_42F7B56EFB5076C2-001/shard-1-001
   [junit4]   2> 2172104 INFO  (TEST-FullSolrCloudDistribCmdsTest.test-seed#[42F7B56EFB5076C2]) [    ] o.e.j.s.Server jetty-9.3.14.v20161028
   [junit4]   2> 2172107 INFO  (TEST-FullSolrCloudDistribCmdsTest.test-seed#[42F7B56EFB5076C2]) [    ] o.e.j.s.h.ContextHandler Started o.e.j.s.ServletContextHandler@4af5f93f{/,null,AVAILABLE}
   [junit4]   2> 2172108 INFO  (TEST-FullSolrCloudDistribCmdsTest.test-seed#[42F7B56EFB5076C2]) [    ] o.e.j.s.AbstractConnector Started ServerConnector@26ccecc2{HTTP/1.1,[http/1.1]}{127.0.0.1:60466}
   [junit4]   2> 2172108 INFO  (TEST-FullSolrCloudDistribCmdsTest.test-seed#[42F7B56EFB5076C2]) [    ] o.e.j.s.Server Started @2178626ms
   [junit4]   2> 2172108 INFO  (TEST-FullSolrCloudDistribCmdsTest.test-seed#[42F7B56EFB5076C2]) [    ] o.a.s.c.s.e.JettySolrRunner Jetty properties: {solr.data.dir=/Users/jenkins/workspace/Lucene-Solr-master-MacOSX/solr/build/solr-core/test/J0/temp/solr.cloud.FullSolrCloudDistribCmdsTest_42F7B56EFB5076C2-001/tempDir-001/jetty1, solrconfig=solrconfig.xml, hostContext=/, hostPort=60466, coreRootDirectory=/Users/jenkins/workspace/Lucene-Solr-master-MacOSX/solr/build/solr-core/test/J0/temp/solr.cloud.FullSolrCloudDistribCmdsTest_42F7B56EFB5076C2-001/shard-1-001/cores}
   [junit4]   2> 2172109 ERROR (TEST-FullSolrCloudDistribCmdsTest.test-seed#[42F7B56EFB5076C2]) [    ] o.a.s.s.StartupLoggingUtils Missing Java Option solr.log.dir. Logging may be missing or incomplete.
   [junit4]   2> 2172110 INFO  (TEST-FullSolrCloudDistribCmdsTest.test-seed#[42F7B56EFB5076C2]) [    ] o.a.s.s.SolrDispatchFilter  ___      _       Welcome to Apache Solr™ version 7.0.0
   [junit4]   2> 2172110 INFO  (TEST-FullSolrCloudDistribCmdsTest.test-seed#[42F7B56EFB5076C2]) [    ] o.a.s.s.SolrDispatchFilter / __| ___| |_ _   Starting in cloud mode on port null
   [junit4]   2> 2172110 INFO  (TEST-FullSolrCloudDistribCmdsTest.test-seed#[42F7B56EFB5076C2]) [    ] o.a.s.s.SolrDispatchFilter \__ \/ _ \ | '_|  Install dir: null
   [junit4]   2> 2172110 INFO  (TEST-FullSolrCloudDistribCmdsTest.test-seed#[42F7B56EFB5076C2]) [    ] o.a.s.s.SolrDispatchFilter |___/\___/_|_|    Start time: 2017-05-13T13:45:02.237Z
   [junit4]   2> 2172115 INFO  (TEST-FullSolrCloudDistribCmdsTest.test-seed#[42F7B56EFB5076C2]) [    ] o.a.s.s.SolrDispatchFilter Loading solr.xml from SolrHome (not found in ZooKeeper)
   [junit4]   2> 2172115 INFO  (TEST-FullSolrCloudDistribCmdsTest.test-seed#[42F7B56EFB5076C2]) [    ] o.a.s.c.SolrXmlConfig Loading container configuration from /Users/jenkins/workspace/Lucene-Solr-master-MacOSX/solr/build/solr-core/test/J0/temp/solr.cloud.FullSolrCloudDistribCmdsTest_42F7B56EFB5076C2-001/shard-1-001/solr.xml
   [junit4]   2> 2172126 INFO  (TEST-FullSolrCloudDistribCmdsTest.test-seed#[42F7B56EFB5076C2]) [    ] o.a.s.c.SolrXmlConfig MBean server found: com.sun.jmx.mbeanserver.JmxMBeanServer@64048510, but no JMX reporters were configured - adding default JMX reporter.
   [junit4]   2> 2172131 INFO  (TEST-FullSolrCloudDistribCmdsTest.test-seed#[42F7B56EFB5076C2]) [    ] o.a.s.c.ZkContainer Zookeeper client=127.0.0.1:60457/solr
   [junit4]   2> 2172151 INFO  (TEST-FullSolrCloudDistribCmdsTest.test-seed#[42F7B56EFB5076C2]) [n:127.0.0.1:60466_    ] o.a.s.c.c.ZkStateReader Updated live nodes from ZooKeeper... (0) -> (1)
   [junit4]   2> 2172158 INFO  (TEST-FullSolrCloudDistribCmdsTest.test-seed#[42F7B56EFB5076C2]) [n:127.0.0.1:60466_    ] o.a.s.c.Overseer Overseer (id=null) closing
   [junit4]   2> 2172163 INFO  (TEST-FullSolrCloudDistribCmdsTest.test-seed#[42F7B56EFB5076C2]) [n:127.0.0.1:60466_    ] o.a.s.c.ZkController Register node as live in ZooKeeper:/live_nodes/127.0.0.1:60466_
   [junit4]   2> 2172167 INFO  (zkCallback-2155-thread-1) [    ] o.a.s.c.c.ZkStateReader Updated live nodes from ZooKeeper... (1) -> (2)
   [junit4]   2> 2172168 INFO  (zkCallback-2161-thread-1-processing-n:127.0.0.1:60466_) [n:127.0.0.1:60466_    ] o.a.s.c.c.ZkStateReader Updated live nodes from ZooKeeper... (1) -> (2)
   [junit4]   2> 2172167 INFO  (zkCallback-2151-thread-1-processing-n:127.0.0.1:60460_) [n:127.0.0.1:60460_    ] o.a.s.c.c.ZkStateReader Updated live nodes from ZooKeeper... (1) -> (2)
   [junit4]   2> 2172292 INFO  (TEST-FullSolrCloudDistribCmdsTest.test-seed#[42F7B56EFB5076C2]) [n:127.0.0.1:60466_    ] o.a.s.m.r.SolrJmxReporter JMX monitoring for 'solr.node' (registry 'solr.node') enabled at server: com.sun.jmx.mbeanserver.JmxMBeanServer@64048510
   [junit4]   2> 2172298 INFO  (TEST-FullSolrCloudDistribCmdsTest.test-seed#[42F7B56EFB5076C2]) [n:127.0.0.1:60466_    ] o.a.s.m.r.SolrJmxReporter JMX monitoring for 'solr.jvm' (registry 'solr.jvm') enabled at server: com.sun.jmx.mbeanserver.JmxMBeanServer@64048510
   [junit4]   2> 2172298 INFO  (TEST-FullSolrCloudDistribCmdsTest.test-seed#[42F7B56EFB5076C2]) [n:127.0.0.1:60466_    ] o.a.s.m.r.SolrJmxReporter JMX monitoring for 'solr.jetty' (registry 'solr.jetty') enabled at server: com.sun.jmx.mbeanserver.JmxMBeanServer@64048510
   [junit4]   2> 2172301 INFO  (TEST-FullSolrCloudDistribCmdsTest.test-seed#[42F7B56EFB5076C2]) [n:127.0.0.1:60466_    ] o.a.s.c.CorePropertiesLocator Found 1 core definitions underneath /Users/jenkins/workspace/Lucene-Solr-master-MacOSX/solr/build/solr-core/test/J0/temp/solr.cloud.FullSolrCloudDistribCmdsTest_42F7B56EFB5076C2-001/shard-1-001/cores
   [junit4]   2> 2172301 INFO  (TEST-FullSolrCloudDistribCmdsTest.test-seed#[42F7B56EFB5076C2]) [n:127.0.0.1:60466_    ] o.a.s.c.CorePropertiesLocator Cores are: [collection1]
   [junit4]   2> 2172303 INFO  (coreLoadExecutor-5859-thread-1-processing-n:127.0.0.1:60466_) [n:127.0.0.1:60466_ c:collection1   x:collection1] o.a.s.c.TransientSolrCoreCacheDefault Allocating transient cache for 4 transient cores
   [junit4]   2> 2172305 INFO  (OverseerStateUpdate-97955551298191364-127.0.0.1:60460_-n_0000000000) [n:127.0.0.1:60460_    ] o.a.s.c.o.ReplicaMutator Assigning new node to shard shard=shard2
   [junit4]   2> 2172418 INFO  (zkCallback-2161-thread-1-processing-n:127.0.0.1:60466_) [n:127.0.0.1:60466_    ] o.a.s.c.c.ZkStateReader A cluster state change: [WatchedEvent state:SyncConnected type:NodeDataChanged path:/collections/collection1/state.json] for collection [collection1] has occurred - updating... (live nodes size: [2])
   [junit4]   2> 2173344 INFO  (coreLoadExecutor-5859-thread-1-processing-n:127.0.0.1:60466_) [n:127.0.0.1:60466_ c:collection1   x:collection1] o.a.s.c.SolrConfig Using Lucene MatchVersion: 7.0.0
   [junit4]   2> 2173362 INFO  (coreLoadExecutor-5859-thread-1-processing-n:127.0.0.1:60466_) [n:127.0.0.1:60466_ c:collection1   x:collection1] o.a.s.s.IndexSchema [collection1] Schema name=test
   [junit4]   2> 2173441 INFO  (coreLoadExecutor-5859-thread-1-processing-n:127.0.0.1:60466_) [n:127.0.0.1:60466_ c:collection1   x:collection1] o.a.s.s.IndexSchema Loaded schema test/1.6 with uniqueid field id
   [junit4]   2> 2173484 INFO  (coreLoadExecutor-5859-thread-1-processing-n:127.0.0.1:60466_) [n:127.0.0.1:60466_ c:collection1   x:collection1] o.a.s.c.CoreContainer Creating SolrCore 'collection1' using configuration from collection collection1, trusted=true
   [junit4]   2> 2173484 INFO  (coreLoadExecutor-5859-thread-1-processing-n:127.0.0.1:60466_) [n:127.0.0.1:60466_ c:collection1   x:collection1] o.a.s.m.r.SolrJmxReporter JMX monitoring for 'solr.core.collection1.shard2.core_node1' (registry 'solr.core.collection1.shard2.core_node1') enabled at server: com.sun.jmx.mbeanserver.JmxMBeanServer@64048510
   [junit4]   2> 2173484 INFO  (coreLoadExecutor-5859-thread-1-processing-n:127.0.0.1:60466_) [n:127.0.0.1:60466_ c:collection1   x:collection1] o.a.s.c.SolrCore solr.RecoveryStrategy.Builder
   [junit4]   2> 2173484 INFO  (coreLoadExecutor-5859-thread-1-processing-n:127.0.0.1:60466_) [n:127.0.0.1:60466_ c:collection1   x:collection1] o.a.s.c.SolrCore [[collection1] ] Opening new SolrCore at [/Users/jenkins/workspace/Lucene-Solr-master-MacOSX/solr/build/solr-core/test/J0/temp/solr.cloud.FullSolrCloudDistribCmdsTest_42F7B56EFB5076C2-001/shard-1-001/cores/collection1], dataDir=[/Users/jenkins/workspace/Lucene-Solr-master-MacOSX/solr/build/solr-core/test/J0/temp/solr.cloud.FullSolrCloudDistribCmdsTest_42F7B56EFB5076C2-001/shard-1-001/cores/collection1/data/]
   [junit4]   2> 2173486 INFO  (coreLoadExecutor-5859-thread-1-processing-n:127.0.0.1:60466_) [n:127.0.0.1:60466_ c:collection1   x:collection1] o.a.s.u.RandomMergePolicy RandomMergePolicy wrapping class org.apache.lucene.index.TieredMergePolicy: [TieredMergePolicy: maxMergeAtOnce=50, maxMergeAtOnceExplicit=46, maxMergedSegmentMB=69.5166015625, floorSegmentMB=0.8525390625, forceMergeDeletesPctAllowed=10.29656691783481, segmentsPerTier=26.0, maxCFSSegmentSizeMB=8.796093022207999E12, noCFSRatio=0.0
   [junit4]   2> 2173488 WARN  (coreLoadExecutor-5859-thread-1-processing-n:127.0.0.1:60466_) [n:127.0.0.1:60466_ c:collection1   x:collection1] o.a.s.c.RequestHandlers INVALID paramSet a in requestHandler {type = requestHandler,name = /dump,class = DumpRequestHandler,attributes = {initParams=a, name=/dump, class=DumpRequestHandler},args = {defaults={a=A,b=B}}}
   [junit4]   2> 2173557 INFO  (coreLoadExecutor-5859-thread-1-processing-n:127.0.0.1:60466_) [n:127.0.0.1:60466_ c:collection1   x:collection1] o.a.s.u.UpdateHandler Using UpdateLog implementation: org.apache.solr.update.UpdateLog
   [junit4]   2> 2173557 INFO  (coreLoadExecutor-5859-thread-1-processing-n:127.0.0.1:60466_) [n:127.0.0.1:60466_ c:collection1   x:collection1] o.a.s.u.UpdateLog Initializing UpdateLog: dataDir= defaultSyncLevel=FLUSH numRecordsToKeep=100 maxNumLogsToKeep=10 numVersionBuckets=65536
   [junit4]   2> 2173559 INFO  (coreLoadExecutor-5859-thread-1-processing-n:127.0.0.1:60466_) [n:127.0.0.1:60466_ c:collection1   x:collection1] o.a.s.u.CommitTracker Hard AutoCommit: disabled
   [junit4]   2> 2173559 INFO  (coreLoadExecutor-5859-thread-1-processing-n:127.0.0.1:60466_) [n:127.0.0.1:60466_ c:collection1   x:collection1] o.a.s.u.CommitTracker Soft AutoCommit: disabled
   [junit4]   2> 2173560 INFO  (coreLoadExecutor-5859-thread-1-processing-n:127.0.0.1:60466_) [n:127.0.0.1:60466_ c:collection1   x:collection1] o.a.s.u.RandomMergePolicy RandomMergePolicy wrapping class org.apache.lucene.index.LogDocMergePolicy: [LogDocMergePolicy: minMergeSize=1000, mergeFactor=24, maxMergeSize=9223372036854775807, maxMergeSizeForForcedMerge=9223372036854775807, calibrateSizeByDeletes=true, maxMergeDocs=2147483647, maxCFSSegmentSizeMB=8.796093022207999E12, noCFSRatio=1.0]
   [junit4]   2> 2173560 INFO  (coreLoadExecutor-5859-thread-1-processing-n:127.0.0.1:60466_) [n:127.0.0.1:60466_ c:collection1   x:collection1] o.a.s.s.SolrIndexSearcher Opening [Searcher@54ff3e1[collection1] main]
   [junit4]   2> 2173562 INFO  (coreLoadExecutor-5859-thread-1-processing-n:127.0.0.1:60466_) [n:127.0.0.1:60466_ c:collection1   x:collection1] o.a.s.r.ManagedResourceStorage Configured ZooKeeperStorageIO with znodeBase: /configs/conf1
   [junit4]   2> 2173563 INFO  (coreLoadExecutor-5859-thread-1-processing-n:127.0.0.1:60466_) [n:127.0.0.1:60466_ c:collection1   x:collection1] o.a.s.r.ManagedResourceStorage Loaded null at path _rest_managed.json using ZooKeeperStorageIO:path=/configs/conf1
   [junit4]   2> 2173563 INFO  (coreLoadExecutor-5859-thread-1-processing-n:127.0.0.1:60466_) [n:127.0.0.1:60466_ c:collection1   x:collection1] o.a.s.h.ReplicationHandler Commits will be reserved for  10000
   [junit4]   2> 2173564 INFO  (coreLoadExecutor-5859-thread-1-processing-n:127.0.0.1:60466_) [n:127.0.0.1:60466_ c:collection1   x:collection1] o.a.s.u.UpdateLog Could not find max version in index or recent updates, using new clock 1567288830134845440
   [junit4]   2> 2173565 INFO  (searcherExecutor-5860-thread-1-processing-n:127.0.0.1:60466_ x:collection1 c:collection1) [n:127.0.0.1:60466_ c:collection1   x:collection1] o.a.s.c.SolrCore [collection1] Registered new searcher Searcher@54ff3e1[collection1] main{ExitableDirectoryReader(UninvertingDirectoryReader())}
   [junit4]   2> 2173577 INFO  (coreZkRegister-5854-thread-1-processing-n:127.0.0.1:60466_ x:collection1 c:collection1) [n:127.0.0.1:60466_ c:collection1 s:shard2 r:core_node1 x:collection1] o.a.s.c.ShardLeaderElectionContext Enough replicas found to continue.
   [junit4]   2> 2173577 INFO  (coreZkRegister-5854-thread-1-processing-n:127.0.0.1:60466_ x:collection1 c:collection1) [n:127.0.0.1:60466_ c:collection1 s:shard2 r:core_node1 x:collection1] o.a.s.c.ShardLeaderElectionContext I may be the new leader - try and sync
   [junit4]   2> 2173577 INFO  (coreZkRegister-5854-thread-1-processing-n:127.0.0.1:60466_ x:collection1 c:collection1) [n:127.0.0.1:60466_ c:collection1 s:shard2 r:core_node1 x:collection1] o.a.s.c.SyncStrategy Sync replicas to http://127.0.0.1:60466/collection1/
   [junit4]   2> 2173577 INFO  (coreZkRegister-5854-thread-1-processing-n:127.0.0.1:60466_ x:collection1 c:collection1) [n:127.0.0.1:60466_ c:collection1 s:shard2 r:core_node1 x:collection1] o.a.s.c.SyncStrategy Sync Success - now sync replicas to me
   [junit4]   2> 2173577 INFO  (coreZkRegister-5854-thread-1-processing-n:127.0.0.1:60466_ x:collection1 c:collection1) [n:127.0.0.1:60466_ c:collection1 s:shard2 r:core_node1 x:collection1] o.a.s.c.SyncStrategy http://127.0.0.1:60466/collection1/ has no replicas
   [junit4]   2> 2173577 INFO  (coreZkRegister-5854-thread-1-processing-n:127.0.0.1:60466_ x:collection1 c:collection1) [n:127.0.0.1:60466_ c:collection1 s:shard2 r:core_node1 x:collection1] o.a.s.c.ShardLeaderElectionContext Found all replicas participating in election, clear LIR
   [junit4]   2> 2173585 INFO  (coreZkRegister-5854-thread-1-processing-n:127.0.0.1:60466_ x:collection1 c:collection1) [n:127.0.0.1:60466_ c:collection1 s:shard2 r:core_node1 x:collection1] o.a.s.c.ShardLeaderElectionContext I am the new leader: http://127.0.0.1:60466/collection1/ shard2
   [junit4]   2> 2173701 INFO  (zkCallback-2161-thread-1-processing-n:127.0.0.1:60466_) [n:127.0.0.1:60466_    ] o.a.s.c.c.ZkStateReader A cluster state change: [WatchedEvent state:SyncConnected type:NodeDataChanged path:/collections/collection1/state.json] for collection [collection1] has occurred - updating... (live nodes size: [2])
   [junit4]   2> 2173760 INFO  (coreZkRegister-5854-thread-1-processing-n:127.0.0.1:60466_ x:collection1 c:collection1) [n:127.0.0.1:60466_ c:collection1 s:shard2 r:core_node1 x:collection1] o.a.s.c.ZkController I am the leader, no recovery necessary
   [junit4]   2> 2173872 INFO  (zkCallback-2161-thread-1-processing-n:127.0.0.1:60466_) [n:127.0.0.1:60466_    ] o.a.s.c.c.ZkStateReader A cluster state change: [WatchedEvent state:SyncConnected type:NodeDataChanged path:/collections/collection1/state.json] for collection [collection1] has occurred - updating... (live nodes size: [2])
   [junit4]   2> 2174375 INFO  (TEST-FullSolrCloudDistribCmdsTest.test-seed#[42F7B56EFB5076C2]) [    ] o.a.s.SolrTestCaseJ4 Writing core.properties file to /Users/jenkins/workspace/Lucene-Solr-master-MacOSX/solr/build/solr-core/test/J0/temp/solr.cloud.FullSolrCloudDistribCmdsTest_42F7B56EFB5076C2-001/shard-2-001/cores/collection1
   [junit4]   2> 2174377 INFO  (TEST-FullSolrCloudDistribCmdsTest.test-seed#[42F7B56EFB5076C2]) [    ] o.a.s.c.AbstractFullDistribZkTestBase create jetty 2 in directory /Users/jenkins/workspace/Lucene-Solr-master-MacOSX/solr/build/solr-core/test/J0/temp/solr.cloud.FullSolrCloudDistribCmdsTest_42F7B56EFB5076C2-001/shard-2-001
   [junit4]   2> 2174378 INFO  (TEST-FullSolrCloudDistribCmdsTest.test-seed#[42F7B56EFB5076C2]) [    ] o.e.j.s.Server jetty-9.3.14.v20161028
   [junit4]   2> 2174380 INFO  (TEST-FullSolrCloudDistribCmdsTest.test-seed#[42F7B56EFB5076C2]) [    ] o.e.j.s.h.ContextHandler Started o.e.j.s.ServletContextHandler@5b279338{/,null,AVAILABLE}
   [junit4]   2> 2174381 INFO  (TEST-FullSolrCloudDistribCmdsTest.test-seed#[42F7B56EFB5076C2]) [    ] o.e.j.s.AbstractConnector Started ServerConnector@395acdbb{HTTP/1.1,[http/1.1]}{127.0.0.1:60476}
   [junit4]   2> 2174381 INFO  (TEST-FullSolrCloudDistribCmdsTest.test-seed#[42F7B56EFB5076C2]) [    ] o.e.j.s.Server Started @2180899ms
   [junit4]   2> 2174381 INFO  (TEST-FullSolrCloudDistribCmdsTest.test-seed#[42F7B56EFB5076C2]) [    ] o.a.s.c.s.e.JettySolrRunner Jetty properties: {solr.data.dir=/Users/jenkins/workspace/Lucene-Solr-master-MacOSX/solr/build/solr-core/test/J0/temp/solr.cloud.FullSolrCloudDistribCmdsTest_42F7B56EFB5076C2-001/tempDir-001/jetty2, solrconfig=solrconfig.xml, hostContext=/, hostPort=60476, coreRootDirectory=/Users/jenkins/workspace/Lucene-Solr-master-MacOSX/solr/build/solr-core/test/J0/temp/solr.cloud.FullSolrCloudDistribCmdsTest_42F7B56EFB5076C2-001/shard-2-001/cores}
   [junit4]   2> 2174382 ERROR (TEST-FullSolrCloudDistribCmdsTest.test-seed#[42F7B56EFB5076C2]) [    ] o.a.s.s.StartupLoggingUtils Missing Java Option solr.log.dir. Logging may be missing or incomplete.
   [junit4]   2> 2174383 INFO  (TEST-FullSolrCloudDistribCmdsTest.test-seed#[42F7B56EFB5076C2]) [    ] o.a.s.s.SolrDispatchFilter  ___      _       Welcome to Apache Solr™ version 7.0.0
   [junit4]   2> 2174383 INFO  (TEST-FullSolrCloudDistribCmdsTest.test-seed#[42F7B56EFB5076C2]) [    ] o.a.s.s.SolrDispatchFilter / __| ___| |_ _   Starting in cloud mode on port null
   [junit4]   2> 2174383 INFO  (TEST-FullSolrCloudDistribCmdsTest.test-seed#[42F7B56EFB5076C2]) [    ] o.a.s.s.SolrDispatchFilter \__ \/ _ \ | '_|  Install dir: null
   [junit4]   2> 2174383 INFO  (TEST-FullSolrCloudDistribCmdsTest.test-seed#[42F7B56EFB5076C2]) [    ] o.a.s.s.SolrDispatchFilter |___/\___/_|_|    Start time: 2017-05-13T13:45:04.510Z
   [junit4]   2> 2174389 INFO  (TEST-FullSolrCloudDistribCmdsTest.test-seed#[42F7B56EFB5076C2]) [    ] o.a.s.s.SolrDispatchFilter Loading solr.xml from SolrHome (not found in ZooKeeper)
   [junit4]   2> 2174389 INFO  (TEST-FullSolrCloudDistribCmdsTest.test-seed#[42F7B56EFB5076C2]) [    ] o.a.s.c.SolrXmlConfig Loading container configuration from /Users/jenkins/workspace/Lucene-Solr-master-MacOSX/solr/build/solr-core/test/J0/temp/solr.cloud.FullSolrCloudDistribCmdsTest_42F7B56EFB5076C2-001/shard-2-001/solr.xml
   [junit4]   2> 2174406 INFO  (TEST-FullSolrCloudDistribCmdsTest.test-seed#[42F7B56EFB5076C2]) [    ] o.a.s.c.SolrXmlConfig MBean server found: com.sun.jmx.mbeanserver.JmxMBeanServer@64048510, but no JMX reporters were configured - adding default JMX reporter.
   [junit4]   2> 2174411 INFO  (TEST-FullSolrCloudDistribCmdsTest.test-seed#[42F7B56EFB5076C2]) [    ] o.a.s.c.ZkContainer Zookeeper client=127.0.0.1:60457/solr
   [junit4]   2> 2174432 INFO  (TEST-FullSolrCloudDistribCmdsTest.test-seed#[42F7B56EFB5076C2]) [n:127.0.0.1:60476_    ] o.a.s.c.c.ZkStateReader Updated live nodes from ZooKeeper... (0) -> (2)
   [junit4]   2> 2174438 INFO  (TEST-FullSolrCloudDistribCmdsTest.test-seed#[42F7B56EFB5076C2]) [n:127.0.0.1:60476_    ] o.a.s.c.Overseer Overseer (id=null) closing
   [junit4]   2> 2174443 INFO  (TEST-FullSolrCloudDistribCmdsTest.test-seed#[42F7B56EFB5076C2]) [n:127.0.0.1:60476_    ] o.a.s.c.ZkController Register node as live in ZooKeeper:/live_nodes/127.0.0.1:60476_
   [junit4]   2> 2174447 INFO  (zkCallback-2161-thread-1-processing-n:127.0.0.1:60466_) [n:127.0.0.1:60466_    ] o.a.s.c.c.ZkStateReader Updated live nodes from ZooKeeper... (2) -> (3)
   [junit4]   2> 2174447 INFO  (zkCallback-2151-thread-1-processing-n:127.0.0.1:60460_) [n:127.0.0.1:60460_    ] o.a.s.c.c.ZkStateReader Updated live nodes from ZooKeeper... (2) -> (3)
   [junit4]   2> 2174448 INFO  (zkCallback-2167-thread-1-processing-n:127.0.0.1:60476_) [n:127.0.0.1:60476_    ] o.a.s.c.c.ZkStateReader Updated live nodes from ZooKeeper... (2) -> (3)
   [junit4]   2> 2174449 INFO  (zkCallback-2155-thread-1) [    ] o.a.s.c.c.ZkStateReader Updated live nodes from ZooKeeper... (2) -> (3)
   [junit4]   2> 2174574 INFO  (TEST-FullSolrCloudDistribCmdsTest.test-seed#[42F7B56EFB5076C2]) [n:127.0.0.1:60476_    ] o.a.s.m.r.SolrJmxReporter JMX monitoring for 'solr.node' (registry 'solr.node') enabled at server: com.sun.jmx.mbeanserver.JmxMBeanServer@64048510
   [junit4]   2> 2174579 INFO  (TEST-FullSolrCloudDistribCmdsTest.test-seed#[42F7B56EFB5076C2]) [n:127.0.0.1:60476_    ] o.a.s.m.r.SolrJmxReporter JMX monitoring for 'solr.jvm' (registry 'solr.jvm') enabled at server: com.sun.jmx.mbeanserver.JmxMBeanServer@64048510
   [junit4]   2> 2174580 INFO  (TEST-FullSolrCloudDistribCmdsTest.test-seed#[42F7B56EFB5076C2]) [n:127.0.0.1:60476_    ] o.a.s.m.r.SolrJmxReporter JMX monitoring for 'solr.jetty' (registry 'solr.jetty') enabled at server: com.sun.jmx.mbeanserver.JmxMBeanServer@64048510
   [junit4]   2> 2174582 INFO  (TEST-FullSolrCloudDistribCmdsTest.test-seed#[42F7B56EFB5076C2]) [n:127.0.0.1:60476_    ] o.a.s.c.CorePropertiesLocator Found 1 core definitions underneath /Users/jenkins/workspace/Lucene-Solr-master-MacOSX/solr/build/solr-core/test/J0/temp/solr.cloud.FullSolrCloudDistribCmdsTest_42F7B56EFB5076C2-001/shard-2-001/cores
   [junit4]   2> 2174582 INFO  (TEST-FullSolrCloudDistribCmdsTest.test-seed#[42F7B56EFB5076C2]) [n:127.0.0.1:60476_    ] o.a.s.c.CorePropertiesLocator Cores are: [collection1]
   [junit4]   2> 2174584 INFO  (coreLoadExecutor-5870-thread-1-processing-n:127.0.0.1:60476_) [n:127.0.0.1:60476_ c:collection1   x:collection1] o.a.s.c.TransientSolrCoreCacheDefault Allocating transient cache for 4 transient cores
   [junit4]   2> 2174586 INFO  (OverseerStateUpdate-97955551298191364-127.0.0.1:60460_-n_0000000000) [n:127.0.0.1:60460_    ] o.a.s.c.o.ReplicaMutator Assigning new node to shard shard=shard3
   [junit4]   2> 2174690 INFO  (zkCallback-2161-thread-1-processing-n:127.0.0.1:60466_) [n:127.0.0.1:60466_    ] o.a.s.c.c.ZkStateReader A cluster state change: [WatchedEvent state:SyncConnected type:NodeDataChanged path:/collections/collection1/state.json] for collection [collection1] has occurred - updating... (live nodes size: [3])
   [junit4]   2> 2174691 INFO  (zkCallback-2167-thread-1-processing-n:127.0.0.1:60476_) [n:127.0.0.1:60476_    ] o.a.s.c.c.ZkStateReader A cluster state change: [WatchedEvent state:SyncConnected type:NodeDataChanged path:/collections/collection1/state.json] for collection [collection1] has occurred - updating... (live nodes size: [3])
   [junit4]   2> 2175615 INFO  (coreLoadExecutor-5870-thread-1-processing-n:127.0.0.1:60476_) [n:127.0.0.1:60476_ c:collection1   x:collection1] o.a.s.c.SolrConfig Using Lucene MatchVersion: 7.0.0
   [junit4]   2> 2175633 INFO  (coreLoadExecutor-5870-thread-1-processing-n:127.0.0.1:60476_) [n:127.0.0.1:60476_ c:collection1   x:collection1] o.a.s.s.IndexSchema [collection1] Schema name=test
   [junit4]   2> 2175722 INFO  (coreLoadExecutor-5870-thread-1-processing-n:127.0.0.1:60476_) [n:127.0.0.1:60476_ c:collection1   x:collection1] o.a.s.s.IndexSchema Loaded schema test/1.6 with uniqueid field id
   [junit4]   2> 2175754 INFO  (coreLoadExecutor-5870-thread-1-processing-n:127.0.0.1:60476_) [n:127.0.0.1:60476_ c:collection1   x:collection1] o.a.s.c.CoreContainer Creating SolrCore 'collection1' using configuration from collection collection1, trusted=true
   [junit4]   2> 2175755 INFO  (coreLoadExecutor-5870-thread-1-processing-n:127.0.0.1:60476_) [n:127.0.0.1:60476_ c:collection1   x:collection1] o.a.s.m.r.SolrJmxReporter JMX monitoring for 'solr.core.collection1.shard3.core_node2' (registry 'solr.core.collection1.shard3.core_node2') enabled at server: com.sun.jmx.mbeanserver.JmxMBeanServer@64048510
   [junit4]   2> 2175755 INFO  (coreLoadExecutor-5870-thread-1-processing-n:127.0.0.1:60476_) [n:127.0.0.1:60476_ c:collection1   x:collection1] o.a.s.c.SolrCore solr.RecoveryStrategy.Builder
   [junit4]   2> 2175756 INFO  (coreLoadExecutor-5870-thread-1-processing-n:127.0.0.1:60476_) [n:127.0.0.1:60476_ c:collection1   x:collection1] o.a.s.c.SolrCore [[collection1] ] Opening new SolrCore at [/Users/jenkins/workspace/Lucene-Solr-master-MacOSX/solr/build/solr-core/test/J0/temp/solr.cloud.FullSolrCloudDistribCmdsTest_42F7B56EFB5076C2-001/shard-2-001/cores/collection1], dataDir=[/Users/jenkins/workspace/Lucene-Solr-master-MacOSX/solr/build/solr-core/test/J0/temp/solr.cloud.FullSolrCloudDistribCmdsTest_42F7B56EFB5076C2-001/shard-2-001/cores/collection1/data/]
   [junit4]   2> 2175758 INFO  (coreLoadExecutor-5870-thread-1-processing-n:127.0.0.1:60476_) [n:127.0.0.1:60476_ c:collection1   x:collection1] o.a.s.u.RandomMergePolicy RandomMergePolicy wrapping class org.apache.lucene.index.TieredMergePolicy: [TieredMergePolicy: maxMergeAtOnce=50, maxMergeAtOnceExplicit=46, maxMergedSegmentMB=69.5166015625, floorSegmentMB=0.8525390625, forceMergeDeletesPctAllowed=10.29656691783481, segmentsPerTier=26.0, maxCFSSegmentSizeMB=8.796093022207999E12, noCFSRatio=0.0
   [junit4]   2> 2175763 WARN  (coreLoadExecutor-5870-thread-1-processing-n:127.0.0.1:60476_) [n:127.0.0.1:60476_ c:collection1   x:collection1] o.a.s.c.RequestHandlers INVALID paramSet a in requestHandler {type = requestHandler,name = /dump,class = DumpRequestHandler,attributes = {initParams=a, name=/dump, class=DumpRequestHandler},args = {defaults={a=A,b=B}}}
   [junit4]   2> 2175841 INFO  (coreLoadExecutor-5870-thread-1-processing-n:127.0.0.1:60476_) [n:127.0.0.1:60476_ c:collection1   x:collection1] o.a.s.u.UpdateHandler Using UpdateLog implementation: org.apache.solr.update.UpdateLog
   [junit4]   2> 2175841 INFO  (coreLoadExecutor-5870-thread-1-processing-n:127.0.0.1:60476_) [n:127.0.0.1:60476_ c:collection1   x:collection1] o.a.s.u.UpdateLog Initializing UpdateLog: dataDir= defaultSyncLevel=FLUSH numRecordsToKeep=100 maxNumLogsToKeep=10 numVersionBuckets=65536
   [junit4]   2> 2175843 INFO  (coreLoadExecutor-5870-thread-1-processing-n:127.0.0.1:60476_) [n:127.0.0.1:60476_ c:collection1   x:collection1] o.a.s.u.CommitTracker Hard AutoCommit: disabled
   [junit4]   2> 2175843 INFO  (coreLoadExecutor-5870-thread-1-processing-n:127.0.0.1:60476_) [n:127.0.0.1:60476_ c:collection1   x:collection1] o.a.s.u.CommitTracker Soft AutoCommit: disabled
   [junit4]   2> 2175844 INFO  (coreLoadExecutor-5870-thread-1-processing-n:127.0.0.1:60476_) [n:127.0.0.1:60476_ c:collection1   x:collection1] o.a.s.u.RandomMergePolicy RandomMergePolicy wrapping class org.apache.lucene.index.LogDocMergePolicy: [LogDocMergePolicy: minMergeSize=1000, mergeFactor=24, maxMergeSize=9223372036854775807, maxMergeSizeForForcedMerge=9223372036854775807, calibrateSizeByDeletes=true, maxMergeDocs=2147483647, maxCFSSegmentSizeMB=8.796093022207999E12, noCFSRatio=1.0]
   [junit4]   2> 2175844 INFO  (coreLoadExecutor-5870-thread-1-processing-n:127.0.0.1:60476_) [n:127.0.0.1:60476_ c:collection1   x:collection1] o.a.s.s.SolrIndexSearcher Opening [Searcher@20cf89a4[collection1] main]
   [junit4]   2> 2175846 INFO  (coreLoadExecutor-5870-thread-1-processing-n:127.0.0.1:60476_) [n:127.0.0.1:60476_ c:collection1   x:collection1] o.a.s.r.ManagedResourceStorage Configured ZooKeeperStorageIO with znodeBase: /configs/conf1
   [junit4]   2> 2175847 INFO  (coreLoadExecutor-5870-thread-1-processing-n:127.0.0.1:60476_) [n:127.0.0.1:60476_ c:collection1   x:collection1] o.a.s.r.ManagedResourceStorage Loaded null at path _rest_managed.json using ZooKeeperStorageIO:path=/configs/conf1
   [junit4]   2> 2175847 INFO  (coreLoadExecutor-5870-thread-1-processing-n:127.0.0.1:60476_) [n:127.0.0.1:60476_ c:collection1   x:collection1] o.a.s.h.ReplicationHandler Commits will be reserved for  10000
   [junit4]   2> 2175847 INFO  (coreLoadExecutor-5870-thread-1-processing-n:127.0.0.1:60476_) [n:127.0.0.1:60476_ c:collection1   x:collection1] o.a.s.u.UpdateLog Could not find max version in index or recent updates, using new clock 1567288832529793024
   [junit4]   2> 2175848 INFO  (searcherExecutor-5871-thread-1-processing-n:127.0.0.1:60476_ x:collection1 c:collection1) [n:127.0.0.1:60476_ c:collection1   x:collection1] o.a.s.c.SolrCore [collection1] Registered new searcher Searcher@20cf89a4[collection1] main{ExitableDirectoryReader(UninvertingDirectoryReader())}
   [junit4]   2> 2175858 INFO  (coreZkRegister-5865-thread-1-processing-n:127.0.0.1:60476_ x:collection1 c:collection1) [n:127.0.0.1:60476_ c:collection1 s:shard3 r:core_node2 x:collection1] o.a.s.c.ShardLeaderElectionContext Enough replicas found to continue.
   [junit4]   2> 2175858 INFO  (coreZkRegister-5865-thread-1-processing-n:127.0.0.1:60476_ x:collection1 c:collection1) [n:127.0.0.1:60476_ c:collection1 s:shard3 r:core_node2 x:collection1] o.a.s.c.ShardLeaderElectionContext I may be the new leader - try and sync
   [junit4]   2> 2175858 INFO  (coreZkRegister-5865-thread-1-processing-n:127.0.0.1:60476_ x:collection1 c:collection1) [n:127.0.0.1:60476_ c:collection1 s:shard3 r:core_node2 x:collection1] o.a.s.c.SyncStrategy Sync replicas to http://127.0.0.1:60476/collection1/
   [junit4]   2> 2175858 INFO  (coreZkRegister-5865-thread-1-processing-n:127.0.0.1:60476_ x:collection1 c:collection1) [n:127.0.0.1:60476_ c:collection1 s:shard3 r:core_node2 x:collection1] o.a.s.c.SyncStrategy Sync Success - now sync replicas to me
   [junit4]   2> 2175858 INFO  (coreZkRegister-5865-thread-1-processing-n:127.0.0.1:60476_ x:collection1 c:collection1) [n:127.0.0.1:60476_ c:collection1 s:shard3 r:core_node2 x:collection1] o.a.s.c.SyncStrategy http://127.0.0.1:60476/collection1/ has no replicas
   [junit4]   2> 2175859 INFO  (coreZkRegister-5865-thread-1-processing-n:127.0.0.1:60476_ x:collection1 c:collection1) [n:127.0.0.1:60476_ c:collection1 s:shard3 r:core_node2 x:collection1] o.a.s.c.ShardLeaderElectionContext Found all replicas participating in election, clear LIR
   [junit4]   2> 2175866 INFO  (coreZkRegister-5865-thread-1-processing-n:127.0.0.1:60476_ x:collection1 c:collection1) [n:127.0.0.1:60476_ c:collection1 s:shard3 r:core_node2 x:collection1] o.a.s.c.ShardLeaderElectionContext I am the new leader: http://127.0.0.1:60476/collection1/ shard3
   [junit4]   2> 2175972 INFO  (zkCallback-2161-thread-1-processing-n:127.0.0.1:60466_) [n:127.0.0.1:60466_    ] o.a.s.c.c.ZkStateReader A cluster state change: [WatchedEvent state:SyncConnected type:NodeDataChanged path:/collections/collection1/state.json] for collection [collection1] has occurred - updating... (live nodes size: [3])
   [junit4]   2> 2175972 INFO  (zkCallback-2167-thread-1-processing-n:127.0.0.1:60476_) [n:127.0.0.1:60476_    ] o.a.s.c.c.ZkStateReader A cluster state change: [WatchedEvent state:SyncConnected type:NodeDataChanged path:/collections/collection1/state.json] for collection [collection1] has occurred - updating... (live nodes size: [3])
   [junit4]   2> 2176019 INFO  (coreZkRegister-5865-thread-1-processing-n:127.0.0.1:60476_ x:collection1 c:collection1) [n:127.0.0.1:60476_ c:collection1 s:shard3 r:core_node2 x:collection1] o.a.s.c.ZkController I am the leader, no recovery necessary
   [junit4]   2> 2176129 INFO  (zkCallback-2167-thread-1-processing-n:127.0.0.1:60476_) [n:127.0.0.1:60476_    ] o.a.s.c.c.ZkStateReader A cluster state change: [WatchedEvent state:SyncConnected type:NodeDataChanged path:/collections/collection1/state.json] for collection [collection1] has occurred - updating... (live nodes size: [3])
   [junit4]   2> 2176129 INFO  (zkCallback-2161-thread-1-processing-n:127.0.0.1:60466_) [n:127.0.0.1:60466_    ] o.a.s.c.c.ZkStateReader A cluster state change: [WatchedEvent state:SyncConnected type:NodeDataChanged path:/collections/collection1/state.json] for collection [collection1] has occurred - updating... (live nodes size: [3])
   [junit4]   2> 2176622 INFO  (TEST-FullSolrCloudDistribCmdsTest.test-seed#[42F7B56EFB5076C2]) [    ] o.a.s.SolrTestCaseJ4 Writing core.properties file to /Users/jenkins/workspace/Lucene-Solr-master-MacOSX/solr/build/solr-core/test/J0/temp/solr.cloud.FullSolrCloudDistribCmdsTest_42F7B56EFB5076C2-001/shard-3-001/cores/collection1
   [junit4]   2> 2176624 INFO  (TEST-FullSolrCloudDistribCmdsTest.test-seed#[42F7B56EFB5076C2]) [    ] o.a.s.c.AbstractFullDistribZkTestBase create jetty 3 in directory /Users/jenkins/workspace/Lucene-Solr-master-MacOSX/solr/build/solr-core/test/J0/temp/solr.cloud.FullSolrCloudDistribCmdsTest_42F7B56EFB5076C2-001/shard-3-001
   [junit4]   2> 2176625 INFO  (TEST-FullSolrCloudDistribCmdsTest.test-seed#[42F7B56EFB5076C2]) [    ] o.e.j.s.Server jetty-9.3.14.v20161028
   [junit4]   2> 2176627 INFO  (TEST-FullSolrCloudDistribCmdsTest.test-seed#[42F7B56EFB5076C2]) [    ] o.e.j.s.h.ContextHandler Started o.e.j.s.ServletContextHandler@7767a16a{/,null,AVAILABLE}
   [junit4]   2> 2176628 INFO  (TEST-FullSolrCloudDistribCmdsTest.test-seed#[42F7B56EFB5076C2]) [    ] o.e.j.s.AbstractConnector Started ServerConnector@4fe805e2{HTTP/1.1,[http/1.1]}{127.0.0.1:60480}
   [junit4]   2> 2176628 INFO  (TEST-FullSolrCloudDistribCmdsTest.test-seed#[42F7B56EFB5076C2]) [    ] o.e.j.s.Server Started @2183146ms
   [junit4]   2> 2176629 INFO  (TEST-FullSolrCloudDistribCmdsTest.test-seed#[42F7B56EFB5076C2]) [    ] o.a.s.c.s.e.JettySolrRunner Jetty properties: {solr.data.dir=/Users/jenkins/workspace/Lucene-Solr-master-MacOSX/solr/build/solr-core/test/J0/temp/solr.cloud.FullSolrCloudDistribCmdsTest_42F7B56EFB5076C2-001/tempDir-001/jetty3, solrconfig=solrconfig.xml, hostContext=/, hostPort=60480, coreRootDirectory=/Users/jenkins/workspace/Lucene-Solr-master-MacOSX/solr/build/solr-core/test/J0/../../../../../../../../../Users/jenkins/workspace/Lucene-Solr-master-MacOSX/solr/build/solr-core/test/J0/temp/solr.cloud.FullSolrCloudDistribCmdsTest_42F7B56EFB5076C2-001/shard-3-001/cores}
   [junit4]   2> 2176629 ERROR (TEST-FullSolrCloudDistribCmdsTest.test-seed#[42F7B56EFB5076C2]) [    ] o.a.s.s.StartupLoggingUtils Missing Java Option solr.log.dir. Logging may be missing or incomplete.
   [junit4]   2> 2176630 INFO  (TEST-FullSolrCloudDistribCmdsTest.test-seed#[42F7B56EFB5076C2]) [    ] o.a.s.s.SolrDispatchFilter  ___      _       Welcome to Apache Solr™ version 7.0.0
   [junit4]   2> 2176630 INFO  (TEST-FullSolrCloudDistribCmdsTest.test-seed#[42F7B56EFB5076C2]) [    ] o.a.s.s.SolrDispatchFilter / __| ___| |_ _   Starting in cloud mode on port null
   [junit4]   2> 2176630 INFO  (TEST-FullSolrCloudDistribCmdsTest.test-seed#[42F7B56EFB5076C2]) [    ] o.a.s.s.SolrDispatchFilter \__ \/ _ \ | '_|  Install dir: null
   [junit4]   2> 2176630 INFO  (TEST-FullSolrCloudDistribCmdsTest.test-seed#[42F7B56EFB5076C2]) [    ] o.a.s.s.SolrDispatchFilter |___/\___/_|_|    Start time: 2017-05-13T13:45:06.757Z
   [junit4]   2> 2176636 INFO  (TEST-FullSolrCloudDistribCmdsTest.test-seed#[42F7B56EFB5076C2]) [    ] o.a.s.s.SolrDispatchFilter Loading solr.xml from SolrHome (not found in ZooKeeper)
   [junit4]   2> 2176636 INFO  (TEST-FullSolrCloudDistribCmdsTest.test-seed#[42F7B56EFB5076C2]) [    ] o.a.s.c.SolrXmlConfig Loading container configuration from /Users/jenkins/workspace/Lucene-Solr-master-MacOSX/solr/build/solr-core/test/J0/temp/solr.cloud.FullSolrCloudDistribCmdsTest_42F7B56EFB5076C2-001/shard-3-001/solr.xml
   [junit4]   2> 2176654 INFO  (TEST-FullSolrCloudDistribCmdsTest.test-seed#[42F7B56EFB5076C2]) [    ] o.a.s.c.SolrXmlConfig MBean server found: com.sun.jmx.mbeanserver.JmxMBeanServer@64048510, but no JMX reporters were configured - adding default JMX reporter.
   [junit4]   2> 2176661 INFO  (TEST-FullSolrCloudDistribCmdsTest.test-seed#[42F7B56EFB5076C2]) [    ] o.a.s.c.ZkContainer Zookeeper client=127.0.0.1:60457/solr
   [junit4]   2> 2176682 INFO  (TEST-FullSolrCloudDistribCmdsTest.test-seed#[42F7B56EFB5076C2]) [n:127.0.0.1:60480_    ] o.a.s.c.c.ZkStateReader Updated live nodes from ZooKeeper... (0) -> (3)
   [junit4]   2> 2176687 INFO  (TEST-FullSolrCloudDistribCmdsTest.test-seed#[42F7B56EFB5076C2]) [n:127.0.0.1:60480_    ] o.a.s.c.Overseer Overseer (id=null) closing
   [junit4]   2> 2176692 INFO  (TEST-FullSolrCloudDistribCmdsTest.test-seed#[42F7B56EFB5076C2]) [n:127.0.0.1:60480_    ] o.a.s.c.ZkController Register node as live in ZooKeeper:/live_nodes/127.0.0.1:60480_
   [junit4]   2> 2176695 INFO  (zkCallback-2151-thread-1-processing-n:127.0.0.1:60460_) [n:127.0.0.1:60460_    ] o.a.s.c.c.ZkStateReader Updated live nodes from ZooKeeper... (3) -> (4)
   [junit4]   2> 2176697 INFO  (zkCallback-2173-thread-1-processing-n:127.0.0.1:60480_) [n:127.0.0.1:60480_    ] o.a.s.c.c.ZkStateReader Updated live nodes from ZooKeeper... (3) -> (4)
   [junit4]   2> 2176696 INFO  (zkCallback-2155-thread-1) [    ] o.a.s.c.c.ZkStateReader Updated live nodes from ZooKeeper... (3) -> (4)
   [junit4]   2> 2176695 INFO  (zkCallback-2167-thread-1-processing-n:127.0.0.1:60476_) [n:127.0.0.1:60476_    ] o.a.s.c.c.ZkStateReader Updated live nodes from ZooKeeper... (3) -> (4)
   [junit4]   2> 2176696 INFO  (zkCallback-2161-thread-1-processing-n:127.0.0.1:60466_) [n:127.0.0.1:60466_    ] o.a.s.c.c.ZkStateReader Updated live nodes from ZooKeeper... (3) -> (4)
   [junit4]   2> 2176839 INFO  (TEST-FullSolrCloudDistribCmdsTest.test-seed#[42F7B56EFB5076C2]) [n:127.0.0.1:60480_    ] o.a.s.m.r.SolrJmxReporter JMX monitoring for 'solr.node' (registry 'solr.node') enabled at server: com.sun.jmx.mbeanserver.JmxMBeanServer@64048510
   [junit4]   2> 2176848 INFO  (TEST-FullSolrCloudDistribCmdsTest.test-seed#[42F7B56EFB5076C2]) [n:127.0.0.1:60480_    ] o.a.s.m.r.SolrJmxReporter JMX monitoring for 'solr.jvm' (registry 'solr.jvm') enabled at server: com.sun.jmx.mbeanserver.JmxMBeanServer@64048510
   [junit4]   2> 2176848 INFO  (TEST-FullSolrCloudDistribCmdsTest.test-seed#[42F7B56EFB5076C2]) [n:127.0.0.1:60480_    ] o.a.s.m.r.SolrJmxReporter JMX monitoring for 'solr.jetty' (registry 'solr.jetty') enabled at server: com.sun.jmx.mbeanserver.JmxMBeanServer@64048510
   [junit4]   2> 2176852 INFO  (TEST-FullSolrCloudDistribCmdsTest.test-seed#[42F7B56EFB5076C2]) [n:127.0.0.1:60480_    ] o.a.s.c.CorePropertiesLocator Found 1 core definitions underneath /Users/jenkins/workspace/Lucene-Solr-master-MacOSX/solr/build/solr-core/test/J0/../../../../../../../../../Users/jenkins/workspace/Lucene-Solr-master-MacOSX/solr/build/solr-core/test/J0/temp/solr.cloud.FullSolrCloudDistribCmdsTest_42F7B56EFB5076C2-001/shard-3-001/cores
   [junit4]   2> 2176852 INFO  (TEST-FullSolrCloudDistribCmdsTest.test-seed#[42F7B56EFB5076C2]) [n:127.0.0.1:60480_    ] o.a.s.c.CorePropertiesLocator Cores are: [collection1]
   [junit4]   2> 2176854 INFO  (coreLoadExecutor-5881-thread-1-processing-n:127.0.0.1:60480_) [n:127.0.0.1:60480_ c:collection1   x:collection1] o.a.s.c.TransientSolrCoreCacheDefault Allocating transient cache for 4 transient cores
   [junit4]   2> 2176857 INFO  (OverseerStateUpdate-97955551298191364-127.0.0.1:60460_-n_0000000000) [n:127.0.0.1:60460_    ] o.a.s.c.o.ReplicaMutator Assigning new node to shard shard=shard1
   [junit4]   2> 2176963 INFO  (zkCallback-2161-thread-1-processing-n:127.0.0.1:60466_) [n:127.0.0.1:60466_    ] o.a.s.c.c.ZkStateReader A cluster state change: [WatchedEvent state:SyncConnected type:NodeDataChanged path:/collections/collection1/state.json] for collection [collection1] has occurred - updating... (live nodes size: [4])
   [junit4]   2> 2176963 INFO  (zkCallback-2167-thread-1-processing-n:127.0.0.1:60476_) [n:127.0.0.1:60476_    ] o.a.s.c.c.ZkStateReader A cluster state change: [WatchedEvent state:SyncConnected type:NodeDataChanged path:/collections/collection1/state.json] for collection [collection1] has occurred - updating... (live nodes size: [4])
   [junit4]   2> 2176963 INFO  (zkCallback-2173-thread-1-processing-n:127.0.0.1:60480_) [n:127.0.0.1:60480_    ] o.a.s.c.c.ZkStateReader A cluster state change: [WatchedEvent state:SyncConnected type:NodeDataChanged path:/collections/collection1/state.json] for collection [collection1] has occurred - updating... (live nodes size: [4])
   [junit4]   2> 2177889 INFO  (coreLoadExecutor-5881-thread-1-processing-n:127.0.0.1:60480_) [n:127.0.0.1:60480_ c:collection1   x:collection1] o.a.s.c.SolrConfig Using Lucene MatchVersion: 7.0.0
   [junit4]   2> 2177903 INFO  (coreLoadExecutor-5881-thread-1-processing-n:127.0.0.1:60480_) [n:127.0.0.1:60480_ c:collection1   x:collection1] o.a.s.s.IndexSchema [collection1] Schema name=test
   [junit4]   2> 2178005 INFO  (coreLoadExecutor-5881-thread-1-processing-n:127.0.0.1:60480_) [n:127.0.0.1:60480_ c:collection1   x:collection1] o.a.s.s.IndexSchema Loaded schema test/1.6 with uniqueid field id
   [junit4]   2> 2178044 INFO  (coreLoadExecutor-5881-thread-1-processing-n:127.0.0.1:60480_) [n:127.0.0.1:60480_ c:collection1   x:collection1] o.a.s.c.CoreContainer Creating SolrCore 'collection1' using configuration from collection collection1, trusted=true
   [junit4]   2> 2178045 INFO  (coreLoadExecutor-5881-thread-1-processing-n:127.0.0.1:60480_) [n:127.0.0.1:60480_ c:collection1   x:collection1] o.a.s.m.r.SolrJmxReporter JMX monitoring for 'solr.core.collection1.shard1.core_node3' (registry 'solr.core.collection1.shard1.core_node3') enabled at server: com.sun.jmx.mbeanserver.JmxMBeanServer@64048510
   [junit4]   2> 2178045 INFO  (coreLoadExecutor-5881-thread-1-processing-n:127.0.0.1:60480_) [n:127.0.0.1:60480_ c:collection1   x:collection1] o.a.s.c.SolrCore solr.RecoveryStrategy.Builder
   [junit4]   2> 2178045 INFO  (coreLoadExecutor-5881-thread-1-processing-n:127.0.0.1:60480_) [n:127.0.0.1:60480_ c:collection1   x:collection1] o.a.s.c.SolrCore [[collection1] ] Opening new SolrCore at [/Users/jenkins/workspace/Lucene-Solr-master-MacOSX/solr/build/solr-core/test/J0/temp/solr.cloud.FullSolrCloudDistribCmdsTest_42F7B56EFB5076C2-001/shard-3-001/cores/collection1], dataDir=[/Users/jenkins/workspace/Lucene-Solr-master-MacOSX/solr/build/solr-core/test/J0/../../../../../../../../../Users/jenkins/workspace/Lucene-Solr-master-MacOSX/solr/build/solr-core/test/J0/temp/solr.cloud.FullSolrCloudDistribCmdsTest_42F7B56EFB5076C2-001/shard-3-001/cores/collection1/data/]
   [junit4]   2> 2178048 INFO  (coreLoadExecutor-5881-thread-1-processing-n:127.0.0.1:60480_) [n:127.0.0.1:60480_ c:collection1   x:collection1] o.a.s.u.RandomMergePolicy RandomMergePolicy wrapping class org.apache.lucene.index.TieredMergePolicy: [TieredMergePolicy: maxMergeAtOnce=50, maxMergeAtOnceExplicit=46, maxMergedSegmentMB=69.5166015625, floorSegmentMB=0.8525390625, forceMergeDeletesPctAllowed=10.29656691783481, segmentsPerTier=26.0, maxCFSSegmentSizeMB=8.796093022207999E12, noCFSRatio=0.0
   [junit4]   2> 2178052 WARN  (coreLoadExecutor-5881-thread-1-processing-n:127.0.0.1:60480_) [n:127.0.0.1:60480_ c:collection1   x:collection1] o.a.s.c.RequestHandlers INVALID paramSet a in requestHandler {type = requestHandler,name = /dump,class = DumpRequestHandler,attributes = {initParams=a, name=/dump, class=DumpRequestHandler},args = {defaults={a=A,b=B}}}
   [junit4]   2> 2178159 INFO  (coreLoadExecutor-5881-thread-1-processing-n:127.0.0.1:60480_) [n:127.0.0.1:60480_ c:collection1   x:collection1] o.a.s.u.UpdateHandler Using UpdateLog implementation: org.apache.solr.update.UpdateLog
   [junit4]   2> 2178159 INFO  (coreLoadExecutor-5881-thread-1-processing-n:127.0.0.1:60480_) [n:127.0.0.1:60480_ c:collection1   x:collection1] o.a.s.u.UpdateLog Initializing UpdateLog: dataDir= defaultSyncLevel=FLUSH numRecordsToKeep=100 maxNumLogsToKeep=10 numVersionBuckets=65536
   [junit4]   2> 2178161 INFO  (coreLoadExecutor-5881-thread-1-processing-n:127.0.0.1:60480_) [n:127.0.0.1:60480_ c:collection1   x:collection1] o.a.s.u.CommitTracker Hard AutoCommit: disabled
   [junit4]   2> 2178162 INFO  (coreLoadExecutor-5881-thread-1-processing-n:127.0.0.1:60480_) [n:127.0.0.1:60480_ c:collection1   x:collection1] o.a.s.u.CommitTracker Soft AutoCommit: disabled
   [junit4]   2> 2178163 INFO  (coreLoadExecutor-5881-thread-1-processing-n:127.0.0.1:60480_) [n:127.0.0.1:60480_ c:collection1   x:collection1] o.a.s.u.RandomMergePolicy RandomMergePolicy wrapping class org.apache.lucene.index.LogDocMergePolicy: [LogDocMergePolicy: minMergeSize=1000, mergeFactor=24, maxMergeSize=9223372036854775807, maxMergeSizeForForcedMerge=9223372036854775807, calibrateSizeByDeletes=true, maxMergeDocs=2147483647, maxCFSSegmentSizeMB=8.796093022207999E12, noCFSRatio=1.0]
   [junit4]   2> 2178163 INFO  (coreLoadExecutor-5881-thread-1-processing-n:127.0.0.1:60480_) [n:127.0.0.1:60480_ c:collection1   x:collection1] o.a.s.s.SolrIndexSearcher Opening [Searcher@3d7a908d[collection1] main]
   [junit4]   2> 2178165 INFO  (coreLoadExecutor-5881-thread-1-processing-n:127.0.0.1:60480_) [n:127.0.0.1:60480_ c:collection1   x:collection1] o.a.s.r.ManagedResourceStorage Configured ZooKeeperStorageIO with znodeBase: /configs/conf1
   [junit4]   2> 2178166 INFO  (coreLoadExecutor-5881-thread-1-processing-n:127.0.0.1:60480_) [n:127.0.0.1:60480_ c:collection1   x:collection1] o.a.s.r.ManagedResourceStorage Loaded null at path _rest_managed.json using ZooKeeperStorageIO:path=/configs/conf1
   [junit4]   2> 2178167 INFO  (coreLoadExecutor-5881-thread-1-processing-n:127.0.0.1:60480_) [n:127.0.0.1:60480_ c:collection1   x:collection1] o.a.s.h.ReplicationHandler Commits will be reserved for  10000
   [junit4]   2> 2178169 INFO  (searcherExecutor-5882-thread-1-processing-n:127.0.0.1:60480_ x:collection1 c:collection1) [n:127.0.0.1:60480_ c:collection1   x:collection1] o.a.s.c.SolrCore [collection1] Registered new searcher Searcher@3d7a908d[collection1] main{ExitableDirectoryReader(UninvertingDirectoryReader())}
   [junit4]   2> 2178169 INFO  (coreLoadExecutor-5881-thread-1-processing-n:127.0.0.1:60480_) [n:127.0.0.1:60480_ c:collection1   x:collection1] o.a.s.u.UpdateLog Could not find max version in index or recent updates, using new clock 1567288834964586496
   [junit4]   2> 2178181 INFO  (coreZkRegister-5876-thread-1-processing-n:127.0.0.1:60480_ x:collection1 c:collection1) [n:127.0.0.1:60480_ c:collection1 s:shard1 r:core_node3 x:collection1] o.a.s.c.ShardLeaderElectionContext Enough replicas found to continue.
   [junit4]   2> 2178181 INFO  (coreZkRegister-5876-thread-1-processing-n:127.0.0.1:60480_ x:collection1 c:collection1) [n:127.0.0.1:60480_ c:collection1 s:shard1 r:core_node3 x:collection1] o.a.s.c.ShardLeaderElectionContext I may be the new leader - try and sync
   [junit4]   2> 2178181 INFO  (coreZkRegister-5876-thread-1-processing-n:127.0.0.1:60480_ x:collection1 c:collection1) [n:127.0.0.1:60480_ c:collection1 s:shard1 r:core_node3 x:collection1] o.a.s.c.SyncStrategy Sync replicas to http://127.0.0.1:60480/collection1/
   [junit4]   2> 2178181 INFO  (coreZkRegister-5876-thread-1-processing-n:127.0.0.1:60480_ x:collection1 c:collection1) [n:127.0.0.1:60480_ c:collection1 s:shard1 r:core_node3 x:collection1] o.a.s.c.SyncStrategy Sync Success - now sync replicas to me
   [junit4]   2> 2178181 INFO  (coreZkRegister-5876-thread-1-processing-n:127.0.0.1:60480_ x:collection1 c:collection1) [n:127.0.0.1:60480_ c:collection1 s:shard1 r:core_node3 x:collection1] o.a.s.c.SyncStrategy http://127.0.0.1:60480/collection1/ has no replicas
   [junit4]   2> 2178181 INFO  (coreZkRegister-5876-thread-1-processing-n:127.0.0.1:60480_ x:collection1 c:collection1) [n:127.0.0.1:60480_ c:collection1 s:shard1 r:core_node3 x:collection1] o.a.s.c.ShardLeaderElectionContext Found all replicas participating in election, clear LIR
   [junit4]   2> 2178189 INFO  (coreZkRegister-5876-thread-1-processing-n:127.0.0.1:60480_ x:collection1 c:collection1) [n:127.0.0.1:60480_ c:collection1 s:shard1 r:core_node3 x:collection1] o.a.s.c.ShardLeaderElectionContext I am the new leader: http://127.0.0.1:60480/collection1/ shard1
   [junit4]   2> 2178295 INFO  (zkCallback-2173-thread-1-processing-n:127.0.0.1:60480_) [n:127.0.0.1:60480_    ] o.a.s.c.c.ZkStateReader A cluster state change: [WatchedEvent state:SyncConnected type:NodeDataChanged path:/collections/collection1/state.json] for collection [collection1] has occurred - updating... (live nodes size: [4])
   [junit4]   2> 2178296 INFO  (zkCallback-2167-thread-1-processing-n:127.0.0.1:60476_) [n:127.0.0.1:60476_    ] o.a.s.c.c.ZkStateReader A cluster state change: [WatchedEvent state:SyncConnected type:NodeDataChanged path:/collections/collection1/state.json] for collection [collection1] has occurred - updating... (live nodes size: [4])
   [junit4]   2> 2178295 INFO  (zkCallback-2161-thread-1-processing-n:127.0.0.1:60466_) [n:127.0.0.1:60466_    ] o.a.s.c.c.ZkStateReader A cluster state change: [WatchedEvent state:SyncConnected type:NodeDataChanged path:/collections/collection1/state.json] for collection [collection1] has occurred - updating... (live nodes size: [4])
   [junit4]   2> 2178342 INFO  (coreZkRegister-5876-thread-1-processing-n:127.0.0.1:60480_ x:collection1 c:collection1) [n:127.0.0.1:60480_ c:collection1 s:shard1 r:core_node3 x:collection1] o.a.s.c.ZkController I am the leader, no recovery necessary
   [junit4]   2> 2178458 INFO  (zkCallback-2161-thread-1-processing-n:127.0.0.1:60466_) [n:127.0.0.1:60466_    ] o.a.s.c.c.ZkStateReader A cluster state change: [WatchedEvent state:SyncConnected type:NodeDataChanged path:/collections/collection1/state.json] for collection [collection1] has occurred - updating... (live nodes size: [4])
   [junit4]   2> 2178458 INFO  (zkCallback-2167-thread-1-processing-n:127.0.0.1:60476_) [n:127.0.0.1:60476_    ] o.a.s.c.c.ZkStateReader A cluster state change: [WatchedEvent state:SyncConnected type:NodeDataChanged path:/collections/collection1/state.json] for collection [collection1] has occurred - updating... (live nodes size: [4])
   [junit4]   2> 2178459 INFO  (zkCallback-2173-thread-1-processing-n:127.0.0.1:60480_) [n:127.0.0.1:60480_    ] o.a.s.c.c.ZkStateReader A cluster state change: [WatchedEvent state:SyncConnected type:NodeDataChanged path:/collections/collection1/state.json] for collection [collection1] has occurred - updating... (live nodes size: [4])
   [junit4]   2> 2178844 INFO  (TEST-FullSolrCloudDistribCmdsTest.test-seed#[42F7B56EFB5076C2]) [    ] o.a.s.SolrTestCaseJ4 Writing core.properties file to /Users/jenkins/workspace/Lucene-Solr-master-MacOSX/solr/build/solr-core/test/J0/temp/solr.cloud.FullSolrCloudDistribCmdsTest_42F7B56EFB5076C2-001/shard-4-001/cores/collection1
   [junit4]   2> 2178846 INFO  (TEST-FullSolrCloudDistribCmdsTest.test-seed#[42F7B56EFB5076C2]) [    ] o.a.s.c.AbstractFullDistribZkTestBase create jetty 4 in directory /Users/jenkins/workspace/Lucene-Solr-master-MacOSX/solr/build/solr-core/test/J0/temp/solr.cloud.FullSolrCloudDistribCmdsTest_42F7B56EFB5076C2-001/shard-4-001
   [junit4]   2> 2178847 INFO  (TEST-FullSolrCloudDistribCmdsTest.test-seed#[42F7B56EFB5076C2]) [    ] o.e.j.s.Server jetty-9.3.14.v20161028
   [junit4]   2> 2178849 INFO  (TEST-FullSolrCloudDistribCmdsTest.test-seed#[42F7B56EFB5076C2]) [    ] o.e.j.s.h.ContextHandler Started o.e.j.s.ServletContextHandler@396ca3be{/,null,AVAILABLE}
   [junit4]   2> 2178849 INFO  (TEST-FullSolrCloudDistribCmdsTest.test-seed#[42F7B56EFB5076C2]) [    ] o.e.j.s.AbstractConnector Started ServerConnector@59497dab{HTTP/1.1,[http/1.1]}{127.0.0.1:60484}
   [junit4]   2> 2178849 INFO  (TEST-FullSolrCloudDistribCmdsTest.test-seed#[42F7B56EFB5076C2]) [    ] o.e.j.s.Server Started @2185367ms
   [junit4]   2> 2178849 INFO  (TEST-FullSolrCloudDistribCmdsTest.test-seed#[42F7B56EFB5076C2]) [    ] o.a.s.c.s.e.JettySolrRunner Jetty properties: {solr.data.dir=/Users/jenkins/workspace/Lucene-Solr-master-MacOSX/solr/build/solr-core/test/J0/temp/solr.cloud.FullSolrCloudDistribCmdsTest_42F7B56EFB5076C2-001/tempDir-001/jetty4, solrconfig=solrconfig.xml, hostContext=/, hostPort=60484, coreRootDirectory=/Users/jenkins/workspace/Lucene-Solr-master-MacOSX/solr/build/solr-core/test/J0/../../../../../../../../../Users/jenkins/workspace/Lucene-Solr-master-MacOSX/solr/build/solr-core/test/J0/temp/solr.cloud.FullSolrCloudDistribCmdsTest_42F7B56EFB5076C2-001/shard-4-001/cores}
   [junit4]   2> 2178850 ERROR (TEST-FullSolrCloudDistribCmdsTest.test-seed#[42F7B56EFB5076C2]) [    ] o.a.s.s.StartupLoggingUtils Missing Java Option solr.log.dir. Logging may be missing or incomplete.
   [junit4]   2> 2178851 INFO  (TEST-FullSolrCloudDistribCmdsTest.test-seed#[42F7B56EFB5076C2]) [    ] o.a.s.s.SolrDispatchFilter  ___      _       Welcome to Apache Solr™ version 7.0.0
   [junit4]   2> 2178851 INFO  (TEST-FullSolrCloudDistribCmdsTest.test-seed#[42F7B56EFB5076C2]) [    ] o.a.s.s.SolrDispatchFilter / __| ___| |_ _   Starting in cloud mode on port null
   [junit4]   2> 2178851 INFO  (TEST-FullSolrCloudDistribCmdsTest.test-seed#[42F7B56EFB5076C2]) [    ] o.a.s.s.SolrDispatchFilter \__ \/ _ \ | '_|  Install dir: null
   [junit4]   2> 2178851 INFO  (TEST-FullSolrCloudDistribCmdsTest.test-seed#[42F7B56EFB5076C2]) [    ] o.a.s.s.SolrDispatchFilter |___/\___/_|_|    Start time: 2017-05-13T13:45:08.978Z
   [junit4]   2> 2178856 INFO  (TEST-FullSolrCloudDistribCmdsTest.test-seed#[42F7B56EFB5076C2]) [    ] o.a.s.s.SolrDispatchFilter Loading solr.xml from SolrHome (not found in ZooKeeper)
   [junit4]   2> 2178856 INFO  (TEST-FullSolrCloudDistribCmdsTest.test-seed#[42F7B56EFB5076C2]) [    ] o.a.s.c.SolrXmlConfig Loading container configuration from /Users/jenkins/workspace/Lucene-Solr-master-MacOSX/solr/build/solr-core/test/J0/temp/solr.cloud.FullSolrCloudDistribCmdsTest_42F7B56EFB5076C2-001/shard-4-001/solr.xml
   [junit4]   2> 2178873 INFO  (TEST-FullSolrCloudDistribCmdsTest.test-seed#[42F7B56EFB5076C2]) [    ] o.a.s.c.SolrXmlConfig MBean server found: com.sun.jmx.mbeanserver.JmxMBeanServer@64048510, but no JMX reporters were configured - adding default JMX reporter.
   [junit4]   2> 2178880 INFO  (TEST-FullSolrCloudDistribCmdsTest.test-seed#[42F7B56EFB5076C2]) [    ] o.a.s.c.ZkContainer Zookeeper client=127.0.0.1:60457/solr
   [junit4]   2> 2178906 INFO  (TEST-FullSolrCloudDistribCmdsTest.test-seed#[42F7B56EFB5076C2]) [n:127.0.0.1:60484_    ] o.a.s.c.c.ZkStateReader Updated live nodes from ZooKeeper... (0) -> (4)
   [junit4]   2> 2178913 INFO  (TEST-FullSolrCloudDistribCmdsTest.test-seed#[42F7B56EFB5076C2]) [n:127.0.0.1:60484_    ] o.a.s.c.Overseer Overseer (id=null) closing
   [junit4]   2> 2178919 INFO  (TEST-FullSolrCloudDistribCmdsTest.test-seed#[42F7B56EFB5076C2]) [n:127.0.0.1:60484_    ] o.a.s.c.ZkController Register node as live in ZooKeeper:/live_nodes/127.0.0.1:60484_
   [junit4]   2> 2178923 INFO  (zkCallback-2155-thread-1) [    ] o.a.s.c.c.ZkStateReader Updated live nodes from ZooKeeper... (4) -> (5)
   [junit4]   2> 2178924 INFO  (zkCallback-2179-thread-1-processing-n:127.0.0.1:60484_) [n:127.0.0.1:60484_    ] o.a.s.c.c.ZkStateReader Updated live nodes from ZooKeeper... (4) -> (5)
   [junit4]   2> 2178925 INFO  (zkCallback-2173-thread-1-processing-n:127.0.0.1:60480_) [n:127.0.0.1:60480_    ] o.a.s.c.c.ZkStateReader Updated live nodes from ZooKeeper... (4) -> (5)
   [junit4]   2> 2178923 INFO  (zkCallback-2167-thread-1-processing-n:127.0.0.1:60476_) [n:127.0.0.1:60476_    ] o.a.s.c.c.ZkStateReader Updated live nodes from ZooKeeper... (4) -> (5)
   [junit4]   2> 2178925 INFO  (zkCallback-2161-thread-1-processing-n:127.0.0.1:60466_) [n:127.0.0.1:60466_    ] o.a.s.c.c.ZkStateReader Updated live nodes from ZooKeeper... (4) -> (5)
   [junit4]   2> 2178925 INFO  (zkCallback-2151-thread-1-processing-n:127.0.0.1:60460_) [n:127.0.0.1:60460_    ] o.a.s.c.c.ZkStateReader Updated live nodes from ZooKeeper... (4) -> (5)
   [junit4]   2> 2179108 INFO  (TEST-FullSolrCloudDistribCmdsTest.test-seed#[42F7B56EFB5076C2]) [n:127.0.0.1:60484_    ] o.a.s.m.r.SolrJmxReporter JMX monitoring for 'solr.node' (registry 'solr.node') enabled at server: com.sun.jmx.mbeanserver.JmxMBeanServer@64048510
   [junit4]   2> 2179118 INFO  (TEST-FullSolrCloudDistribCmdsTest.test-seed#[42F7B56EFB5076C2]) [n:127.0.0.1:60484_    ] o.a.s.m.r.SolrJmxReporter JMX monitoring for 'solr.jvm' (registry 'solr.jvm') enabled at server: com.sun.jmx.mbeanserver.JmxMBeanServer@64048510
   [junit4]   2> 2179118 INFO  (TEST-FullSolrCloudDistribCmdsTest.test-seed#[42F7B56EFB5076C2]) [n:127.0.0.1:60484_    ] o.a.s.m.r.SolrJmxReporter JMX monitoring for 'solr.jetty' (registry 'solr.jetty') enabled at server: com.sun.jmx.mbeanserver.JmxMBeanServer@64048510
   [junit4]   2> 2179122 INFO  (TEST-FullSolrCloudDistribCmdsTest.test-seed#[42F7B56EFB5076C2]) [n:127.0.0.1:60484_    ] o.a.s.c.CorePropertiesLocator Found 1 core definitions underneath /Users/jenkins/workspace/Lucene-Solr-master-MacOSX/solr/build/solr-core/test/J0/../../../../../../../../../Users/jenkins/workspace/Lucene-Solr-master-MacOSX/solr/build/solr-core/test/J0/temp/solr.cloud.FullSolrCloudDistribCmdsTest_42F7B56EFB5076C2-001/shard-4-001/cores
   [junit4]   2> 2179122 INFO  (TEST-FullSolrCloudDistribCmdsTest.test-seed#[42F7B56EFB5076C2]) [n:127.0.0.1:60484_    ] o.a.s.c.CorePropertiesLocator Cores are: [collection1]
   [junit4]   2> 2179124 INFO  (coreLoadExecutor-5892-thread-1-processing-n:127.0.0.1:60484_) [n:127.0.0.1:60484_ c:collection1   x:collection1] o.a.s.c.TransientSolrCoreCacheDefault Allocating transient cache for 4 transient cores
   [junit4]   2> 2179128 INFO  (OverseerStateUpdate-97955551298191364-127.0.0.1:60460_-n_0000000000) [n:127.0.0.1:60460_    ] o.a.s.c.o.ReplicaMutator Assigning new node to shard shard=shard2
   [junit4]   2> 2179236 INFO  (zkCallback-2167-thread-1-processing-n:127.0.0.1:60476_) [n:127.0.0.1:60476_    ] o.a.s.c.c.ZkStateReader A cluster state change: [WatchedEvent state:SyncConnected type:NodeDataChanged path:/collections/collection1/state.json] for collection [collection1] has occurred - updating... (live nodes size: [5])
   [junit4]   2> 2179236 INFO  (zkCallback-2161-thread-1-processing-n:127.0.0.1:60466_) [n:127.0.0.1:60466_    ] o.a.s.c.c.ZkStateReader A cluster state change: [WatchedEvent state:SyncConnected type:NodeDataChanged path:/collections/collection1/state.json] for collection [collection1] has occurred - updating... (live nodes size: [5])
   [junit4]   2> 2179236 INFO  (zkCallback-2179-thread-1-processing-n:127.0.0.1:60484_) [n:127.0.0.1:60484_    ] o.a.s.c.c.ZkStateReader A cluster state change: [WatchedEvent state:SyncConnected type:NodeDataChanged path:/collections/collection1/state.json] for collection [collection1] has occurred - updating... (live nodes size: [5])
   [junit4]   2> 2179236 INFO  (zkCallback-2173-thread-1-processing-n:127.0.0.1:60480_) [n:127.0.0.1:60480_    ] o.a.s.c.c.ZkStateReader A cluster state change: [WatchedEvent state:SyncConnected type:NodeDataChanged path:/collections/collection1/state.json] for collection [collection1] has occurred - updating... (live nodes size: [5])
   [junit4]   2> 2180169 INFO  (coreLoadExecutor-5892-thread-1-processing-n:127.0.0.1:60484_) [n:127.0.0.1:60484_ c:collection1   x:collection1] o.a.s.c.SolrConfig Using Lucene MatchVersion: 7.0.0
   [junit4]   2> 2180203 INFO  (coreLoadExecutor-5892-thread-1-processing-n:127.0.0.1:60484_) [n:127.0.0.1:60484_ c:collection1   x:collection1] o.a.s.s.IndexSchema [collection1] Schema name=test
   [junit4]   2> 2180317 INFO  (coreLoadExecutor-5892-thread-1-processing-n:127.0.0.1:60484_) [n:127.0.0.1:60484_ c:collection1   x:collection1] o.a.s.s.IndexSchema Loaded schema test/1.6 with uniqueid field id
   [junit4]   2> 2180357 INFO  (coreLoadExecutor-5892-thread-1-processing-n:127.0.0.1:60484_) [n:127.0.0.1:60484_ c:collection1   x:collection1] o.a.s.c.CoreContainer Creating SolrCore 'collection1' using configuration from collection collection1, trusted=true
   [junit4]   2> 2180357 INFO  (coreLoadExecutor-5892-thread-1-processing-n:127.0.0.1:60484_) [n:127.0.0.1:60484_ c:collection1   x:collection1] o.a.s.m.r.SolrJmxReporter JMX monitoring for 'solr.core.collection1.shard2.core_node4' (registry 'solr.core.collection1.shard2.core_node4') enabled at server: com.sun.jmx.mbeanserver.JmxMBeanServer@64048510
   [junit4]   2> 2180357 INFO  (coreLoadExecutor-5892-thread-1-processing-n:127.0.0.1:60484_) [n:127.0.0.1:60484_ c:collection1   x:collection1] o.a.s.c.SolrCore solr.RecoveryStrategy.Builder
   [junit4]   2> 2180357 INFO  (coreLoadExecutor-5892-thread-1-processing-n:127.0.0.1:60484_) [n:127.0.0.1:60484_ c:collection1   x:collection1] o.a.s.c.SolrCore [[collection1] ] Opening new SolrCore at [/Users/jenkins/workspace/Lucene-Solr-master-MacOSX/solr/build/solr-core/test/J0/temp/solr.cloud.FullSolrCloudDistribCmdsTest_42F7B56EFB5076C2-001/shard-4-001/cores/collection1], dataDir=[/Users/jenkins/workspace/Lucene-Solr-master-MacOSX/solr/build/solr-core/test/J0/../../../../../../../../../Users/jenkins/workspace/Lucene-Solr-master-MacOSX/solr/build/solr-core/test/J0/temp/solr.cloud.FullSolrCloudDistribCmdsTest_42F7B56EFB5076C2-001/shard-4-001/cores/collection1/data/]
   [junit4]   2> 2180360 INFO  (coreLoadExecutor-5892-thread-1-processing-n:127.0.0.1:60484_) [n:127.0.0.1:60484_ c:collection1   x:collection1] o.a.s.u.RandomMergePolicy RandomMergePolicy wrapping class org.apache.lucene.index.TieredMergePolicy: [TieredMergePolicy: maxMergeAtOnce=50, maxMergeAtOnceExplicit=46, maxMergedSegmentMB=69.5166015625, floorSegmentMB=0.8525390625, forceMergeDeletesPctAllowed=10.29656691783481, segmentsPerTier=26.0, maxCFSSegmentSizeMB=8.796093022207999E12, noCFSRatio=0.0
   [junit4]   2> 2180365 WARN  (coreLoadExecutor-5892-thread-1-processing-n:127.0.0.1:60484_) [n:127.0.0.1:60484_ c:collection1   x:collection1] o.a.s.c.RequestHandlers INVALID paramSet a in requestHandler {type = requestHandler,name = /dump,class = DumpRequestHandler,attributes = {initParams=a, name=/dump, class=DumpRequestHandler},args = {defaults={a=A,b=B}}}
   [junit4]   2> 2180470 INFO  (coreLoadExecutor-5892-thread-1-processing-n:127.0.0.1:60484_) [n:127.0.0.1:60484_ c:collection1   x:collection1] o.a.s.u.UpdateHandler Using UpdateLog implementation: org.apache.solr.update.UpdateLog
   [junit4]   2> 2180470 INFO  (coreLoadExecutor-5892-thread-1-processing-n:127.0.0.1:60484_) [n:127.0.0.1:60484_ c:collection1   x:collection1] o.a.s.u.UpdateLog Initializing UpdateLog: dataDir= defaultSyncLevel=FLUSH numRecordsToKeep=100 maxNumLogsToKeep=10 numVersionBuckets=65536
   [junit4]   2> 2180473 INFO  (coreLoadExecutor-5892-thread-1-processing-n:127.0.0.1:60484_) [n:127.0.0.1:60484_ c:collection1   x:collection1] o.a.s.u.CommitTracker Hard AutoCommit: disabled
   [junit4]   2> 2180474 INFO  (coreLoadExecutor-5892-thread-1-processing-n:127.0.0.1:60484_) [n:127.0.0.1:60484_ c:collection1   x:collection1] o.a.s.u.CommitTracker Soft AutoCommit: disabled
   [junit4]   2> 2180475 INFO  (coreLoadExecutor-5892-thread-1-processing-n:127.0.0.1:60484_) [n:127.0.0.1:60484_ c:collection1   x:collection1] o.a.s.u.RandomMergePolicy RandomMergePolicy wrapping class org.apache.lucene.index.LogDocMergePolicy: [LogDocMergePolicy: minMergeSize=1000, mergeFactor=24, maxMergeSize=9223372036854775807, maxMergeSizeForForcedMerge=9223372036854775807, calibrateSizeByDeletes=true, maxMergeDocs=2147483647, maxCFSSegmentSizeMB=8.796093022207999E12, noCFSRatio=1.0]
   [junit4]   2> 2180476 INFO  (coreLoadExecutor-5892-thread-1-processing-n:127.0.0.1:60484_) [n:127.0.0.1:60484_ c:collection1   x:collection1] o.a.s.s.SolrIndexSearcher Opening [Searcher@bedcdfa[collection1] main]
   [junit4]   2> 2180478 INFO  (coreLoadExecutor-5892-thread-1-processing-n:127.0.0.1:60484_) [n:127.0.0.1:60484_ c:collection1   x:collection1] o.a.s.r.ManagedResourceStorage Configured ZooKeeperStorageIO with znodeBase: /configs/conf1
   [junit4]   2> 2180479 INFO  (coreLoadExecutor-5892-thread-1-processing-n:127.0.0.1:60484_) [n:127.0.0.1:60484_ c:collection1   x:collection1] o.a.s.r.ManagedResourceStorage Loaded null at path _rest_managed.json using ZooKeeperStorageIO:path=/configs/conf1
   [junit4]   2> 2180480 INFO  (coreLoadExecutor-5892-thread-1-processing-n:127.0.0.1:60484_) [n:127.0.0.1:60484_ c:collection1   x:collection1] o.a.s.h.ReplicationHandler Commits will be reserved for  10000
   [junit4]   2> 2180481 INFO  (coreLoadExecutor-5892-thread-1-processing-n:127.0.0.1:60484_) [n:127.0.0.1:60484_ c:collection1   x:collection1] o.a.s.u.UpdateLog Could not find max version in index or recent updates, using new clock 1567288837388894208
   [junit4]   2> 2180482 INFO  (searcherExecutor-5893-thread-1-processing-n:127.0.0.1:60484_ x:collection1 c:collection1) [n:127.0

[...truncated too long message...]

RepeatRule$ShardsFixedStatement.callStatement(BaseDistributedSearchTestCase.java:985)
   [junit4]    > 	at org.apache.solr.BaseDistributedSearchTestCase$ShardsRepeatRule$ShardsStatement.evaluate(BaseDistributedSearchTestCase.java:960)
   [junit4]    > 	at java.lang.Thread.run(Thread.java:748)
   [junit4]   2> 2243587 INFO  (SUITE-FullSolrCloudDistribCmdsTest-seed#[42F7B56EFB5076C2]-worker) [    ] o.a.s.SolrTestCaseJ4 ###deleteCore
   [junit4]   2> NOTE: leaving temporary files on disk at: /Users/jenkins/workspace/Lucene-Solr-master-MacOSX/solr/build/solr-core/test/J0/temp/solr.cloud.FullSolrCloudDistribCmdsTest_42F7B56EFB5076C2-001
   [junit4]   2> NOTE: test params are: codec=Asserting(Lucene70): {6grand2_s=PostingsFormat(name=LuceneVarGapFixedInterval), 7grand5_s=BlockTreeOrds(blocksize=128), 4grand0_s=PostingsFormat(name=LuceneVarGapFixedInterval), 7grand1_s=BlockTreeOrds(blocksize=128), 9grand7_s=PostingsFormat(name=LuceneVarGapFixedInterval), 8grand0_s=PostingsFormat(name=LuceneVarGapFixedInterval), 9grand3_s=PostingsFormat(name=LuceneVarGapFixedInterval), 6parent_f2_s=FST50, 8grand4_s=PostingsFormat(name=LuceneVarGapFixedInterval), 0parent_f2_s=PostingsFormat(name=Memory), 3grand1_s=BlockTreeOrds(blocksize=128), 4parent_f1_s=BlockTreeOrds(blocksize=128), 11grand10_s=FST50, 5child3_s=PostingsFormat(name=LuceneVarGapFixedInterval), 9parent_f2_s=BlockTreeOrds(blocksize=128), a_t=BlockTreeOrds(blocksize=128), 6child2_s=BlockTreeOrds(blocksize=128), id=FST50, 5grand3_s=BlockTreeOrds(blocksize=128), 1parent_f1_s=FST50, 6child1_s=FST50, _root_=PostingsFormat(name=LuceneVarGapFixedInterval), 5child2_s=FST50, 3child0_s=FST50, 4child3_s=FST50, 1grand0_s=PostingsFormat(name=Memory), 11grand2_s=BlockTreeOrds(blocksize=128), 11grand6_s=BlockTreeOrds(blocksize=128), 10grand7_s=PostingsFormat(name=LuceneVarGapFixedInterval), 7parent_f1_s=PostingsFormat(name=Memory), 2child1_s=FST50, 3parent_f2_s=PostingsFormat(name=LuceneVarGapFixedInterval), 10grand3_s=PostingsFormat(name=LuceneVarGapFixedInterval), 6grand3_s=PostingsFormat(name=Memory), 5grand2_s=FST50, 10grand9_s=BlockTreeOrds(blocksize=128), 4grand1_s=PostingsFormat(name=Memory), 11parent_f2_s=PostingsFormat(name=Memory), 7grand4_s=FST50, 3grand0_s=FST50, 9grand6_s=FST50, 8grand1_s=PostingsFormat(name=Memory), 9grand2_s=FST50, 8grand5_s=PostingsFormat(name=Memory), 9parent_f1_s=FST50, 1parent_f2_s=BlockTreeOrds(blocksize=128), 6child3_s=PostingsFormat(name=Memory), 7grand0_s=FST50, text_t=PostingsFormat(name=LuceneVarGapFixedInterval), type_s=PostingsFormat(name=LuceneVarGapFixedInterval), 5child1_s=BlockTreeOrds(blocksize=128), 10parent_f1_s=PostingsFormat(name=Memory), 11grand1_s=PostingsFormat(name=Memory), 10grand0_s=FST50, 4child0_s=BlockTreeOrds(blocksize=128), 11grand5_s=PostingsFormat(name=Memory), 10grand8_s=FST50, 10grand4_s=FST50, 5grand1_s=PostingsFormat(name=LuceneVarGapFixedInterval), 6grand4_s=BlockTreeOrds(blocksize=128), 11parent_f1_s=PostingsFormat(name=LuceneVarGapFixedInterval), 4grand2_s=BlockTreeOrds(blocksize=128), 7grand3_s=PostingsFormat(name=LuceneVarGapFixedInterval), 11grand9_s=PostingsFormat(name=Memory), 8grand2_s=BlockTreeOrds(blocksize=128), 9grand5_s=BlockTreeOrds(blocksize=128), 8grand6_s=BlockTreeOrds(blocksize=128), 9grand1_s=BlockTreeOrds(blocksize=128), 6child4_s=PostingsFormat(name=LuceneVarGapFixedInterval), 5parent_f1_s=FST50, 6grand0_s=BlockTreeOrds(blocksize=128), 10parent_f2_s=BlockTreeOrds(blocksize=128), 5child0_s=PostingsFormat(name=Memory), 8parent_f1_s=BlockTreeOrds(blocksize=128), 2parent_f2_s=FST50, 11grand0_s=PostingsFormat(name=LuceneVarGapFixedInterval), 4child1_s=PostingsFormat(name=Memory), 2grand1_s=FST50, 11grand4_s=PostingsFormat(name=LuceneVarGapFixedInterval), 3child2_s=PostingsFormat(name=Memory), 10grand5_s=BlockTreeOrds(blocksize=128), 1child0_s=PostingsFormat(name=Memory), 10grand1_s=BlockTreeOrds(blocksize=128), 7grand6_s=PostingsFormat(name=Memory), 5grand0_s=PostingsFormat(name=Memory), 6grand5_s=FST50, 7grand2_s=PostingsFormat(name=Memory), 4grand3_s=FST50, 9grand8_s=PostingsFormat(name=Memory), 11grand8_s=PostingsFormat(name=LuceneVarGapFixedInterval), 8grand3_s=FST50, 6parent_f1_s=PostingsFormat(name=LuceneVarGapFixedInterval), 9grand4_s=PostingsFormat(name=Memory), 8grand7_s=FST50, 0parent_f1_s=BlockTreeOrds(blocksize=128), 3grand2_s=PostingsFormat(name=Memory), 9grand0_s=PostingsFormat(name=Memory), 4parent_f2_s=PostingsFormat(name=Memory), 5child4_s=PostingsFormat(name=Memory), 6child5_s=FST50, 5grand4_s=PostingsFormat(name=Memory), 6grand1_s=FST50, 5parent_f2_s=BlockTreeOrds(blocksize=128), 6child0_s=PostingsFormat(name=LuceneVarGapFixedInterval), 8parent_f2_s=PostingsFormat(name=Memory), 2parent_f1_s=PostingsFormat(name=LuceneVarGapFixedInterval), 4child2_s=PostingsFormat(name=LuceneVarGapFixedInterval), rnd_b=FST50, 11grand3_s=FST50, 2grand0_s=PostingsFormat(name=LuceneVarGapFixedInterval), 11grand7_s=FST50, 3child1_s=BlockTreeOrds(blocksize=128), 10grand6_s=PostingsFormat(name=Memory), 7parent_f2_s=PostingsFormat(name=LuceneVarGapFixedInterval), 10grand2_s=PostingsFormat(name=Memory), 2child0_s=BlockTreeOrds(blocksize=128), 3parent_f1_s=PostingsFormat(name=Memory)}, docValues:{_version_=DocValuesFormat(name=Asserting)}, maxPointsInLeafNode=811, maxMBSortInHeap=6.429336594497687, sim=RandomSimilarity(queryNorm=true): {}, locale=ar-YE, timezone=Europe/Warsaw
   [junit4]   2> NOTE: Mac OS X 10.11.6 x86_64/Oracle Corporation 1.8.0_131 (64-bit)/cpus=3,threads=1,free=69071208,total=467664896
   [junit4]   2> NOTE: All tests run in this JVM: [ResourceLoaderTest, SynonymTokenizerTest, HdfsNNFailoverTest, TestSurroundQueryParser, TestUpdate, SubstringBytesRefFilterTest, TestSolrCloudWithHadoopAuthPlugin, CdcrUpdateLogTest, AssignTest, TestUniqueKeyFieldResource, DirectSolrSpellCheckerTest, BufferStoreTest, TestCopyFieldCollectionResource, SolrRequestParserTest, HdfsRecoveryZkTest, TestConfigSetsAPIZkFailure, TestXIncludeConfig, CurrencyFieldXmlFileTest, BitVectorTest, SpellCheckCollatorWithCollapseTest, ShufflingReplicaListTransformerTest, SOLR749Test, TestReloadDeadlock, TestCollationField, TestNamedUpdateProcessors, CoreAdminRequestStatusTest, TestInfoStreamLogging, AnalyticsMergeStrategyTest, AlternateDirectoryTest, MergeStrategyTest, SolrCoreTest, DocumentBuilderTest, SmileWriterTest, TestLazyCores, BaseCdcrDistributedZkTest, ZkNodePropsTest, TestCharFilters, TestJavabinTupleStreamParser, ZkStateWriterTest, VersionInfoTest, PreAnalyzedFieldManagedSchemaCloudTest, LeaderFailoverAfterPartitionTest, TestFieldTypeResource, TestManagedSchemaThreadSafety, DistributedSuggestComponentTest, TestPivotHelperCode, TestDistributedStatsComponentCardinality, UniqFieldsUpdateProcessorFactoryTest, TestMaxScoreQueryParser, TestSweetSpotSimilarityFactory, TestRebalanceLeaders, ShardRoutingTest, TestDynamicLoading, ZkCLITest, DirectUpdateHandlerTest, TestIntervalFaceting, SimpleMLTQParserTest, PluginInfoTest, DisMaxRequestHandlerTest, CdcrReplicationDistributedZkTest, ClassificationUpdateProcessorTest, TestLeaderElectionZkExpiry, TestRemoteStreaming, TestBulkSchemaConcurrent, TestClusterStateMutator, TestNRTOpen, DirectSolrConnectionTest, TestTolerantUpdateProcessorCloud, TestPhraseSuggestions, DocValuesTest, ClusterStateUpdateTest, SolrJmxReporterTest, ResponseHeaderTest, TestRandomCollapseQParserPlugin, TestInitQParser, TestBlendedInfixSuggestions, TestCloudNestedDocsSort, BooleanFieldTest, FastVectorHighlighterTest, TestScoreJoinQPNoScore, DistributedQueueTest, TestExtendedDismaxParser, TestReplicationHandlerBackup, TestMergePolicyConfig, TestSolrDeletionPolicy1, TestRequestForwarding, RecoveryAfterSoftCommitTest, TestAuthorizationFramework, MultiTermTest, TestCollationFieldDocValues, TestSolrQueryParserDefaultOperatorResource, TestLegacyFieldCache, SolrMetricReporterTest, TestRTGBase, DeleteLastCustomShardedReplicaTest, MigrateRouteKeyTest, SuggestComponentContextFilterQueryTest, ConnectionManagerTest, OpenExchangeRatesOrgProviderTest, TestCSVLoader, SampleTest, TestClusterProperties, SolrCLIZkUtilsTest, PeerSyncTest, ExitableDirectoryReaderTest, NodeMutatorTest, TestGraphTermsQParserPlugin, OverseerRolesTest, TestDeleteCollectionOnDownNodes, ActionThrottleTest, BlockJoinFacetSimpleTest, AddBlockUpdateTest, TestJsonRequest, TestSolrQueryResponse, DistributedFacetPivotLongTailTest, LeaderInitiatedRecoveryOnCommitTest, SolrIndexConfigTest, TestStressInPlaceUpdates, TestConfigsApi, PingRequestHandlerTest, TestPseudoReturnFields, TestIBSimilarityFactory, TestFieldSortValues, TestLocalFSCloudBackupRestore, ParsingFieldUpdateProcessorsTest, TestSchemaVersionResource, TestDefaultStatsCache, TestSolrCloudSnapshots, JvmMetricsTest, TestWordDelimiterFilterFactory, HdfsBasicDistributedZkTest, IndexSchemaRuntimeFieldTest, TestSolrConfigHandler, HdfsLockFactoryTest, HdfsChaosMonkeySafeLeaderTest, TestPartialUpdateDeduplication, TestStressLucene, TestSystemIdResolver, TestBulkSchemaAPI, TestGroupingSearch, PolyFieldTest, TestConfigSetsAPI, TestSimpleQParserPlugin, HdfsWriteToMultipleCollectionsTest, LeaderElectionTest, UUIDUpdateProcessorFallbackTest, TestMacros, TestHighlightDedupGrouping, JsonValidatorTest, DistributedSpellCheckComponentTest, SegmentsInfoRequestHandlerTest, TestExactSharedStatsCache, BigEndianAscendingWordDeserializerTest, SpellingQueryConverterTest, TestRawResponseWriter, UnloadDistributedZkTest, TestHdfsUpdateLog, TestManagedResourceStorage, TestDelegationWithHadoopAuth, NumericFieldsTest, TestReplicationHandler, TestMinMaxOnMultiValuedField, TestDFISimilarityFactory, IndexBasedSpellCheckerTest, BlockCacheTest, DistributedFacetPivotSmallTest, OverseerTaskQueueTest, MoveReplicaTest, PropertiesRequestHandlerTest, TestSchemaManager, CdcrRequestHandlerTest, MetricUtilsTest, QueryElevationComponentTest, LeaderElectionIntegrationTest, BasicZkTest, RecoveryZkTest, FullSolrCloudDistribCmdsTest]
   [junit4] Completed [365/710 (1!)] on J0 in 79.00s, 1 test, 1 failure <<< FAILURES!

[...truncated 44542 lines...]