You are viewing a plain text version of this content. The canonical link for it is here.
Posted to commits@beam.apache.org by Apache Jenkins Server <je...@builds.apache.org> on 2018/06/22 12:14:14 UTC
Build failed in Jenkins: beam_PostCommit_Py_ValCont #76
See <https://builds.apache.org/job/beam_PostCommit_Py_ValCont/76/display/redirect?page=changes>
Changes:
[iemejia] Fix errorprone warnings on extensions/google-cloud-platform-core module
[iemejia] Enable errorprone globally
------------------------------------------
Started by GitHub push by iemejia
[EnvInject] - Loading node environment variables.
Building remotely on beam7 (beam) in workspace <https://builds.apache.org/job/beam_PostCommit_Py_ValCont/ws/>
> git rev-parse --is-inside-work-tree # timeout=10
Fetching changes from the remote Git repository
> git config remote.origin.url https://github.com/apache/beam.git # timeout=10
Fetching upstream changes from https://github.com/apache/beam.git
> git --version # timeout=10
> git fetch --tags --progress https://github.com/apache/beam.git +refs/heads/*:refs/remotes/origin/* +refs/pull/${ghprbPullId}/*:refs/remotes/origin/pr/${ghprbPullId}/*
> git rev-parse origin/master^{commit} # timeout=10
Checking out Revision d75365eeeff8d8b3fc6c97e582854ddcc9da49b6 (origin/master)
> git config core.sparsecheckout # timeout=10
> git checkout -f d75365eeeff8d8b3fc6c97e582854ddcc9da49b6
Commit message: "Merge pull request #5716: Enable errorprone globally"
> git rev-list --no-walk 0fbbf82e395cbce6fab0d2b5be1b48b083617ba2 # timeout=10
Cleaning workspace
> git rev-parse --verify HEAD # timeout=10
Resetting working tree
> git reset --hard # timeout=10
> git clean -fdx # timeout=10
[EnvInject] - Executing scripts and injecting environment variables after the SCM step.
[EnvInject] - Injecting as environment variables the properties content
SPARK_LOCAL_IP=127.0.0.1
[EnvInject] - Variables injected successfully.
[beam_PostCommit_Py_ValCont] $ /bin/bash -xe /tmp/jenkins2818286934001238263.sh
+ cd src
+ bash sdks/python/container/run_validatescontainer.sh
# Where to store integration test outputs.
GCS_LOCATION=gs://temp-storage-for-end-to-end-tests
# Project for the container and integration test
PROJECT=apache-beam-testing
# Verify in the root of the repository
test -d sdks/python/container
# Verify docker and gcloud commands exist
command -v docker
/usr/bin/docker
command -v gcloud
/usr/bin/gcloud
docker -v
Docker version 17.05.0-ce, build 89658be
gcloud -v
Google Cloud SDK 191.0.0
alpha 2018.02.23
beta 2018.02.23
bq 2.0.29
core 2018.02.23
gsutil 4.28
# Build the container
TAG=$(date +%Y%m%d-%H%M%S)
date +%Y%m%d-%H%M%S
CONTAINER=us.gcr.io/$PROJECT/$USER/python
echo "Using container $CONTAINER"
Using container us.gcr.io/apache-beam-testing/jenkins/python
./gradlew :beam-sdks-python-container:docker -Pdocker-repository-root=us.gcr.io/$PROJECT/$USER -Pdocker-tag=$TAG
Parallel execution is an incubating feature.
> Task :buildSrc:compileJava NO-SOURCE
> Task :buildSrc:compileGroovy
> Task :buildSrc:processResources NO-SOURCE
> Task :buildSrc:classes
> Task :buildSrc:jar
> Task :buildSrc:assemble
> Task :buildSrc:spotlessGroovy
> Task :buildSrc:spotlessGroovyCheck
> Task :buildSrc:spotlessGroovyGradle
> Task :buildSrc:spotlessGroovyGradleCheck
> Task :buildSrc:spotlessCheck
> Task :buildSrc:compileTestJava NO-SOURCE
> Task :buildSrc:compileTestGroovy NO-SOURCE
> Task :buildSrc:processTestResources NO-SOURCE
> Task :buildSrc:testClasses UP-TO-DATE
> Task :buildSrc:test NO-SOURCE
> Task :buildSrc:check
> Task :buildSrc:build
Parallel execution with configuration on demand is an incubating feature.
> Configure project :
Applying BeamModulePlugin to beam
createPerformanceTestHarness with default configuration for project beam
Adding 48 .gitignore exclusions to Apache Rat
> Configure project :beam-sdks-python-container
Applying BeamModulePlugin to beam-sdks-python-container
applyGoNature with default configuration for project beam-sdks-python-container
applyDockerNature with default configuration for project beam-sdks-python-container
containerImageName with [name:python] for project beam-sdks-python-container
Project evaluation failed including an error in afterEvaluate {}. Run with --stacktrace for details of the afterEvaluate {} error.
FAILURE: Build failed with an exception.
* Where:
Build file '<https://builds.apache.org/job/beam_PostCommit_Py_ValCont/ws/src/sdks/python/container/build.gradle'> line: 61
* What went wrong:
A problem occurred evaluating project ':beam-sdks-python-container'.
> No such property: rootProject for class: org.apache.beam.gradle.BeamModulePlugin
* Try:
Run with --stacktrace option to get the stack trace. Run with --info or --debug option to get more log output. Run with --scan to get full insights.
* Get more help at https://help.gradle.org
Deprecated Gradle features were used in this build, making it incompatible with Gradle 5.0.
See https://docs.gradle.org/4.8/userguide/command_line_interface.html#sec:command_line_warnings
BUILD FAILED in 13s
Publishing build scan...
https://gradle.com/s/2d4fvq6zjkmxq
Build step 'Execute shell' marked build as failure
Not sending mail to unregistered user apilloud@google.com
Not sending mail to unregistered user katarzyna.kucharczyk@polidea.com
Not sending mail to unregistered user amaliujia@163.com
Not sending mail to unregistered user migryz@google.com
Not sending mail to unregistered user github@alasdairhodge.co.uk
Not sending mail to unregistered user marek.simunek@firma.seznam.cz
Not sending mail to unregistered user lukasz.gajowy@polidea.com
Not sending mail to unregistered user sourabhbajaj@google.com
Not sending mail to unregistered user mergebot@apache.org
Not sending mail to unregistered user mariagh@mariagh.svl.corp.google.com
Not sending mail to unregistered user thomas.haines@practiceinsight.io
Not sending mail to unregistered user axelmagn@gmail.com
Not sending mail to unregistered user ddonnelly@google.com
Not sending mail to unregistered user ehudm@google.com
Not sending mail to unregistered user relax@relax-macbookpro2.roam.corp.google.com
Not sending mail to unregistered user devon.meunier@shopify.com
Not sending mail to unregistered user timrobertson100@gmail.com
Not sending mail to unregistered user kirpichov@google.com
Not sending mail to unregistered user cademarkegard@gmail.com
Not sending mail to unregistered user ekirpichov@gmail.com
Not sending mail to unregistered user basti.lj@alibaba-inc.com
Not sending mail to unregistered user mrtn@nrd.io
Not sending mail to unregistered user rober@frantil.com
Not sending mail to unregistered user jiangkai@gmail.com
Not sending mail to unregistered user valentyn@google.com
Not sending mail to unregistered user aaltay@gmail.com
Not sending mail to unregistered user azur@paypal.com
Not sending mail to unregistered user jamalone@gmail.com
Not sending mail to unregistered user terrencehan@tencent.com
Not sending mail to unregistered user hadarh@google.com
Not sending mail to unregistered user melissapa@google.com
Not sending mail to unregistered user fjp@google.com
Not sending mail to unregistered user klk@google.com
Not sending mail to unregistered user pgerver@us.ibm.com
Not sending mail to unregistered user jasonkuster@google.com
Not sending mail to unregistered user aljoscha.krettek@gmail.com
Not sending mail to unregistered user aromanenko.dev@gmail.com
Not sending mail to unregistered user mairbek@google.com
Not sending mail to unregistered user taro.murao@gmail.com
Not sending mail to unregistered user swegner@google.com
Not sending mail to unregistered user ankurgoenka@gmail.com
Not sending mail to unregistered user wnsdud1861@gmail.com
Not sending mail to unregistered user peihe0@gmail.com
Not sending mail to unregistered user sisk@google.com
Jenkins build is back to normal : beam_PostCommit_Py_ValCont #84
Posted by Apache Jenkins Server <je...@builds.apache.org>.
See <https://builds.apache.org/job/beam_PostCommit_Py_ValCont/84/display/redirect?page=changes>
Build failed in Jenkins: beam_PostCommit_Py_ValCont #83
Posted by Apache Jenkins Server <je...@builds.apache.org>.
See <https://builds.apache.org/job/beam_PostCommit_Py_ValCont/83/display/redirect?page=changes>
Changes:
[migryz] [BEAM-4559] Add latest post-commit tests status to GH PR
------------------------------------------
[...truncated 150.50 KB...]
copying apache_beam/runners/worker/statesampler_fast.pxd -> apache-beam-2.6.0.dev0/apache_beam/runners/worker
copying apache_beam/runners/worker/statesampler_fast.pyx -> apache-beam-2.6.0.dev0/apache_beam/runners/worker
copying apache_beam/runners/worker/statesampler_slow.py -> apache-beam-2.6.0.dev0/apache_beam/runners/worker
copying apache_beam/runners/worker/statesampler_test.py -> apache-beam-2.6.0.dev0/apache_beam/runners/worker
copying apache_beam/runners/worker/worker_id_interceptor.py -> apache-beam-2.6.0.dev0/apache_beam/runners/worker
copying apache_beam/runners/worker/worker_id_interceptor_test.py -> apache-beam-2.6.0.dev0/apache_beam/runners/worker
copying apache_beam/testing/__init__.py -> apache-beam-2.6.0.dev0/apache_beam/testing
copying apache_beam/testing/pipeline_verifiers.py -> apache-beam-2.6.0.dev0/apache_beam/testing
copying apache_beam/testing/pipeline_verifiers_test.py -> apache-beam-2.6.0.dev0/apache_beam/testing
copying apache_beam/testing/test_pipeline.py -> apache-beam-2.6.0.dev0/apache_beam/testing
copying apache_beam/testing/test_pipeline_test.py -> apache-beam-2.6.0.dev0/apache_beam/testing
copying apache_beam/testing/test_stream.py -> apache-beam-2.6.0.dev0/apache_beam/testing
copying apache_beam/testing/test_stream_test.py -> apache-beam-2.6.0.dev0/apache_beam/testing
copying apache_beam/testing/test_utils.py -> apache-beam-2.6.0.dev0/apache_beam/testing
copying apache_beam/testing/test_utils_test.py -> apache-beam-2.6.0.dev0/apache_beam/testing
copying apache_beam/testing/util.py -> apache-beam-2.6.0.dev0/apache_beam/testing
copying apache_beam/testing/util_test.py -> apache-beam-2.6.0.dev0/apache_beam/testing
copying apache_beam/testing/data/standard_coders.yaml -> apache-beam-2.6.0.dev0/apache_beam/testing/data
copying apache_beam/testing/data/trigger_transcripts.yaml -> apache-beam-2.6.0.dev0/apache_beam/testing/data
copying apache_beam/tools/__init__.py -> apache-beam-2.6.0.dev0/apache_beam/tools
copying apache_beam/tools/distribution_counter_microbenchmark.py -> apache-beam-2.6.0.dev0/apache_beam/tools
copying apache_beam/tools/map_fn_microbenchmark.py -> apache-beam-2.6.0.dev0/apache_beam/tools
copying apache_beam/tools/sideinput_microbenchmark.py -> apache-beam-2.6.0.dev0/apache_beam/tools
copying apache_beam/tools/utils.py -> apache-beam-2.6.0.dev0/apache_beam/tools
copying apache_beam/transforms/__init__.py -> apache-beam-2.6.0.dev0/apache_beam/transforms
copying apache_beam/transforms/combiners.py -> apache-beam-2.6.0.dev0/apache_beam/transforms
copying apache_beam/transforms/combiners_test.py -> apache-beam-2.6.0.dev0/apache_beam/transforms
copying apache_beam/transforms/core.py -> apache-beam-2.6.0.dev0/apache_beam/transforms
copying apache_beam/transforms/create_source.py -> apache-beam-2.6.0.dev0/apache_beam/transforms
copying apache_beam/transforms/create_test.py -> apache-beam-2.6.0.dev0/apache_beam/transforms
copying apache_beam/transforms/cy_combiners.pxd -> apache-beam-2.6.0.dev0/apache_beam/transforms
copying apache_beam/transforms/cy_combiners.py -> apache-beam-2.6.0.dev0/apache_beam/transforms
copying apache_beam/transforms/cy_dataflow_distribution_counter.pxd -> apache-beam-2.6.0.dev0/apache_beam/transforms
copying apache_beam/transforms/cy_dataflow_distribution_counter.pyx -> apache-beam-2.6.0.dev0/apache_beam/transforms
copying apache_beam/transforms/dataflow_distribution_counter_test.py -> apache-beam-2.6.0.dev0/apache_beam/transforms
copying apache_beam/transforms/display.py -> apache-beam-2.6.0.dev0/apache_beam/transforms
copying apache_beam/transforms/display_test.py -> apache-beam-2.6.0.dev0/apache_beam/transforms
copying apache_beam/transforms/ptransform.py -> apache-beam-2.6.0.dev0/apache_beam/transforms
copying apache_beam/transforms/ptransform_test.py -> apache-beam-2.6.0.dev0/apache_beam/transforms
copying apache_beam/transforms/py_dataflow_distribution_counter.py -> apache-beam-2.6.0.dev0/apache_beam/transforms
copying apache_beam/transforms/sideinputs.py -> apache-beam-2.6.0.dev0/apache_beam/transforms
copying apache_beam/transforms/sideinputs_test.py -> apache-beam-2.6.0.dev0/apache_beam/transforms
copying apache_beam/transforms/timeutil.py -> apache-beam-2.6.0.dev0/apache_beam/transforms
copying apache_beam/transforms/trigger.py -> apache-beam-2.6.0.dev0/apache_beam/transforms
copying apache_beam/transforms/trigger_test.py -> apache-beam-2.6.0.dev0/apache_beam/transforms
copying apache_beam/transforms/util.py -> apache-beam-2.6.0.dev0/apache_beam/transforms
copying apache_beam/transforms/util_test.py -> apache-beam-2.6.0.dev0/apache_beam/transforms
copying apache_beam/transforms/window.py -> apache-beam-2.6.0.dev0/apache_beam/transforms
copying apache_beam/transforms/window_test.py -> apache-beam-2.6.0.dev0/apache_beam/transforms
copying apache_beam/transforms/write_ptransform_test.py -> apache-beam-2.6.0.dev0/apache_beam/transforms
copying apache_beam/typehints/__init__.py -> apache-beam-2.6.0.dev0/apache_beam/typehints
copying apache_beam/typehints/decorators.py -> apache-beam-2.6.0.dev0/apache_beam/typehints
copying apache_beam/typehints/native_type_compatibility.py -> apache-beam-2.6.0.dev0/apache_beam/typehints
copying apache_beam/typehints/native_type_compatibility_test.py -> apache-beam-2.6.0.dev0/apache_beam/typehints
copying apache_beam/typehints/opcodes.py -> apache-beam-2.6.0.dev0/apache_beam/typehints
copying apache_beam/typehints/trivial_inference.py -> apache-beam-2.6.0.dev0/apache_beam/typehints
copying apache_beam/typehints/trivial_inference_test.py -> apache-beam-2.6.0.dev0/apache_beam/typehints
copying apache_beam/typehints/typecheck.py -> apache-beam-2.6.0.dev0/apache_beam/typehints
copying apache_beam/typehints/typed_pipeline_test.py -> apache-beam-2.6.0.dev0/apache_beam/typehints
copying apache_beam/typehints/typehints.py -> apache-beam-2.6.0.dev0/apache_beam/typehints
copying apache_beam/typehints/typehints_test.py -> apache-beam-2.6.0.dev0/apache_beam/typehints
copying apache_beam/utils/__init__.py -> apache-beam-2.6.0.dev0/apache_beam/utils
copying apache_beam/utils/annotations.py -> apache-beam-2.6.0.dev0/apache_beam/utils
copying apache_beam/utils/annotations_test.py -> apache-beam-2.6.0.dev0/apache_beam/utils
copying apache_beam/utils/counters.pxd -> apache-beam-2.6.0.dev0/apache_beam/utils
copying apache_beam/utils/counters.py -> apache-beam-2.6.0.dev0/apache_beam/utils
copying apache_beam/utils/counters_test.py -> apache-beam-2.6.0.dev0/apache_beam/utils
copying apache_beam/utils/plugin.py -> apache-beam-2.6.0.dev0/apache_beam/utils
copying apache_beam/utils/processes.py -> apache-beam-2.6.0.dev0/apache_beam/utils
copying apache_beam/utils/processes_test.py -> apache-beam-2.6.0.dev0/apache_beam/utils
copying apache_beam/utils/profiler.py -> apache-beam-2.6.0.dev0/apache_beam/utils
copying apache_beam/utils/proto_utils.py -> apache-beam-2.6.0.dev0/apache_beam/utils
copying apache_beam/utils/retry.py -> apache-beam-2.6.0.dev0/apache_beam/utils
copying apache_beam/utils/retry_test.py -> apache-beam-2.6.0.dev0/apache_beam/utils
copying apache_beam/utils/timestamp.py -> apache-beam-2.6.0.dev0/apache_beam/utils
copying apache_beam/utils/timestamp_test.py -> apache-beam-2.6.0.dev0/apache_beam/utils
copying apache_beam/utils/urns.py -> apache-beam-2.6.0.dev0/apache_beam/utils
copying apache_beam/utils/windowed_value.pxd -> apache-beam-2.6.0.dev0/apache_beam/utils
copying apache_beam/utils/windowed_value.py -> apache-beam-2.6.0.dev0/apache_beam/utils
copying apache_beam/utils/windowed_value_test.py -> apache-beam-2.6.0.dev0/apache_beam/utils
Writing apache-beam-2.6.0.dev0/setup.cfg
creating dist
Creating tar archive
removing 'apache-beam-2.6.0.dev0' (and everything under it)
SDK_LOCATION=$(find dist/apache-beam-*.tar.gz)
find dist/apache-beam-*.tar.gz
# Run ValidatesRunner tests on Google Cloud Dataflow service
echo ">>> RUNNING DATAFLOW RUNNER VALIDATESCONTAINER TEST"
>>> RUNNING DATAFLOW RUNNER VALIDATESCONTAINER TEST
python setup.py nosetests \
--attr ValidatesContainer \
--nocapture \
--processes=1 \
--process-timeout=900 \
--test-pipeline-options=" \
--runner=TestDataflowRunner \
--project=$PROJECT \
--worker_harness_container_image=$CONTAINER:$TAG \
--staging_location=$GCS_LOCATION/staging-validatesrunner-test \
--temp_location=$GCS_LOCATION/temp-validatesrunner-test \
--output=$GCS_LOCATION/output \
--sdk_location=$SDK_LOCATION \
--num_workers=1"
<https://builds.apache.org/job/beam_PostCommit_Py_ValCont/ws/src/sdks/python/container/local/lib/python2.7/site-packages/setuptools/dist.py>:398: UserWarning: Normalizing '2.6.0.dev' to '2.6.0.dev0'
normalized_version,
running nosetests
running egg_info
<https://builds.apache.org/job/beam_PostCommit_Py_ValCont/ws/src/sdks/python/gen_protos.py>:49: UserWarning: Installing grpcio-tools is recommended for development.
warnings.warn('Installing grpcio-tools is recommended for development.')
writing requirements to apache_beam.egg-info/requires.txt
writing apache_beam.egg-info/PKG-INFO
writing top-level names to apache_beam.egg-info/top_level.txt
writing dependency_links to apache_beam.egg-info/dependency_links.txt
writing entry points to apache_beam.egg-info/entry_points.txt
reading manifest file 'apache_beam.egg-info/SOURCES.txt'
reading manifest template 'MANIFEST.in'
warning: no files found matching 'README.md'
warning: no files found matching 'NOTICE'
warning: no files found matching 'LICENSE'
writing manifest file 'apache_beam.egg-info/SOURCES.txt'
<https://builds.apache.org/job/beam_PostCommit_Py_ValCont/ws/src/sdks/python/apache_beam/io/gcp/gcsio.py>:176: DeprecationWarning: object() takes no parameters
super(GcsIO, cls).__new__(cls, storage_client))
<https://builds.apache.org/job/beam_PostCommit_Py_ValCont/ws/src/sdks/python/apache_beam/runners/dataflow/test_dataflow_runner.py>:52: DeprecationWarning: options is deprecated since First stable release.. References to <pipeline>.options will not be supported
print('Found: %s.' % self.build_console_url(pipeline.options))
Found: https://console.cloud.google.com/dataflow/jobsDetail/locations/us-central1/jobs/2018-06-22_13_29_27-4232895933748976893?project=apache-beam-testing.
test_wordcount_fnapi_it (apache_beam.examples.wordcount_it_test.WordCountIT) ... ERROR
======================================================================
ERROR: test_wordcount_fnapi_it (apache_beam.examples.wordcount_it_test.WordCountIT)
----------------------------------------------------------------------
Traceback (most recent call last):
File "<https://builds.apache.org/job/beam_PostCommit_Py_ValCont/ws/src/sdks/python/container/local/lib/python2.7/site-packages/nose/plugins/multiprocess.py",> line 812, in run
test(orig)
File "<https://builds.apache.org/job/beam_PostCommit_Py_ValCont/ws/src/sdks/python/container/local/lib/python2.7/site-packages/nose/case.py",> line 45, in __call__
return self.run(*arg, **kwarg)
File "<https://builds.apache.org/job/beam_PostCommit_Py_ValCont/ws/src/sdks/python/container/local/lib/python2.7/site-packages/nose/case.py",> line 133, in run
self.runTest(result)
File "<https://builds.apache.org/job/beam_PostCommit_Py_ValCont/ws/src/sdks/python/container/local/lib/python2.7/site-packages/nose/case.py",> line 151, in runTest
test(result)
File "/usr/lib/python2.7/unittest/case.py", line 393, in __call__
return self.run(*args, **kwds)
File "/usr/lib/python2.7/unittest/case.py", line 329, in run
testMethod()
File "<https://builds.apache.org/job/beam_PostCommit_Py_ValCont/ws/src/sdks/python/apache_beam/examples/wordcount_it_test.py",> line 79, in test_wordcount_fnapi_it
on_success_matcher=PipelineStateMatcher()))
File "<https://builds.apache.org/job/beam_PostCommit_Py_ValCont/ws/src/sdks/python/apache_beam/examples/wordcount_fnapi.py",> line 128, in run
result = p.run()
File "<https://builds.apache.org/job/beam_PostCommit_Py_ValCont/ws/src/sdks/python/apache_beam/pipeline.py",> line 395, in run
self.to_runner_api(), self.runner, self._options).run(False)
File "<https://builds.apache.org/job/beam_PostCommit_Py_ValCont/ws/src/sdks/python/apache_beam/pipeline.py",> line 408, in run
return self.runner.run_pipeline(self)
File "<https://builds.apache.org/job/beam_PostCommit_Py_ValCont/ws/src/sdks/python/apache_beam/runners/dataflow/test_dataflow_runner.py",> line 67, in run_pipeline
self.wait_until_in_state(PipelineState.CANCELLED, timeout=300)
File "<https://builds.apache.org/job/beam_PostCommit_Py_ValCont/ws/src/sdks/python/apache_beam/runners/dataflow/test_dataflow_runner.py",> line 87, in wait_until_in_state
job_state = self.result.state
File "<https://builds.apache.org/job/beam_PostCommit_Py_ValCont/ws/src/sdks/python/apache_beam/runners/dataflow/dataflow_runner.py",> line 1069, in state
self._update_job()
File "<https://builds.apache.org/job/beam_PostCommit_Py_ValCont/ws/src/sdks/python/apache_beam/runners/dataflow/dataflow_runner.py",> line 1047, in _update_job
self._job = self._runner.dataflow_client.get_job(self.job_id())
File "<https://builds.apache.org/job/beam_PostCommit_Py_ValCont/ws/src/sdks/python/apache_beam/utils/retry.py",> line 184, in wrapper
return fun(*args, **kwargs)
File "<https://builds.apache.org/job/beam_PostCommit_Py_ValCont/ws/src/sdks/python/apache_beam/runners/dataflow/internal/apiclient.py",> line 624, in get_job
response = self._client.projects_locations_jobs.Get(request)
File "<https://builds.apache.org/job/beam_PostCommit_Py_ValCont/ws/src/sdks/python/apache_beam/runners/dataflow/internal/clients/dataflow/dataflow_v1b3_client.py",> line 656, in Get
config, request, global_params=global_params)
File "<https://builds.apache.org/job/beam_PostCommit_Py_ValCont/ws/src/sdks/python/container/local/lib/python2.7/site-packages/apitools/base/py/base_api.py",> line 720, in _RunMethod
http, http_request, **opts)
File "<https://builds.apache.org/job/beam_PostCommit_Py_ValCont/ws/src/sdks/python/container/local/lib/python2.7/site-packages/apitools/base/py/http_wrapper.py",> line 346, in MakeRequest
check_response_func=check_response_func)
File "<https://builds.apache.org/job/beam_PostCommit_Py_ValCont/ws/src/sdks/python/container/local/lib/python2.7/site-packages/apitools/base/py/http_wrapper.py",> line 396, in _MakeRequestNoRetry
redirections=redirections, connection_type=connection_type)
File "<https://builds.apache.org/job/beam_PostCommit_Py_ValCont/ws/src/sdks/python/container/local/lib/python2.7/site-packages/oauth2client/transport.py",> line 175, in new_request
redirections, connection_type)
File "<https://builds.apache.org/job/beam_PostCommit_Py_ValCont/ws/src/sdks/python/container/local/lib/python2.7/site-packages/oauth2client/transport.py",> line 282, in request
connection_type=connection_type)
File "<https://builds.apache.org/job/beam_PostCommit_Py_ValCont/ws/src/sdks/python/container/local/lib/python2.7/site-packages/httplib2/__init__.py",> line 1694, in request
(response, content) = self._request(conn, authority, uri, request_uri, method, body, headers, redirections, cachekey)
File "<https://builds.apache.org/job/beam_PostCommit_Py_ValCont/ws/src/sdks/python/container/local/lib/python2.7/site-packages/httplib2/__init__.py",> line 1434, in _request
(response, content) = self._conn_request(conn, request_uri, method, body, headers)
File "<https://builds.apache.org/job/beam_PostCommit_Py_ValCont/ws/src/sdks/python/container/local/lib/python2.7/site-packages/httplib2/__init__.py",> line 1390, in _conn_request
response = conn.getresponse()
File "/usr/lib/python2.7/httplib.py", line 1136, in getresponse
response.begin()
File "/usr/lib/python2.7/httplib.py", line 453, in begin
version, status, reason = self._read_status()
File "/usr/lib/python2.7/httplib.py", line 409, in _read_status
line = self.fp.readline(_MAXLINE + 1)
File "/usr/lib/python2.7/socket.py", line 480, in readline
data = self._sock.recv(self._rbufsize)
File "/usr/lib/python2.7/ssl.py", line 756, in recv
return self.read(buflen)
File "/usr/lib/python2.7/ssl.py", line 643, in read
v = self._sslobj.read(len)
File "<https://builds.apache.org/job/beam_PostCommit_Py_ValCont/ws/src/sdks/python/container/local/lib/python2.7/site-packages/nose/plugins/multiprocess.py",> line 276, in signalhandler
raise TimedOutException()
TimedOutException: 'test_wordcount_fnapi_it (apache_beam.examples.wordcount_it_test.WordCountIT)'
----------------------------------------------------------------------
XML: <https://builds.apache.org/job/beam_PostCommit_Py_ValCont/ws/src/sdks/python/nosetests.xml>
----------------------------------------------------------------------
Ran 1 test in 901.868s
FAILED (errors=1)
Build step 'Execute shell' marked build as failure
Not sending mail to unregistered user apilloud@google.com
Not sending mail to unregistered user katarzyna.kucharczyk@polidea.com
Not sending mail to unregistered user amaliujia@163.com
Not sending mail to unregistered user migryz@google.com
Not sending mail to unregistered user github@alasdairhodge.co.uk
Not sending mail to unregistered user marek.simunek@firma.seznam.cz
Not sending mail to unregistered user lukasz.gajowy@polidea.com
Not sending mail to unregistered user sourabhbajaj@google.com
Not sending mail to unregistered user mergebot@apache.org
Not sending mail to unregistered user mariagh@mariagh.svl.corp.google.com
Not sending mail to unregistered user thomas.haines@practiceinsight.io
Not sending mail to unregistered user axelmagn@gmail.com
Not sending mail to unregistered user ddonnelly@google.com
Not sending mail to unregistered user ehudm@google.com
Not sending mail to unregistered user relax@relax-macbookpro2.roam.corp.google.com
Not sending mail to unregistered user devon.meunier@shopify.com
Not sending mail to unregistered user timrobertson100@gmail.com
Not sending mail to unregistered user kirpichov@google.com
Not sending mail to unregistered user cademarkegard@gmail.com
Not sending mail to unregistered user ekirpichov@gmail.com
Not sending mail to unregistered user basti.lj@alibaba-inc.com
Not sending mail to unregistered user mrtn@nrd.io
Not sending mail to unregistered user rober@frantil.com
Not sending mail to unregistered user jiangkai@gmail.com
Not sending mail to unregistered user valentyn@google.com
Not sending mail to unregistered user aaltay@gmail.com
Not sending mail to unregistered user azur@paypal.com
Not sending mail to unregistered user jamalone@gmail.com
Not sending mail to unregistered user terrencehan@tencent.com
Not sending mail to unregistered user hadarh@google.com
Not sending mail to unregistered user melissapa@google.com
Not sending mail to unregistered user fjp@google.com
Not sending mail to unregistered user klk@google.com
Not sending mail to unregistered user pgerver@us.ibm.com
Not sending mail to unregistered user jasonkuster@google.com
Not sending mail to unregistered user aljoscha.krettek@gmail.com
Not sending mail to unregistered user aromanenko.dev@gmail.com
Not sending mail to unregistered user mairbek@google.com
Not sending mail to unregistered user taro.murao@gmail.com
Not sending mail to unregistered user swegner@google.com
Not sending mail to unregistered user ankurgoenka@gmail.com
Not sending mail to unregistered user wnsdud1861@gmail.com
Not sending mail to unregistered user peihe0@gmail.com
Not sending mail to unregistered user sisk@google.com
Build failed in Jenkins: beam_PostCommit_Py_ValCont #82
Posted by Apache Jenkins Server <je...@builds.apache.org>.
See <https://builds.apache.org/job/beam_PostCommit_Py_ValCont/82/display/redirect?page=changes>
Changes:
[klk] Fix docker gated code paths
------------------------------------------
[...truncated 153.74 KB...]
copying apache_beam/runners/worker/statesampler_fast.pxd -> apache-beam-2.6.0.dev0/apache_beam/runners/worker
copying apache_beam/runners/worker/statesampler_fast.pyx -> apache-beam-2.6.0.dev0/apache_beam/runners/worker
copying apache_beam/runners/worker/statesampler_slow.py -> apache-beam-2.6.0.dev0/apache_beam/runners/worker
copying apache_beam/runners/worker/statesampler_test.py -> apache-beam-2.6.0.dev0/apache_beam/runners/worker
copying apache_beam/runners/worker/worker_id_interceptor.py -> apache-beam-2.6.0.dev0/apache_beam/runners/worker
copying apache_beam/runners/worker/worker_id_interceptor_test.py -> apache-beam-2.6.0.dev0/apache_beam/runners/worker
copying apache_beam/testing/__init__.py -> apache-beam-2.6.0.dev0/apache_beam/testing
copying apache_beam/testing/pipeline_verifiers.py -> apache-beam-2.6.0.dev0/apache_beam/testing
copying apache_beam/testing/pipeline_verifiers_test.py -> apache-beam-2.6.0.dev0/apache_beam/testing
copying apache_beam/testing/test_pipeline.py -> apache-beam-2.6.0.dev0/apache_beam/testing
copying apache_beam/testing/test_pipeline_test.py -> apache-beam-2.6.0.dev0/apache_beam/testing
copying apache_beam/testing/test_stream.py -> apache-beam-2.6.0.dev0/apache_beam/testing
copying apache_beam/testing/test_stream_test.py -> apache-beam-2.6.0.dev0/apache_beam/testing
copying apache_beam/testing/test_utils.py -> apache-beam-2.6.0.dev0/apache_beam/testing
copying apache_beam/testing/test_utils_test.py -> apache-beam-2.6.0.dev0/apache_beam/testing
copying apache_beam/testing/util.py -> apache-beam-2.6.0.dev0/apache_beam/testing
copying apache_beam/testing/util_test.py -> apache-beam-2.6.0.dev0/apache_beam/testing
copying apache_beam/testing/data/standard_coders.yaml -> apache-beam-2.6.0.dev0/apache_beam/testing/data
copying apache_beam/testing/data/trigger_transcripts.yaml -> apache-beam-2.6.0.dev0/apache_beam/testing/data
copying apache_beam/tools/__init__.py -> apache-beam-2.6.0.dev0/apache_beam/tools
copying apache_beam/tools/distribution_counter_microbenchmark.py -> apache-beam-2.6.0.dev0/apache_beam/tools
copying apache_beam/tools/map_fn_microbenchmark.py -> apache-beam-2.6.0.dev0/apache_beam/tools
copying apache_beam/tools/sideinput_microbenchmark.py -> apache-beam-2.6.0.dev0/apache_beam/tools
copying apache_beam/tools/utils.py -> apache-beam-2.6.0.dev0/apache_beam/tools
copying apache_beam/transforms/__init__.py -> apache-beam-2.6.0.dev0/apache_beam/transforms
copying apache_beam/transforms/combiners.py -> apache-beam-2.6.0.dev0/apache_beam/transforms
copying apache_beam/transforms/combiners_test.py -> apache-beam-2.6.0.dev0/apache_beam/transforms
copying apache_beam/transforms/core.py -> apache-beam-2.6.0.dev0/apache_beam/transforms
copying apache_beam/transforms/create_source.py -> apache-beam-2.6.0.dev0/apache_beam/transforms
copying apache_beam/transforms/create_test.py -> apache-beam-2.6.0.dev0/apache_beam/transforms
copying apache_beam/transforms/cy_combiners.pxd -> apache-beam-2.6.0.dev0/apache_beam/transforms
copying apache_beam/transforms/cy_combiners.py -> apache-beam-2.6.0.dev0/apache_beam/transforms
copying apache_beam/transforms/cy_dataflow_distribution_counter.pxd -> apache-beam-2.6.0.dev0/apache_beam/transforms
copying apache_beam/transforms/cy_dataflow_distribution_counter.pyx -> apache-beam-2.6.0.dev0/apache_beam/transforms
copying apache_beam/transforms/dataflow_distribution_counter_test.py -> apache-beam-2.6.0.dev0/apache_beam/transforms
copying apache_beam/transforms/display.py -> apache-beam-2.6.0.dev0/apache_beam/transforms
copying apache_beam/transforms/display_test.py -> apache-beam-2.6.0.dev0/apache_beam/transforms
copying apache_beam/transforms/ptransform.py -> apache-beam-2.6.0.dev0/apache_beam/transforms
copying apache_beam/transforms/ptransform_test.py -> apache-beam-2.6.0.dev0/apache_beam/transforms
copying apache_beam/transforms/py_dataflow_distribution_counter.py -> apache-beam-2.6.0.dev0/apache_beam/transforms
copying apache_beam/transforms/sideinputs.py -> apache-beam-2.6.0.dev0/apache_beam/transforms
copying apache_beam/transforms/sideinputs_test.py -> apache-beam-2.6.0.dev0/apache_beam/transforms
copying apache_beam/transforms/timeutil.py -> apache-beam-2.6.0.dev0/apache_beam/transforms
copying apache_beam/transforms/trigger.py -> apache-beam-2.6.0.dev0/apache_beam/transforms
copying apache_beam/transforms/trigger_test.py -> apache-beam-2.6.0.dev0/apache_beam/transforms
copying apache_beam/transforms/util.py -> apache-beam-2.6.0.dev0/apache_beam/transforms
copying apache_beam/transforms/util_test.py -> apache-beam-2.6.0.dev0/apache_beam/transforms
copying apache_beam/transforms/window.py -> apache-beam-2.6.0.dev0/apache_beam/transforms
copying apache_beam/transforms/window_test.py -> apache-beam-2.6.0.dev0/apache_beam/transforms
copying apache_beam/transforms/write_ptransform_test.py -> apache-beam-2.6.0.dev0/apache_beam/transforms
copying apache_beam/typehints/__init__.py -> apache-beam-2.6.0.dev0/apache_beam/typehints
copying apache_beam/typehints/decorators.py -> apache-beam-2.6.0.dev0/apache_beam/typehints
copying apache_beam/typehints/native_type_compatibility.py -> apache-beam-2.6.0.dev0/apache_beam/typehints
copying apache_beam/typehints/native_type_compatibility_test.py -> apache-beam-2.6.0.dev0/apache_beam/typehints
copying apache_beam/typehints/opcodes.py -> apache-beam-2.6.0.dev0/apache_beam/typehints
copying apache_beam/typehints/trivial_inference.py -> apache-beam-2.6.0.dev0/apache_beam/typehints
copying apache_beam/typehints/trivial_inference_test.py -> apache-beam-2.6.0.dev0/apache_beam/typehints
copying apache_beam/typehints/typecheck.py -> apache-beam-2.6.0.dev0/apache_beam/typehints
copying apache_beam/typehints/typed_pipeline_test.py -> apache-beam-2.6.0.dev0/apache_beam/typehints
copying apache_beam/typehints/typehints.py -> apache-beam-2.6.0.dev0/apache_beam/typehints
copying apache_beam/typehints/typehints_test.py -> apache-beam-2.6.0.dev0/apache_beam/typehints
copying apache_beam/utils/__init__.py -> apache-beam-2.6.0.dev0/apache_beam/utils
copying apache_beam/utils/annotations.py -> apache-beam-2.6.0.dev0/apache_beam/utils
copying apache_beam/utils/annotations_test.py -> apache-beam-2.6.0.dev0/apache_beam/utils
copying apache_beam/utils/counters.pxd -> apache-beam-2.6.0.dev0/apache_beam/utils
copying apache_beam/utils/counters.py -> apache-beam-2.6.0.dev0/apache_beam/utils
copying apache_beam/utils/counters_test.py -> apache-beam-2.6.0.dev0/apache_beam/utils
copying apache_beam/utils/plugin.py -> apache-beam-2.6.0.dev0/apache_beam/utils
copying apache_beam/utils/processes.py -> apache-beam-2.6.0.dev0/apache_beam/utils
copying apache_beam/utils/processes_test.py -> apache-beam-2.6.0.dev0/apache_beam/utils
copying apache_beam/utils/profiler.py -> apache-beam-2.6.0.dev0/apache_beam/utils
copying apache_beam/utils/proto_utils.py -> apache-beam-2.6.0.dev0/apache_beam/utils
copying apache_beam/utils/retry.py -> apache-beam-2.6.0.dev0/apache_beam/utils
copying apache_beam/utils/retry_test.py -> apache-beam-2.6.0.dev0/apache_beam/utils
copying apache_beam/utils/timestamp.py -> apache-beam-2.6.0.dev0/apache_beam/utils
copying apache_beam/utils/timestamp_test.py -> apache-beam-2.6.0.dev0/apache_beam/utils
copying apache_beam/utils/urns.py -> apache-beam-2.6.0.dev0/apache_beam/utils
copying apache_beam/utils/windowed_value.pxd -> apache-beam-2.6.0.dev0/apache_beam/utils
copying apache_beam/utils/windowed_value.py -> apache-beam-2.6.0.dev0/apache_beam/utils
copying apache_beam/utils/windowed_value_test.py -> apache-beam-2.6.0.dev0/apache_beam/utils
Writing apache-beam-2.6.0.dev0/setup.cfg
creating dist
Creating tar archive
removing 'apache-beam-2.6.0.dev0' (and everything under it)
SDK_LOCATION=$(find dist/apache-beam-*.tar.gz)
find dist/apache-beam-*.tar.gz
# Run ValidatesRunner tests on Google Cloud Dataflow service
echo ">>> RUNNING DATAFLOW RUNNER VALIDATESCONTAINER TEST"
>>> RUNNING DATAFLOW RUNNER VALIDATESCONTAINER TEST
python setup.py nosetests \
--attr ValidatesContainer \
--nocapture \
--processes=1 \
--process-timeout=900 \
--test-pipeline-options=" \
--runner=TestDataflowRunner \
--project=$PROJECT \
--worker_harness_container_image=$CONTAINER:$TAG \
--staging_location=$GCS_LOCATION/staging-validatesrunner-test \
--temp_location=$GCS_LOCATION/temp-validatesrunner-test \
--output=$GCS_LOCATION/output \
--sdk_location=$SDK_LOCATION \
--num_workers=1"
<https://builds.apache.org/job/beam_PostCommit_Py_ValCont/ws/src/sdks/python/container/local/lib/python2.7/site-packages/setuptools/dist.py>:398: UserWarning: Normalizing '2.6.0.dev' to '2.6.0.dev0'
normalized_version,
running nosetests
running egg_info
<https://builds.apache.org/job/beam_PostCommit_Py_ValCont/ws/src/sdks/python/gen_protos.py>:49: UserWarning: Installing grpcio-tools is recommended for development.
warnings.warn('Installing grpcio-tools is recommended for development.')
writing requirements to apache_beam.egg-info/requires.txt
writing apache_beam.egg-info/PKG-INFO
writing top-level names to apache_beam.egg-info/top_level.txt
writing dependency_links to apache_beam.egg-info/dependency_links.txt
writing entry points to apache_beam.egg-info/entry_points.txt
reading manifest file 'apache_beam.egg-info/SOURCES.txt'
reading manifest template 'MANIFEST.in'
warning: no files found matching 'README.md'
warning: no files found matching 'NOTICE'
warning: no files found matching 'LICENSE'
writing manifest file 'apache_beam.egg-info/SOURCES.txt'
<https://builds.apache.org/job/beam_PostCommit_Py_ValCont/ws/src/sdks/python/apache_beam/io/gcp/gcsio.py>:176: DeprecationWarning: object() takes no parameters
super(GcsIO, cls).__new__(cls, storage_client))
<https://builds.apache.org/job/beam_PostCommit_Py_ValCont/ws/src/sdks/python/apache_beam/runners/dataflow/test_dataflow_runner.py>:52: DeprecationWarning: options is deprecated since First stable release.. References to <pipeline>.options will not be supported
print('Found: %s.' % self.build_console_url(pipeline.options))
Found: https://console.cloud.google.com/dataflow/jobsDetail/locations/us-central1/jobs/2018-06-22_12_09_22-11425387827471263649?project=apache-beam-testing.
test_wordcount_fnapi_it (apache_beam.examples.wordcount_it_test.WordCountIT) ... ERROR
======================================================================
ERROR: test_wordcount_fnapi_it (apache_beam.examples.wordcount_it_test.WordCountIT)
----------------------------------------------------------------------
Traceback (most recent call last):
File "<https://builds.apache.org/job/beam_PostCommit_Py_ValCont/ws/src/sdks/python/container/local/lib/python2.7/site-packages/nose/plugins/multiprocess.py",> line 812, in run
test(orig)
File "<https://builds.apache.org/job/beam_PostCommit_Py_ValCont/ws/src/sdks/python/container/local/lib/python2.7/site-packages/nose/case.py",> line 45, in __call__
return self.run(*arg, **kwarg)
File "<https://builds.apache.org/job/beam_PostCommit_Py_ValCont/ws/src/sdks/python/container/local/lib/python2.7/site-packages/nose/case.py",> line 133, in run
self.runTest(result)
File "<https://builds.apache.org/job/beam_PostCommit_Py_ValCont/ws/src/sdks/python/container/local/lib/python2.7/site-packages/nose/case.py",> line 151, in runTest
test(result)
File "/usr/lib/python2.7/unittest/case.py", line 393, in __call__
return self.run(*args, **kwds)
File "/usr/lib/python2.7/unittest/case.py", line 329, in run
testMethod()
File "<https://builds.apache.org/job/beam_PostCommit_Py_ValCont/ws/src/sdks/python/apache_beam/examples/wordcount_it_test.py",> line 79, in test_wordcount_fnapi_it
on_success_matcher=PipelineStateMatcher()))
File "<https://builds.apache.org/job/beam_PostCommit_Py_ValCont/ws/src/sdks/python/apache_beam/examples/wordcount_fnapi.py",> line 128, in run
result = p.run()
File "<https://builds.apache.org/job/beam_PostCommit_Py_ValCont/ws/src/sdks/python/apache_beam/pipeline.py",> line 395, in run
self.to_runner_api(), self.runner, self._options).run(False)
File "<https://builds.apache.org/job/beam_PostCommit_Py_ValCont/ws/src/sdks/python/apache_beam/pipeline.py",> line 408, in run
return self.runner.run_pipeline(self)
File "<https://builds.apache.org/job/beam_PostCommit_Py_ValCont/ws/src/sdks/python/apache_beam/runners/dataflow/test_dataflow_runner.py",> line 67, in run_pipeline
self.wait_until_in_state(PipelineState.CANCELLED, timeout=300)
File "<https://builds.apache.org/job/beam_PostCommit_Py_ValCont/ws/src/sdks/python/apache_beam/runners/dataflow/test_dataflow_runner.py",> line 87, in wait_until_in_state
job_state = self.result.state
File "<https://builds.apache.org/job/beam_PostCommit_Py_ValCont/ws/src/sdks/python/apache_beam/runners/dataflow/dataflow_runner.py",> line 1069, in state
self._update_job()
File "<https://builds.apache.org/job/beam_PostCommit_Py_ValCont/ws/src/sdks/python/apache_beam/runners/dataflow/dataflow_runner.py",> line 1047, in _update_job
self._job = self._runner.dataflow_client.get_job(self.job_id())
File "<https://builds.apache.org/job/beam_PostCommit_Py_ValCont/ws/src/sdks/python/apache_beam/utils/retry.py",> line 184, in wrapper
return fun(*args, **kwargs)
File "<https://builds.apache.org/job/beam_PostCommit_Py_ValCont/ws/src/sdks/python/apache_beam/runners/dataflow/internal/apiclient.py",> line 624, in get_job
response = self._client.projects_locations_jobs.Get(request)
File "<https://builds.apache.org/job/beam_PostCommit_Py_ValCont/ws/src/sdks/python/apache_beam/runners/dataflow/internal/clients/dataflow/dataflow_v1b3_client.py",> line 656, in Get
config, request, global_params=global_params)
File "<https://builds.apache.org/job/beam_PostCommit_Py_ValCont/ws/src/sdks/python/container/local/lib/python2.7/site-packages/apitools/base/py/base_api.py",> line 720, in _RunMethod
http, http_request, **opts)
File "<https://builds.apache.org/job/beam_PostCommit_Py_ValCont/ws/src/sdks/python/container/local/lib/python2.7/site-packages/apitools/base/py/http_wrapper.py",> line 346, in MakeRequest
check_response_func=check_response_func)
File "<https://builds.apache.org/job/beam_PostCommit_Py_ValCont/ws/src/sdks/python/container/local/lib/python2.7/site-packages/apitools/base/py/http_wrapper.py",> line 396, in _MakeRequestNoRetry
redirections=redirections, connection_type=connection_type)
File "<https://builds.apache.org/job/beam_PostCommit_Py_ValCont/ws/src/sdks/python/container/local/lib/python2.7/site-packages/oauth2client/transport.py",> line 175, in new_request
redirections, connection_type)
File "<https://builds.apache.org/job/beam_PostCommit_Py_ValCont/ws/src/sdks/python/container/local/lib/python2.7/site-packages/oauth2client/transport.py",> line 282, in request
connection_type=connection_type)
File "<https://builds.apache.org/job/beam_PostCommit_Py_ValCont/ws/src/sdks/python/container/local/lib/python2.7/site-packages/httplib2/__init__.py",> line 1694, in request
(response, content) = self._request(conn, authority, uri, request_uri, method, body, headers, redirections, cachekey)
File "<https://builds.apache.org/job/beam_PostCommit_Py_ValCont/ws/src/sdks/python/container/local/lib/python2.7/site-packages/httplib2/__init__.py",> line 1434, in _request
(response, content) = self._conn_request(conn, request_uri, method, body, headers)
File "<https://builds.apache.org/job/beam_PostCommit_Py_ValCont/ws/src/sdks/python/container/local/lib/python2.7/site-packages/httplib2/__init__.py",> line 1390, in _conn_request
response = conn.getresponse()
File "/usr/lib/python2.7/httplib.py", line 1136, in getresponse
response.begin()
File "/usr/lib/python2.7/httplib.py", line 453, in begin
version, status, reason = self._read_status()
File "/usr/lib/python2.7/httplib.py", line 409, in _read_status
line = self.fp.readline(_MAXLINE + 1)
File "/usr/lib/python2.7/socket.py", line 480, in readline
data = self._sock.recv(self._rbufsize)
File "/usr/lib/python2.7/ssl.py", line 756, in recv
return self.read(buflen)
File "/usr/lib/python2.7/ssl.py", line 643, in read
v = self._sslobj.read(len)
File "<https://builds.apache.org/job/beam_PostCommit_Py_ValCont/ws/src/sdks/python/container/local/lib/python2.7/site-packages/nose/plugins/multiprocess.py",> line 276, in signalhandler
raise TimedOutException()
TimedOutException: 'test_wordcount_fnapi_it (apache_beam.examples.wordcount_it_test.WordCountIT)'
----------------------------------------------------------------------
XML: <https://builds.apache.org/job/beam_PostCommit_Py_ValCont/ws/src/sdks/python/nosetests.xml>
----------------------------------------------------------------------
Ran 1 test in 901.650s
FAILED (errors=1)
Build step 'Execute shell' marked build as failure
Not sending mail to unregistered user apilloud@google.com
Not sending mail to unregistered user katarzyna.kucharczyk@polidea.com
Not sending mail to unregistered user amaliujia@163.com
Not sending mail to unregistered user migryz@google.com
Not sending mail to unregistered user github@alasdairhodge.co.uk
Not sending mail to unregistered user marek.simunek@firma.seznam.cz
Not sending mail to unregistered user lukasz.gajowy@polidea.com
Not sending mail to unregistered user sourabhbajaj@google.com
Not sending mail to unregistered user mergebot@apache.org
Not sending mail to unregistered user mariagh@mariagh.svl.corp.google.com
Not sending mail to unregistered user thomas.haines@practiceinsight.io
Not sending mail to unregistered user axelmagn@gmail.com
Not sending mail to unregistered user ddonnelly@google.com
Not sending mail to unregistered user ehudm@google.com
Not sending mail to unregistered user relax@relax-macbookpro2.roam.corp.google.com
Not sending mail to unregistered user devon.meunier@shopify.com
Not sending mail to unregistered user timrobertson100@gmail.com
Not sending mail to unregistered user kirpichov@google.com
Not sending mail to unregistered user cademarkegard@gmail.com
Not sending mail to unregistered user ekirpichov@gmail.com
Not sending mail to unregistered user basti.lj@alibaba-inc.com
Not sending mail to unregistered user mrtn@nrd.io
Not sending mail to unregistered user rober@frantil.com
Not sending mail to unregistered user jiangkai@gmail.com
Not sending mail to unregistered user valentyn@google.com
Not sending mail to unregistered user aaltay@gmail.com
Not sending mail to unregistered user azur@paypal.com
Not sending mail to unregistered user jamalone@gmail.com
Not sending mail to unregistered user terrencehan@tencent.com
Not sending mail to unregistered user hadarh@google.com
Not sending mail to unregistered user melissapa@google.com
Not sending mail to unregistered user fjp@google.com
Not sending mail to unregistered user klk@google.com
Not sending mail to unregistered user pgerver@us.ibm.com
Not sending mail to unregistered user jasonkuster@google.com
Not sending mail to unregistered user aljoscha.krettek@gmail.com
Not sending mail to unregistered user aromanenko.dev@gmail.com
Not sending mail to unregistered user mairbek@google.com
Not sending mail to unregistered user taro.murao@gmail.com
Not sending mail to unregistered user swegner@google.com
Not sending mail to unregistered user ankurgoenka@gmail.com
Not sending mail to unregistered user wnsdud1861@gmail.com
Not sending mail to unregistered user peihe0@gmail.com
Not sending mail to unregistered user sisk@google.com
Build failed in Jenkins: beam_PostCommit_Py_ValCont #81
Posted by Apache Jenkins Server <je...@builds.apache.org>.
See <https://builds.apache.org/job/beam_PostCommit_Py_ValCont/81/display/redirect?page=changes>
Changes:
[klk] Fix Gearpump validatesRunner gradle config
------------------------------------------
Started by GitHub push by kennknowles
[EnvInject] - Loading node environment variables.
Building remotely on beam4 (beam) in workspace <https://builds.apache.org/job/beam_PostCommit_Py_ValCont/ws/>
> git rev-parse --is-inside-work-tree # timeout=10
Fetching changes from the remote Git repository
> git config remote.origin.url https://github.com/apache/beam.git # timeout=10
Fetching upstream changes from https://github.com/apache/beam.git
> git --version # timeout=10
> git fetch --tags --progress https://github.com/apache/beam.git +refs/heads/*:refs/remotes/origin/* +refs/pull/${ghprbPullId}/*:refs/remotes/origin/pr/${ghprbPullId}/*
> git rev-parse origin/master^{commit} # timeout=10
Checking out Revision c686c29198eaea4b40363a63d4d07026bbaf011a (origin/master)
> git config core.sparsecheckout # timeout=10
> git checkout -f c686c29198eaea4b40363a63d4d07026bbaf011a
Commit message: "Merge pull request #5737: [BEAM-4619] Fix Gearpump validatesRunner gradle config"
> git rev-list --no-walk 0ed62c8511e15850bcc9d6b5887278dd1fff6c78 # timeout=10
Cleaning workspace
> git rev-parse --verify HEAD # timeout=10
Resetting working tree
> git reset --hard # timeout=10
> git clean -fdx # timeout=10
[EnvInject] - Executing scripts and injecting environment variables after the SCM step.
[EnvInject] - Injecting as environment variables the properties content
SPARK_LOCAL_IP=127.0.0.1
[EnvInject] - Variables injected successfully.
[beam_PostCommit_Py_ValCont] $ /bin/bash -xe /tmp/jenkins315765105881582798.sh
+ cd src
+ bash sdks/python/container/run_validatescontainer.sh
# Where to store integration test outputs.
GCS_LOCATION=gs://temp-storage-for-end-to-end-tests
# Project for the container and integration test
PROJECT=apache-beam-testing
# Verify in the root of the repository
test -d sdks/python/container
# Verify docker and gcloud commands exist
command -v docker
/usr/bin/docker
command -v gcloud
/usr/bin/gcloud
docker -v
Docker version 17.05.0-ce, build 89658be
gcloud -v
Google Cloud SDK 191.0.0
alpha 2018.02.23
beta 2018.02.23
bq 2.0.29
core 2018.02.23
gsutil 4.28
# Build the container
TAG=$(date +%Y%m%d-%H%M%S)
date +%Y%m%d-%H%M%S
CONTAINER=us.gcr.io/$PROJECT/$USER/python
echo "Using container $CONTAINER"
Using container us.gcr.io/apache-beam-testing/jenkins/python
./gradlew :beam-sdks-python-container:docker -Pdocker-repository-root=us.gcr.io/$PROJECT/$USER -Pdocker-tag=$TAG
Parallel execution is an incubating feature.
> Task :buildSrc:compileJava NO-SOURCE
> Task :buildSrc:compileGroovy FROM-CACHE
> Task :buildSrc:processResources NO-SOURCE
> Task :buildSrc:classes UP-TO-DATE
> Task :buildSrc:jar
> Task :buildSrc:assemble
> Task :buildSrc:spotlessGroovy
> Task :buildSrc:spotlessGroovyCheck
> Task :buildSrc:spotlessGroovyGradle
> Task :buildSrc:spotlessGroovyGradleCheck
> Task :buildSrc:spotlessCheck
> Task :buildSrc:compileTestJava NO-SOURCE
> Task :buildSrc:compileTestGroovy NO-SOURCE
> Task :buildSrc:processTestResources NO-SOURCE
> Task :buildSrc:testClasses UP-TO-DATE
> Task :buildSrc:test NO-SOURCE
> Task :buildSrc:check
> Task :buildSrc:build
Parallel execution with configuration on demand is an incubating feature.
> Configure project :
Applying BeamModulePlugin to beam
createPerformanceTestHarness with default configuration for project beam
Adding 48 .gitignore exclusions to Apache Rat
> Configure project :beam-sdks-python-container
Applying BeamModulePlugin to beam-sdks-python-container
applyGoNature with default configuration for project beam-sdks-python-container
applyDockerNature with default configuration for project beam-sdks-python-container
containerImageName with [name:python] for project beam-sdks-python-container
Project evaluation failed including an error in afterEvaluate {}. Run with --stacktrace for details of the afterEvaluate {} error.
FAILURE: Build failed with an exception.
* Where:
Build file '<https://builds.apache.org/job/beam_PostCommit_Py_ValCont/ws/src/sdks/python/container/build.gradle'> line: 61
* What went wrong:
A problem occurred evaluating project ':beam-sdks-python-container'.
> No such property: rootProject for class: org.apache.beam.gradle.BeamModulePlugin
* Try:
Run with --stacktrace option to get the stack trace. Run with --info or --debug option to get more log output. Run with --scan to get full insights.
* Get more help at https://help.gradle.org
Deprecated Gradle features were used in this build, making it incompatible with Gradle 5.0.
See https://docs.gradle.org/4.8/userguide/command_line_interface.html#sec:command_line_warnings
BUILD FAILED in 10s
Publishing build scan...
https://gradle.com/s/b55yzngsufgoc
Build step 'Execute shell' marked build as failure
Not sending mail to unregistered user apilloud@google.com
Not sending mail to unregistered user katarzyna.kucharczyk@polidea.com
Not sending mail to unregistered user amaliujia@163.com
Not sending mail to unregistered user migryz@google.com
Not sending mail to unregistered user github@alasdairhodge.co.uk
Not sending mail to unregistered user marek.simunek@firma.seznam.cz
Not sending mail to unregistered user lukasz.gajowy@polidea.com
Not sending mail to unregistered user sourabhbajaj@google.com
Not sending mail to unregistered user mergebot@apache.org
Not sending mail to unregistered user mariagh@mariagh.svl.corp.google.com
Not sending mail to unregistered user thomas.haines@practiceinsight.io
Not sending mail to unregistered user axelmagn@gmail.com
Not sending mail to unregistered user ddonnelly@google.com
Not sending mail to unregistered user ehudm@google.com
Not sending mail to unregistered user relax@relax-macbookpro2.roam.corp.google.com
Not sending mail to unregistered user devon.meunier@shopify.com
Not sending mail to unregistered user timrobertson100@gmail.com
Not sending mail to unregistered user kirpichov@google.com
Not sending mail to unregistered user cademarkegard@gmail.com
Not sending mail to unregistered user ekirpichov@gmail.com
Not sending mail to unregistered user basti.lj@alibaba-inc.com
Not sending mail to unregistered user mrtn@nrd.io
Not sending mail to unregistered user rober@frantil.com
Not sending mail to unregistered user jiangkai@gmail.com
Not sending mail to unregistered user valentyn@google.com
Not sending mail to unregistered user aaltay@gmail.com
Not sending mail to unregistered user azur@paypal.com
Not sending mail to unregistered user jamalone@gmail.com
Not sending mail to unregistered user terrencehan@tencent.com
Not sending mail to unregistered user hadarh@google.com
Not sending mail to unregistered user melissapa@google.com
Not sending mail to unregistered user fjp@google.com
Not sending mail to unregistered user klk@google.com
Not sending mail to unregistered user pgerver@us.ibm.com
Not sending mail to unregistered user jasonkuster@google.com
Not sending mail to unregistered user aljoscha.krettek@gmail.com
Not sending mail to unregistered user aromanenko.dev@gmail.com
Not sending mail to unregistered user mairbek@google.com
Not sending mail to unregistered user taro.murao@gmail.com
Not sending mail to unregistered user swegner@google.com
Not sending mail to unregistered user ankurgoenka@gmail.com
Not sending mail to unregistered user wnsdud1861@gmail.com
Not sending mail to unregistered user peihe0@gmail.com
Not sending mail to unregistered user sisk@google.com
Build failed in Jenkins: beam_PostCommit_Py_ValCont #80
Posted by Apache Jenkins Server <je...@builds.apache.org>.
See <https://builds.apache.org/job/beam_PostCommit_Py_ValCont/80/display/redirect?page=changes>
Changes:
[Pablo] Enabling gradle build to receive extra buildscript repositories
------------------------------------------
Started by GitHub push by kennknowles
[EnvInject] - Loading node environment variables.
Building remotely on beam7 (beam) in workspace <https://builds.apache.org/job/beam_PostCommit_Py_ValCont/ws/>
> git rev-parse --is-inside-work-tree # timeout=10
Fetching changes from the remote Git repository
> git config remote.origin.url https://github.com/apache/beam.git # timeout=10
Fetching upstream changes from https://github.com/apache/beam.git
> git --version # timeout=10
> git fetch --tags --progress https://github.com/apache/beam.git +refs/heads/*:refs/remotes/origin/* +refs/pull/${ghprbPullId}/*:refs/remotes/origin/pr/${ghprbPullId}/*
> git rev-parse origin/master^{commit} # timeout=10
Checking out Revision 0ed62c8511e15850bcc9d6b5887278dd1fff6c78 (origin/master)
> git config core.sparsecheckout # timeout=10
> git checkout -f 0ed62c8511e15850bcc9d6b5887278dd1fff6c78
Commit message: "Merge pull request #5728: [BEAM-4614] Enabling gradle build to receive extra buildscript repositories"
> git rev-list --no-walk 01e250737173c6df99be7fc62917614d436d6950 # timeout=10
Cleaning workspace
> git rev-parse --verify HEAD # timeout=10
Resetting working tree
> git reset --hard # timeout=10
> git clean -fdx # timeout=10
[EnvInject] - Executing scripts and injecting environment variables after the SCM step.
[EnvInject] - Injecting as environment variables the properties content
SPARK_LOCAL_IP=127.0.0.1
[EnvInject] - Variables injected successfully.
[beam_PostCommit_Py_ValCont] $ /bin/bash -xe /tmp/jenkins5902872626336308152.sh
+ cd src
+ bash sdks/python/container/run_validatescontainer.sh
# Where to store integration test outputs.
GCS_LOCATION=gs://temp-storage-for-end-to-end-tests
# Project for the container and integration test
PROJECT=apache-beam-testing
# Verify in the root of the repository
test -d sdks/python/container
# Verify docker and gcloud commands exist
command -v docker
/usr/bin/docker
command -v gcloud
/usr/bin/gcloud
docker -v
Docker version 17.05.0-ce, build 89658be
gcloud -v
Google Cloud SDK 191.0.0
alpha 2018.02.23
beta 2018.02.23
bq 2.0.29
core 2018.02.23
gsutil 4.28
# Build the container
TAG=$(date +%Y%m%d-%H%M%S)
date +%Y%m%d-%H%M%S
CONTAINER=us.gcr.io/$PROJECT/$USER/python
echo "Using container $CONTAINER"
Using container us.gcr.io/apache-beam-testing/jenkins/python
./gradlew :beam-sdks-python-container:docker -Pdocker-repository-root=us.gcr.io/$PROJECT/$USER -Pdocker-tag=$TAG
Parallel execution is an incubating feature.
> Task :buildSrc:compileJava NO-SOURCE
> Task :buildSrc:compileGroovy FROM-CACHE
> Task :buildSrc:processResources NO-SOURCE
> Task :buildSrc:classes UP-TO-DATE
> Task :buildSrc:jar
> Task :buildSrc:assemble
> Task :buildSrc:spotlessGroovy
> Task :buildSrc:spotlessGroovyCheck
> Task :buildSrc:spotlessGroovyGradle
> Task :buildSrc:spotlessGroovyGradleCheck
> Task :buildSrc:spotlessCheck
> Task :buildSrc:compileTestJava NO-SOURCE
> Task :buildSrc:compileTestGroovy NO-SOURCE
> Task :buildSrc:processTestResources NO-SOURCE
> Task :buildSrc:testClasses UP-TO-DATE
> Task :buildSrc:test NO-SOURCE
> Task :buildSrc:check
> Task :buildSrc:build
Parallel execution with configuration on demand is an incubating feature.
> Configure project :
Applying BeamModulePlugin to beam
createPerformanceTestHarness with default configuration for project beam
Adding 48 .gitignore exclusions to Apache Rat
> Configure project :beam-sdks-python-container
Applying BeamModulePlugin to beam-sdks-python-container
applyGoNature with default configuration for project beam-sdks-python-container
applyDockerNature with default configuration for project beam-sdks-python-container
containerImageName with [name:python] for project beam-sdks-python-container
Project evaluation failed including an error in afterEvaluate {}. Run with --stacktrace for details of the afterEvaluate {} error.
FAILURE: Build failed with an exception.
* Where:
Build file '<https://builds.apache.org/job/beam_PostCommit_Py_ValCont/ws/src/sdks/python/container/build.gradle'> line: 61
* What went wrong:
A problem occurred evaluating project ':beam-sdks-python-container'.
> No such property: rootProject for class: org.apache.beam.gradle.BeamModulePlugin
* Try:
Run with --stacktrace option to get the stack trace. Run with --info or --debug option to get more log output. Run with --scan to get full insights.
* Get more help at https://help.gradle.org
Deprecated Gradle features were used in this build, making it incompatible with Gradle 5.0.
See https://docs.gradle.org/4.8/userguide/command_line_interface.html#sec:command_line_warnings
BUILD FAILED in 10s
Publishing build scan...
https://gradle.com/s/lrifd7jvxah24
Build step 'Execute shell' marked build as failure
Not sending mail to unregistered user apilloud@google.com
Not sending mail to unregistered user katarzyna.kucharczyk@polidea.com
Not sending mail to unregistered user amaliujia@163.com
Not sending mail to unregistered user migryz@google.com
Not sending mail to unregistered user github@alasdairhodge.co.uk
Not sending mail to unregistered user marek.simunek@firma.seznam.cz
Not sending mail to unregistered user lukasz.gajowy@polidea.com
Not sending mail to unregistered user sourabhbajaj@google.com
Not sending mail to unregistered user mergebot@apache.org
Not sending mail to unregistered user mariagh@mariagh.svl.corp.google.com
Not sending mail to unregistered user thomas.haines@practiceinsight.io
Not sending mail to unregistered user axelmagn@gmail.com
Not sending mail to unregistered user ddonnelly@google.com
Not sending mail to unregistered user ehudm@google.com
Not sending mail to unregistered user relax@relax-macbookpro2.roam.corp.google.com
Not sending mail to unregistered user devon.meunier@shopify.com
Not sending mail to unregistered user timrobertson100@gmail.com
Not sending mail to unregistered user kirpichov@google.com
Not sending mail to unregistered user cademarkegard@gmail.com
Not sending mail to unregistered user ekirpichov@gmail.com
Not sending mail to unregistered user basti.lj@alibaba-inc.com
Not sending mail to unregistered user mrtn@nrd.io
Not sending mail to unregistered user rober@frantil.com
Not sending mail to unregistered user jiangkai@gmail.com
Not sending mail to unregistered user valentyn@google.com
Not sending mail to unregistered user aaltay@gmail.com
Not sending mail to unregistered user azur@paypal.com
Not sending mail to unregistered user jamalone@gmail.com
Not sending mail to unregistered user terrencehan@tencent.com
Not sending mail to unregistered user hadarh@google.com
Not sending mail to unregistered user melissapa@google.com
Not sending mail to unregistered user fjp@google.com
Not sending mail to unregistered user klk@google.com
Not sending mail to unregistered user pgerver@us.ibm.com
Not sending mail to unregistered user jasonkuster@google.com
Not sending mail to unregistered user aljoscha.krettek@gmail.com
Not sending mail to unregistered user aromanenko.dev@gmail.com
Not sending mail to unregistered user mairbek@google.com
Not sending mail to unregistered user taro.murao@gmail.com
Not sending mail to unregistered user swegner@google.com
Not sending mail to unregistered user ankurgoenka@gmail.com
Not sending mail to unregistered user wnsdud1861@gmail.com
Not sending mail to unregistered user peihe0@gmail.com
Not sending mail to unregistered user sisk@google.com
Build failed in Jenkins: beam_PostCommit_Py_ValCont #79
Posted by Apache Jenkins Server <je...@builds.apache.org>.
See <https://builds.apache.org/job/beam_PostCommit_Py_ValCont/79/display/redirect>
------------------------------------------
Started by timer
[EnvInject] - Loading node environment variables.
Building remotely on beam14 (beam) in workspace <https://builds.apache.org/job/beam_PostCommit_Py_ValCont/ws/>
> git rev-parse --is-inside-work-tree # timeout=10
Fetching changes from the remote Git repository
> git config remote.origin.url https://github.com/apache/beam.git # timeout=10
Fetching upstream changes from https://github.com/apache/beam.git
> git --version # timeout=10
> git fetch --tags --progress https://github.com/apache/beam.git +refs/heads/*:refs/remotes/origin/* +refs/pull/${ghprbPullId}/*:refs/remotes/origin/pr/${ghprbPullId}/*
> git rev-parse origin/master^{commit} # timeout=10
Checking out Revision 01e250737173c6df99be7fc62917614d436d6950 (origin/master)
> git config core.sparsecheckout # timeout=10
> git checkout -f 01e250737173c6df99be7fc62917614d436d6950
Commit message: "Merge pull request #5734 from iemejia/fix-maven-compile-8"
> git rev-list --no-walk 01e250737173c6df99be7fc62917614d436d6950 # timeout=10
Cleaning workspace
> git rev-parse --verify HEAD # timeout=10
Resetting working tree
> git reset --hard # timeout=10
> git clean -fdx # timeout=10
[EnvInject] - Executing scripts and injecting environment variables after the SCM step.
[EnvInject] - Injecting as environment variables the properties content
SPARK_LOCAL_IP=127.0.0.1
[EnvInject] - Variables injected successfully.
[beam_PostCommit_Py_ValCont] $ /bin/bash -xe /tmp/jenkins2015256221785284872.sh
+ cd src
+ bash sdks/python/container/run_validatescontainer.sh
# Where to store integration test outputs.
GCS_LOCATION=gs://temp-storage-for-end-to-end-tests
# Project for the container and integration test
PROJECT=apache-beam-testing
# Verify in the root of the repository
test -d sdks/python/container
# Verify docker and gcloud commands exist
command -v docker
/usr/bin/docker
command -v gcloud
/usr/bin/gcloud
docker -v
Docker version 17.05.0-ce, build 89658be
gcloud -v
Google Cloud SDK 191.0.0
alpha 2018.02.23
beta 2018.02.23
bq 2.0.29
core 2018.02.23
gsutil 4.28
# Build the container
TAG=$(date +%Y%m%d-%H%M%S)
date +%Y%m%d-%H%M%S
CONTAINER=us.gcr.io/$PROJECT/$USER/python
echo "Using container $CONTAINER"
Using container us.gcr.io/apache-beam-testing/jenkins/python
./gradlew :beam-sdks-python-container:docker -Pdocker-repository-root=us.gcr.io/$PROJECT/$USER -Pdocker-tag=$TAG
Parallel execution is an incubating feature.
> Task :buildSrc:compileJava NO-SOURCE
> Task :buildSrc:compileGroovy FROM-CACHE
> Task :buildSrc:processResources NO-SOURCE
> Task :buildSrc:classes UP-TO-DATE
> Task :buildSrc:jar
> Task :buildSrc:assemble
> Task :buildSrc:spotlessGroovy
> Task :buildSrc:spotlessGroovyCheck
> Task :buildSrc:spotlessGroovyGradle
> Task :buildSrc:spotlessGroovyGradleCheck
> Task :buildSrc:spotlessCheck
> Task :buildSrc:compileTestJava NO-SOURCE
> Task :buildSrc:compileTestGroovy NO-SOURCE
> Task :buildSrc:processTestResources NO-SOURCE
> Task :buildSrc:testClasses UP-TO-DATE
> Task :buildSrc:test NO-SOURCE
> Task :buildSrc:check
> Task :buildSrc:build
Parallel execution with configuration on demand is an incubating feature.
> Configure project :
Applying BeamModulePlugin to beam
createPerformanceTestHarness with default configuration for project beam
Adding 48 .gitignore exclusions to Apache Rat
> Configure project :beam-sdks-python-container
Applying BeamModulePlugin to beam-sdks-python-container
applyGoNature with default configuration for project beam-sdks-python-container
applyDockerNature with default configuration for project beam-sdks-python-container
> Configure project :beam-sdks-python-container
containerImageName with [name:python] for project beam-sdks-python-container
Project evaluation failed including an error in afterEvaluate {}. Run with --stacktrace for details of the afterEvaluate {} error.
FAILURE: Build failed with an exception.
* Where:
Build file '<https://builds.apache.org/job/beam_PostCommit_Py_ValCont/ws/src/sdks/python/container/build.gradle'> line: 61
* What went wrong:
A problem occurred evaluating project ':beam-sdks-python-container'.
> No such property: rootProject for class: org.apache.beam.gradle.BeamModulePlugin
* Try:
Run with --stacktrace option to get the stack trace. Run with --info or --debug option to get more log output. Run with --scan to get full insights.
* Get more help at https://help.gradle.org
Deprecated Gradle features were used in this build, making it incompatible with Gradle 5.0.
See https://docs.gradle.org/4.8/userguide/command_line_interface.html#sec:command_line_warnings
BUILD FAILED in 15s
Publishing build scan...
https://gradle.com/s/nl3ul3j2cdbsq
Build step 'Execute shell' marked build as failure
Not sending mail to unregistered user apilloud@google.com
Not sending mail to unregistered user katarzyna.kucharczyk@polidea.com
Not sending mail to unregistered user amaliujia@163.com
Not sending mail to unregistered user migryz@google.com
Not sending mail to unregistered user github@alasdairhodge.co.uk
Not sending mail to unregistered user marek.simunek@firma.seznam.cz
Not sending mail to unregistered user lukasz.gajowy@polidea.com
Not sending mail to unregistered user sourabhbajaj@google.com
Not sending mail to unregistered user mergebot@apache.org
Not sending mail to unregistered user mariagh@mariagh.svl.corp.google.com
Not sending mail to unregistered user thomas.haines@practiceinsight.io
Not sending mail to unregistered user axelmagn@gmail.com
Not sending mail to unregistered user ddonnelly@google.com
Not sending mail to unregistered user ehudm@google.com
Not sending mail to unregistered user relax@relax-macbookpro2.roam.corp.google.com
Not sending mail to unregistered user devon.meunier@shopify.com
Not sending mail to unregistered user timrobertson100@gmail.com
Not sending mail to unregistered user kirpichov@google.com
Not sending mail to unregistered user cademarkegard@gmail.com
Not sending mail to unregistered user ekirpichov@gmail.com
Not sending mail to unregistered user basti.lj@alibaba-inc.com
Not sending mail to unregistered user mrtn@nrd.io
Not sending mail to unregistered user rober@frantil.com
Not sending mail to unregistered user jiangkai@gmail.com
Not sending mail to unregistered user valentyn@google.com
Not sending mail to unregistered user aaltay@gmail.com
Not sending mail to unregistered user azur@paypal.com
Not sending mail to unregistered user jamalone@gmail.com
Not sending mail to unregistered user terrencehan@tencent.com
Not sending mail to unregistered user hadarh@google.com
Not sending mail to unregistered user melissapa@google.com
Not sending mail to unregistered user fjp@google.com
Not sending mail to unregistered user klk@google.com
Not sending mail to unregistered user pgerver@us.ibm.com
Not sending mail to unregistered user jasonkuster@google.com
Not sending mail to unregistered user aljoscha.krettek@gmail.com
Not sending mail to unregistered user aromanenko.dev@gmail.com
Not sending mail to unregistered user mairbek@google.com
Not sending mail to unregistered user taro.murao@gmail.com
Not sending mail to unregistered user swegner@google.com
Not sending mail to unregistered user ankurgoenka@gmail.com
Not sending mail to unregistered user wnsdud1861@gmail.com
Not sending mail to unregistered user peihe0@gmail.com
Not sending mail to unregistered user sisk@google.com
Build failed in Jenkins: beam_PostCommit_Py_ValCont #78
Posted by Apache Jenkins Server <je...@builds.apache.org>.
See <https://builds.apache.org/job/beam_PostCommit_Py_ValCont/78/display/redirect?page=changes>
Changes:
[iemejia] Fix maven compile for the 8th time (yay!)
------------------------------------------
Started by GitHub push by jbonofre
[EnvInject] - Loading node environment variables.
Building remotely on beam7 (beam) in workspace <https://builds.apache.org/job/beam_PostCommit_Py_ValCont/ws/>
> git rev-parse --is-inside-work-tree # timeout=10
Fetching changes from the remote Git repository
> git config remote.origin.url https://github.com/apache/beam.git # timeout=10
Fetching upstream changes from https://github.com/apache/beam.git
> git --version # timeout=10
> git fetch --tags --progress https://github.com/apache/beam.git +refs/heads/*:refs/remotes/origin/* +refs/pull/${ghprbPullId}/*:refs/remotes/origin/pr/${ghprbPullId}/*
> git rev-parse origin/master^{commit} # timeout=10
Checking out Revision 01e250737173c6df99be7fc62917614d436d6950 (origin/master)
> git config core.sparsecheckout # timeout=10
> git checkout -f 01e250737173c6df99be7fc62917614d436d6950
Commit message: "Merge pull request #5734 from iemejia/fix-maven-compile-8"
> git rev-list --no-walk 7bf5966d44ed8eb4d5c5d6459ef0c877494052b6 # timeout=10
Cleaning workspace
> git rev-parse --verify HEAD # timeout=10
Resetting working tree
> git reset --hard # timeout=10
> git clean -fdx # timeout=10
[EnvInject] - Executing scripts and injecting environment variables after the SCM step.
[EnvInject] - Injecting as environment variables the properties content
SPARK_LOCAL_IP=127.0.0.1
[EnvInject] - Variables injected successfully.
[beam_PostCommit_Py_ValCont] $ /bin/bash -xe /tmp/jenkins1235392530546178780.sh
+ cd src
+ bash sdks/python/container/run_validatescontainer.sh
# Where to store integration test outputs.
GCS_LOCATION=gs://temp-storage-for-end-to-end-tests
# Project for the container and integration test
PROJECT=apache-beam-testing
# Verify in the root of the repository
test -d sdks/python/container
# Verify docker and gcloud commands exist
command -v docker
/usr/bin/docker
command -v gcloud
/usr/bin/gcloud
docker -v
Docker version 17.05.0-ce, build 89658be
gcloud -v
Google Cloud SDK 191.0.0
alpha 2018.02.23
beta 2018.02.23
bq 2.0.29
core 2018.02.23
gsutil 4.28
# Build the container
TAG=$(date +%Y%m%d-%H%M%S)
date +%Y%m%d-%H%M%S
CONTAINER=us.gcr.io/$PROJECT/$USER/python
echo "Using container $CONTAINER"
Using container us.gcr.io/apache-beam-testing/jenkins/python
./gradlew :beam-sdks-python-container:docker -Pdocker-repository-root=us.gcr.io/$PROJECT/$USER -Pdocker-tag=$TAG
Parallel execution is an incubating feature.
> Task :buildSrc:compileJava NO-SOURCE
> Task :buildSrc:compileGroovy FROM-CACHE
> Task :buildSrc:processResources NO-SOURCE
> Task :buildSrc:classes UP-TO-DATE
> Task :buildSrc:jar
> Task :buildSrc:assemble
> Task :buildSrc:spotlessGroovy
> Task :buildSrc:spotlessGroovyCheck
> Task :buildSrc:spotlessGroovyGradle
> Task :buildSrc:spotlessGroovyGradleCheck
> Task :buildSrc:spotlessCheck
> Task :buildSrc:compileTestJava NO-SOURCE
> Task :buildSrc:compileTestGroovy NO-SOURCE
> Task :buildSrc:processTestResources NO-SOURCE
> Task :buildSrc:testClasses UP-TO-DATE
> Task :buildSrc:test NO-SOURCE
> Task :buildSrc:check
> Task :buildSrc:build
Parallel execution with configuration on demand is an incubating feature.
> Configure project :
Applying BeamModulePlugin to beam
createPerformanceTestHarness with default configuration for project beam
Adding 48 .gitignore exclusions to Apache Rat
> Configure project :beam-sdks-python-container
Applying BeamModulePlugin to beam-sdks-python-container
applyGoNature with default configuration for project beam-sdks-python-container
applyDockerNature with default configuration for project beam-sdks-python-container
containerImageName with [name:python] for project beam-sdks-python-container
Project evaluation failed including an error in afterEvaluate {}. Run with --stacktrace for details of the afterEvaluate {} error.
FAILURE: Build failed with an exception.
* Where:
Build file '<https://builds.apache.org/job/beam_PostCommit_Py_ValCont/ws/src/sdks/python/container/build.gradle'> line: 61
* What went wrong:
A problem occurred evaluating project ':beam-sdks-python-container'.
> No such property: rootProject for class: org.apache.beam.gradle.BeamModulePlugin
* Try:
Run with --stacktrace option to get the stack trace. Run with --info or --debug option to get more log output. Run with --scan to get full insights.
* Get more help at https://help.gradle.org
Deprecated Gradle features were used in this build, making it incompatible with Gradle 5.0.
See https://docs.gradle.org/4.8/userguide/command_line_interface.html#sec:command_line_warnings
BUILD FAILED in 12s
Publishing build scan...
https://gradle.com/s/myohkkekmkyro
Build step 'Execute shell' marked build as failure
Not sending mail to unregistered user apilloud@google.com
Not sending mail to unregistered user katarzyna.kucharczyk@polidea.com
Not sending mail to unregistered user amaliujia@163.com
Not sending mail to unregistered user migryz@google.com
Not sending mail to unregistered user github@alasdairhodge.co.uk
Not sending mail to unregistered user marek.simunek@firma.seznam.cz
Not sending mail to unregistered user lukasz.gajowy@polidea.com
Not sending mail to unregistered user sourabhbajaj@google.com
Not sending mail to unregistered user mergebot@apache.org
Not sending mail to unregistered user mariagh@mariagh.svl.corp.google.com
Not sending mail to unregistered user thomas.haines@practiceinsight.io
Not sending mail to unregistered user axelmagn@gmail.com
Not sending mail to unregistered user ddonnelly@google.com
Not sending mail to unregistered user ehudm@google.com
Not sending mail to unregistered user relax@relax-macbookpro2.roam.corp.google.com
Not sending mail to unregistered user devon.meunier@shopify.com
Not sending mail to unregistered user timrobertson100@gmail.com
Not sending mail to unregistered user kirpichov@google.com
Not sending mail to unregistered user cademarkegard@gmail.com
Not sending mail to unregistered user ekirpichov@gmail.com
Not sending mail to unregistered user basti.lj@alibaba-inc.com
Not sending mail to unregistered user mrtn@nrd.io
Not sending mail to unregistered user rober@frantil.com
Not sending mail to unregistered user jiangkai@gmail.com
Not sending mail to unregistered user valentyn@google.com
Not sending mail to unregistered user aaltay@gmail.com
Not sending mail to unregistered user azur@paypal.com
Not sending mail to unregistered user jamalone@gmail.com
Not sending mail to unregistered user terrencehan@tencent.com
Not sending mail to unregistered user hadarh@google.com
Not sending mail to unregistered user melissapa@google.com
Not sending mail to unregistered user fjp@google.com
Not sending mail to unregistered user klk@google.com
Not sending mail to unregistered user pgerver@us.ibm.com
Not sending mail to unregistered user jasonkuster@google.com
Not sending mail to unregistered user aljoscha.krettek@gmail.com
Not sending mail to unregistered user aromanenko.dev@gmail.com
Not sending mail to unregistered user mairbek@google.com
Not sending mail to unregistered user taro.murao@gmail.com
Not sending mail to unregistered user swegner@google.com
Not sending mail to unregistered user ankurgoenka@gmail.com
Not sending mail to unregistered user wnsdud1861@gmail.com
Not sending mail to unregistered user peihe0@gmail.com
Not sending mail to unregistered user sisk@google.com
Build failed in Jenkins: beam_PostCommit_Py_ValCont #77
Posted by Apache Jenkins Server <je...@builds.apache.org>.
See <https://builds.apache.org/job/beam_PostCommit_Py_ValCont/77/display/redirect?page=changes>
Changes:
[klk] Fix errors in BeamModulePlugin perf test section
------------------------------------------
Started by GitHub push by kennknowles
[EnvInject] - Loading node environment variables.
Building remotely on beam7 (beam) in workspace <https://builds.apache.org/job/beam_PostCommit_Py_ValCont/ws/>
> git rev-parse --is-inside-work-tree # timeout=10
Fetching changes from the remote Git repository
> git config remote.origin.url https://github.com/apache/beam.git # timeout=10
Fetching upstream changes from https://github.com/apache/beam.git
> git --version # timeout=10
> git fetch --tags --progress https://github.com/apache/beam.git +refs/heads/*:refs/remotes/origin/* +refs/pull/${ghprbPullId}/*:refs/remotes/origin/pr/${ghprbPullId}/*
> git rev-parse origin/master^{commit} # timeout=10
Checking out Revision 7bf5966d44ed8eb4d5c5d6459ef0c877494052b6 (origin/master)
> git config core.sparsecheckout # timeout=10
> git checkout -f 7bf5966d44ed8eb4d5c5d6459ef0c877494052b6
Commit message: "Merge pull request #5732: [BEAM-4618] Fix errors in BeamModulePlugin perf test section"
> git rev-list --no-walk d75365eeeff8d8b3fc6c97e582854ddcc9da49b6 # timeout=10
Cleaning workspace
> git rev-parse --verify HEAD # timeout=10
Resetting working tree
> git reset --hard # timeout=10
> git clean -fdx # timeout=10
[EnvInject] - Executing scripts and injecting environment variables after the SCM step.
[EnvInject] - Injecting as environment variables the properties content
SPARK_LOCAL_IP=127.0.0.1
[EnvInject] - Variables injected successfully.
[beam_PostCommit_Py_ValCont] $ /bin/bash -xe /tmp/jenkins2319622434952343001.sh
+ cd src
+ bash sdks/python/container/run_validatescontainer.sh
# Where to store integration test outputs.
GCS_LOCATION=gs://temp-storage-for-end-to-end-tests
# Project for the container and integration test
PROJECT=apache-beam-testing
# Verify in the root of the repository
test -d sdks/python/container
# Verify docker and gcloud commands exist
command -v docker
/usr/bin/docker
command -v gcloud
/usr/bin/gcloud
docker -v
Docker version 17.05.0-ce, build 89658be
gcloud -v
Google Cloud SDK 191.0.0
alpha 2018.02.23
beta 2018.02.23
bq 2.0.29
core 2018.02.23
gsutil 4.28
# Build the container
TAG=$(date +%Y%m%d-%H%M%S)
date +%Y%m%d-%H%M%S
CONTAINER=us.gcr.io/$PROJECT/$USER/python
echo "Using container $CONTAINER"
Using container us.gcr.io/apache-beam-testing/jenkins/python
./gradlew :beam-sdks-python-container:docker -Pdocker-repository-root=us.gcr.io/$PROJECT/$USER -Pdocker-tag=$TAG
Parallel execution is an incubating feature.
> Task :buildSrc:compileJava NO-SOURCE
> Task :buildSrc:compileGroovy
> Task :buildSrc:processResources NO-SOURCE
> Task :buildSrc:classes
> Task :buildSrc:jar
> Task :buildSrc:assemble
> Task :buildSrc:spotlessGroovy
> Task :buildSrc:spotlessGroovyCheck
> Task :buildSrc:spotlessGroovyGradle
> Task :buildSrc:spotlessGroovyGradleCheck
> Task :buildSrc:spotlessCheck
> Task :buildSrc:compileTestJava NO-SOURCE
> Task :buildSrc:compileTestGroovy NO-SOURCE
> Task :buildSrc:processTestResources NO-SOURCE
> Task :buildSrc:testClasses UP-TO-DATE
> Task :buildSrc:test NO-SOURCE
> Task :buildSrc:check
> Task :buildSrc:build
Parallel execution with configuration on demand is an incubating feature.
> Configure project :
Applying BeamModulePlugin to beam
createPerformanceTestHarness with default configuration for project beam
Adding 48 .gitignore exclusions to Apache Rat
> Configure project :beam-sdks-python-container
Applying BeamModulePlugin to beam-sdks-python-container
applyGoNature with default configuration for project beam-sdks-python-container
applyDockerNature with default configuration for project beam-sdks-python-container
containerImageName with [name:python] for project beam-sdks-python-container
Project evaluation failed including an error in afterEvaluate {}. Run with --stacktrace for details of the afterEvaluate {} error.
FAILURE: Build failed with an exception.
* Where:
Build file '<https://builds.apache.org/job/beam_PostCommit_Py_ValCont/ws/src/sdks/python/container/build.gradle'> line: 61
* What went wrong:
A problem occurred evaluating project ':beam-sdks-python-container'.
> No such property: rootProject for class: org.apache.beam.gradle.BeamModulePlugin
* Try:
Run with --stacktrace option to get the stack trace. Run with --info or --debug option to get more log output. Run with --scan to get full insights.
* Get more help at https://help.gradle.org
Deprecated Gradle features were used in this build, making it incompatible with Gradle 5.0.
See https://docs.gradle.org/4.8/userguide/command_line_interface.html#sec:command_line_warnings
BUILD FAILED in 15s
Publishing build scan...
https://gradle.com/s/5vlk3vhx5dfy2
Build step 'Execute shell' marked build as failure
Not sending mail to unregistered user apilloud@google.com
Not sending mail to unregistered user katarzyna.kucharczyk@polidea.com
Not sending mail to unregistered user amaliujia@163.com
Not sending mail to unregistered user migryz@google.com
Not sending mail to unregistered user github@alasdairhodge.co.uk
Not sending mail to unregistered user marek.simunek@firma.seznam.cz
Not sending mail to unregistered user lukasz.gajowy@polidea.com
Not sending mail to unregistered user sourabhbajaj@google.com
Not sending mail to unregistered user mergebot@apache.org
Not sending mail to unregistered user mariagh@mariagh.svl.corp.google.com
Not sending mail to unregistered user thomas.haines@practiceinsight.io
Not sending mail to unregistered user axelmagn@gmail.com
Not sending mail to unregistered user ddonnelly@google.com
Not sending mail to unregistered user ehudm@google.com
Not sending mail to unregistered user relax@relax-macbookpro2.roam.corp.google.com
Not sending mail to unregistered user devon.meunier@shopify.com
Not sending mail to unregistered user timrobertson100@gmail.com
Not sending mail to unregistered user kirpichov@google.com
Not sending mail to unregistered user cademarkegard@gmail.com
Not sending mail to unregistered user ekirpichov@gmail.com
Not sending mail to unregistered user basti.lj@alibaba-inc.com
Not sending mail to unregistered user mrtn@nrd.io
Not sending mail to unregistered user rober@frantil.com
Not sending mail to unregistered user jiangkai@gmail.com
Not sending mail to unregistered user valentyn@google.com
Not sending mail to unregistered user aaltay@gmail.com
Not sending mail to unregistered user azur@paypal.com
Not sending mail to unregistered user jamalone@gmail.com
Not sending mail to unregistered user terrencehan@tencent.com
Not sending mail to unregistered user hadarh@google.com
Not sending mail to unregistered user melissapa@google.com
Not sending mail to unregistered user fjp@google.com
Not sending mail to unregistered user klk@google.com
Not sending mail to unregistered user pgerver@us.ibm.com
Not sending mail to unregistered user jasonkuster@google.com
Not sending mail to unregistered user aljoscha.krettek@gmail.com
Not sending mail to unregistered user aromanenko.dev@gmail.com
Not sending mail to unregistered user mairbek@google.com
Not sending mail to unregistered user taro.murao@gmail.com
Not sending mail to unregistered user swegner@google.com
Not sending mail to unregistered user ankurgoenka@gmail.com
Not sending mail to unregistered user wnsdud1861@gmail.com
Not sending mail to unregistered user peihe0@gmail.com
Not sending mail to unregistered user sisk@google.com