You are viewing a plain text version of this content. The canonical link for it is here.
Posted to builds@cassandra.apache.org by Apache Jenkins Server <je...@builds.apache.org> on 2024/06/27 16:54:15 UTC

Build complete: Cassandra-4.0 #710 [UNSTABLE] 90208c0a29157fdc4ac88d7e24708535650b5d55

-------------------------------------------------------------------------------
Build Cassandra-4.0 #710 Still Unstable
URL: https://ci-cassandra.apache.org/job/Cassandra-4.0/710/
-------------------------------------------------------------------------------
Changes:
[Benjamin Lerer] Makes LWT conditions behavior on frozen and non-frozen columns


-------------------------------------------------------------------------------
Failed Tests:
10 tests failed.
FAILED:  dtest-offheap.cqlsh_tests.test_cqlsh_copy.TestCqlshCopy.test_bulk_round_trip_with_backoff
FAILED:  dtest-upgrade.upgrade_tests.cql_tests.TestCQLNodes3RF3_Upgrade_indev_3_0_x_To_indev_4_0_x.test_limit_ranges
FAILED:  dtest-upgrade.upgrade_tests.cql_tests.TestCQLNodes3RF3_Upgrade_indev_3_0_x_To_indev_4_0_x.test_timeuuid
FAILED:  dtest-upgrade.upgrade_tests.cql_tests.TestCQLNodes3RF3_Upgrade_indev_3_0_x_To_indev_4_0_x.test_exclusive_slice
FAILED:  org.apache.cassandra.metrics.TableMetricsTest.testLoggedPartitionsPerBatchMultiTable-cdc
FAILED:  org.apache.cassandra.cql3.MemtableSizeTest.testTruncationReleasesLogSpace-cdc
FAILED:  org.apache.cassandra.cql3.MemtableSizeTest.testTruncationReleasesLogSpace-compression
FAILED:  org.apache.cassandra.cql3.MemtableSizeTest.testTruncationReleasesLogSpace-compression
FAILED:  org.apache.cassandra.cql3.MemtableSizeTest.testTruncationReleasesLogSpace
FAILED:  org.apache.cassandra.cql3.MemtableSizeTest.testTruncationReleasesLogSpace

-------------------------------------------------------------------------------
For complete test report and logs see https://nightlies.apache.org/cassandra/Cassandra-4.0/710/