You are viewing a plain text version of this content. The canonical link for it is here.
Posted to scm@geronimo.apache.org by db...@apache.org on 2004/06/05 11:31:30 UTC

[status] build: FAILED, test: FAILED | Linux 2.4.24, 2004-06-05

NIGHTLY BUILD/TEST
  Date: Sat Jun  5 05:30:14 EDT 2004
  Kernel: Linux 2.4.24
  Host: beaver.codehaus.org
  Java: 1.4.2_03-b02, mixed mode
  Maven: 1.0-rc1-SNAPSHOT

CHECKOUT: incubator-geronimo

BUILDING: incubator-geronimo
BUILD FAILED

BUILD FAILED
Total time: 42 seconds
Finished at: Sat Jun 05 05:31:30 EDT 2004