You are viewing a plain text version of this content. The canonical link for it is here.
Posted to builds@beam.apache.org by Apache Jenkins Server <je...@builds.apache.org> on 2022/08/02 21:25:31 UTC

Build failed in Jenkins: beam_Release_NightlySnapshot #1632

See <https://ci-beam.apache.org/job/beam_Release_NightlySnapshot/1632/display/redirect?page=changes>

Changes:

[noreply] Update pytest to support Python 3.10 (#22055)

[Valentyn Tymofieiev] add zstd compression support according to issue 22393

[Valentyn Tymofieiev] Regenerate the container dependencies.

[noreply] Update the imprecise link. (#22549)

[noreply] Remove normalization in Pytorch Image Segmentation example (#22371)

[noreply] Downgrade less informative logs during write to files (#22273)


------------------------------------------
[...truncated 544.55 KB...]
> Task :sdks:java:testing:nexmark:testJar
> Task :sdks:java:testing:nexmark:testSourcesJar
> Task :sdks:java:testing:nexmark:publishMavenJavaPublicationToApache.snapshots.httpsRepository
> Task :sdks:java:testing:nexmark:publishMavenJavaPublicationToTestPublicationLocalRepository
> Task :sdks:java:testing:nexmark:publish
> Task :sdks:java:testing:test-utils:javadoc FROM-CACHE
> Task :sdks:java:testing:test-utils:javadocJar
> Task :sdks:java:testing:test-utils:sourcesJar
> Task :sdks:java:testing:test-utils:testSourcesJar
> Task :sdks:java:testing:test-utils:publishMavenJavaPublicationToApache.snapshots.httpsRepository
> Task :sdks:java:testing:test-utils:publishMavenJavaPublicationToTestPublicationLocalRepository
> Task :sdks:java:testing:test-utils:publish
> Task :sdks:java:testing:tpcds:generatePomFileForMavenJavaPublication

> Task :sdks:java:testing:tpcds:compileJava
Note: <https://ci-beam.apache.org/job/beam_Release_NightlySnapshot/ws/src/sdks/java/testing/tpcds/src/main/java/org/apache/beam/sdk/tpcds/SqlTransformRunner.java> uses or overrides a deprecated API.
Note: Recompile with -Xlint:deprecation for details.

> Task :sdks:java:testing:tpcds:processResources
> Task :sdks:java:testing:tpcds:classes
> Task :sdks:java:testing:tpcds:generatePomPropertiesFileForMavenJavaPublication
> Task :sdks:java:testing:tpcds:jar
> Task :sdks:java:testing:tpcds:javadoc FROM-CACHE
> Task :sdks:java:testing:tpcds:javadocJar
> Task :sdks:java:testing:tpcds:sourcesJar
> Task :sdks:java:testing:tpcds:compileTestJava
> Task :sdks:java:testing:tpcds:processTestResources NO-SOURCE
> Task :sdks:java:testing:tpcds:testClasses
> Task :sdks:java:testing:tpcds:testJar
> Task :sdks:java:testing:tpcds:testSourcesJar
> Task :sdks:java:testing:tpcds:publishMavenJavaPublicationToApache.snapshots.httpsRepository
> Task :sdks:java:testing:tpcds:publishMavenJavaPublicationToTestPublicationLocalRepository
> Task :sdks:java:testing:tpcds:publish
> Task :sdks:java:extensions:sql:datacatalog:generatePomFileForMavenJavaPublication
> Task :sdks:java:extensions:sql:datacatalog:compileJava
> Task :sdks:java:extensions:sql:datacatalog:processResources NO-SOURCE
> Task :sdks:java:extensions:sql:datacatalog:classes
> Task :sdks:java:extensions:sql:datacatalog:generatePomPropertiesFileForMavenJavaPublication
> Task :sdks:java:extensions:sql:datacatalog:jar
> Task :sdks:java:extensions:sql:datacatalog:javadoc FROM-CACHE
> Task :sdks:java:extensions:sql:datacatalog:javadocJar
> Task :sdks:java:extensions:sql:datacatalog:sourcesJar
> Task :runners:direct-java:jar
> Task :sdks:java:extensions:sql:datacatalog:compileTestJava
> Task :sdks:java:extensions:sql:datacatalog:processTestResources NO-SOURCE
> Task :sdks:java:extensions:sql:datacatalog:testClasses
> Task :sdks:java:extensions:sql:datacatalog:testJar
> Task :sdks:java:extensions:sql:datacatalog:testSourcesJar
> Task :sdks:java:extensions:sql:datacatalog:publishMavenJavaPublicationToApache.snapshots.httpsRepository
> Task :sdks:java:extensions:sql:datacatalog:publishMavenJavaPublicationToTestPublicationLocalRepository
> Task :sdks:java:extensions:sql:datacatalog:publish
> Task :sdks:java:extensions:sql:expansion-service:javadoc FROM-CACHE
> Task :sdks:java:extensions:sql:expansion-service:javadocJar
> Task :sdks:java:extensions:sql:expansion-service:compileTestJava NO-SOURCE
> Task :sdks:java:extensions:sql:expansion-service:processTestResources NO-SOURCE
> Task :sdks:java:extensions:sql:expansion-service:testClasses UP-TO-DATE
> Task :sdks:java:extensions:sql:expansion-service:shadowTestJar
> Task :sdks:java:extensions:sql:expansion-service:sourcesJar
> Task :sdks:java:extensions:sql:expansion-service:testSourcesJar
> Task :sdks:java:extensions:sql:expansion-service:publishMavenJavaPublicationToApache.snapshots.httpsRepository
> Task :sdks:java:extensions:sql:expansion-service:publishMavenJavaPublicationToTestPublicationLocalRepository
> Task :sdks:java:extensions:sql:expansion-service:publish
> Task :sdks:java:extensions:sql:hcatalog:generatePomFileForMavenJavaPublication
> Task :sdks:java:extensions:sql:hcatalog:compileJava
> Task :sdks:java:extensions:sql:hcatalog:processResources NO-SOURCE
> Task :sdks:java:extensions:sql:hcatalog:classes
> Task :sdks:java:extensions:sql:hcatalog:generatePomPropertiesFileForMavenJavaPublication
> Task :sdks:java:extensions:sql:hcatalog:jar
> Task :sdks:java:extensions:sql:hcatalog:javadoc FROM-CACHE
> Task :sdks:java:extensions:sql:hcatalog:javadocJar
> Task :sdks:java:extensions:sql:hcatalog:sourcesJar
> Task :sdks:java:extensions:sql:hcatalog:compileTestJava
> Task :sdks:java:extensions:sql:hcatalog:processTestResources NO-SOURCE
> Task :sdks:java:extensions:sql:hcatalog:testClasses
> Task :sdks:java:extensions:sql:hcatalog:testJar
> Task :sdks:java:extensions:sql:hcatalog:testSourcesJar
> Task :sdks:java:extensions:sql:hcatalog:publishMavenJavaPublicationToApache.snapshots.httpsRepository
> Task :sdks:java:extensions:sql:hcatalog:publishMavenJavaPublicationToTestPublicationLocalRepository
> Task :sdks:java:extensions:sql:hcatalog:publish
> Task :sdks:java:extensions:sql:jdbc:generatePomFileForMavenJavaPublication
> Task :sdks:java:extensions:sql:jdbc:compileJava
> Task :sdks:java:extensions:sql:jdbc:processResources
> Task :sdks:java:extensions:sql:jdbc:classes
> Task :sdks:java:extensions:sql:jdbc:javadoc FROM-CACHE
> Task :sdks:java:extensions:sql:jdbc:javadocJar
> Task :sdks:java:extensions:sql:jdbc:generatePomPropertiesFileForMavenJavaPublication
> Task :sdks:java:extensions:sql:jdbc:shadowJar

> Task :sdks:java:extensions:sql:jdbc:compileTestJava
Note: <https://ci-beam.apache.org/job/beam_Release_NightlySnapshot/ws/src/sdks/java/extensions/sql/jdbc/src/test/java/org/apache/beam/sdk/extensions/sql/jdbc/BeamSqlLineIT.java> uses or overrides a deprecated API.
Note: Recompile with -Xlint:deprecation for details.
Note: Some input files use unchecked or unsafe operations.
Note: Recompile with -Xlint:unchecked for details.

> Task :sdks:java:extensions:sql:jdbc:processTestResources NO-SOURCE
> Task :sdks:java:extensions:sql:jdbc:testClasses
> Task :sdks:java:extensions:sql:jdbc:shadowTestJar
> Task :sdks:java:extensions:sql:jdbc:sourcesJar
> Task :sdks:java:extensions:sql:jdbc:testSourcesJar
> Task :sdks:java:extensions:sql:jdbc:publishMavenJavaPublicationToApache.snapshots.httpsRepository
> Task :sdks:java:extensions:sql:jdbc:publishMavenJavaPublicationToTestPublicationLocalRepository
> Task :sdks:java:extensions:sql:jdbc:publish
> Task :sdks:java:extensions:sql:perf-tests:generatePomFileForMavenJavaPublication
> Task :sdks:java:extensions:sql:perf-tests:compileJava NO-SOURCE
> Task :sdks:java:extensions:sql:perf-tests:processResources NO-SOURCE
> Task :sdks:java:extensions:sql:perf-tests:classes UP-TO-DATE
> Task :sdks:java:extensions:sql:perf-tests:generatePomPropertiesFileForMavenJavaPublication
> Task :sdks:java:extensions:sql:perf-tests:jar
> Task :sdks:java:extensions:sql:perf-tests:javadoc NO-SOURCE
> Task :sdks:java:extensions:sql:perf-tests:javadocJar
> Task :sdks:java:extensions:sql:perf-tests:sourcesJar
> Task :sdks:java:extensions:sql:perf-tests:compileTestJava
> Task :sdks:java:extensions:sql:perf-tests:processTestResources NO-SOURCE
> Task :sdks:java:extensions:sql:perf-tests:testClasses
> Task :sdks:java:extensions:sql:perf-tests:testJar
> Task :sdks:java:extensions:sql:perf-tests:testSourcesJar
> Task :sdks:java:extensions:sql:perf-tests:publishMavenJavaPublicationToApache.snapshots.httpsRepository
> Task :sdks:java:extensions:sql:perf-tests:publishMavenJavaPublicationToTestPublicationLocalRepository
> Task :sdks:java:extensions:sql:perf-tests:publish
> Task :sdks:java:extensions:sql:udf:javadoc FROM-CACHE
> Task :sdks:java:extensions:sql:udf:javadocJar
> Task :sdks:java:extensions:sql:udf:sourcesJar
> Task :sdks:java:extensions:sql:udf:compileTestJava NO-SOURCE
> Task :sdks:java:extensions:sql:udf:processTestResources NO-SOURCE
> Task :sdks:java:extensions:sql:udf:testClasses UP-TO-DATE
> Task :sdks:java:extensions:sql:udf:testJar
> Task :sdks:java:extensions:sql:udf:testSourcesJar
> Task :sdks:java:extensions:sql:udf:publishMavenJavaPublicationToApache.snapshots.httpsRepository
> Task :sdks:java:extensions:sql:udf:publishMavenJavaPublicationToTestPublicationLocalRepository
> Task :sdks:java:extensions:sql:udf:publish
> Task :sdks:java:extensions:sql:zetasql:javadoc FROM-CACHE
> Task :sdks:java:extensions:sql:zetasql:javadocJar
> Task :sdks:java:extensions:sql:zetasql:sourcesJar

> Task :sdks:java:extensions:sql:zetasql:compileTestJava
Note: Some input files use or override a deprecated API.
Note: Recompile with -Xlint:deprecation for details.
Note: <https://ci-beam.apache.org/job/beam_Release_NightlySnapshot/ws/src/sdks/java/extensions/sql/zetasql/src/test/java/org/apache/beam/sdk/extensions/sql/zetasql/BeamZetaSqlCalcRelTest.java> uses unchecked or unsafe operations.
Note: Recompile with -Xlint:unchecked for details.

> Task :sdks:java:extensions:sql:zetasql:processTestResources NO-SOURCE
> Task :sdks:java:extensions:sql:zetasql:testClasses
> Task :sdks:java:extensions:sql:zetasql:testJar
> Task :sdks:java:extensions:sql:zetasql:testSourcesJar
> Task :sdks:java:extensions:sql:zetasql:publishMavenJavaPublicationToApache.snapshots.httpsRepository
> Task :sdks:java:extensions:sql:zetasql:publishMavenJavaPublicationToTestPublicationLocalRepository
> Task :sdks:java:extensions:sql:zetasql:publish
> Task :sdks:java:io:debezium:expansion-service:generatePomFileForMavenJavaPublication
> Task :sdks:java:io:debezium:expansion-service:compileJava NO-SOURCE
> Task :sdks:java:io:debezium:expansion-service:processResources NO-SOURCE
> Task :sdks:java:io:debezium:expansion-service:classes UP-TO-DATE
> Task :sdks:java:io:debezium:expansion-service:javadoc NO-SOURCE
> Task :sdks:java:io:debezium:expansion-service:javadocJar
> Task :sdks:java:io:debezium:expansion-service:generatePomPropertiesFileForMavenJavaPublication
> Task :sdks:java:io:debezium:expansion-service:shadowJar
> Task :sdks:java:io:debezium:expansion-service:compileTestJava NO-SOURCE
> Task :sdks:java:io:debezium:expansion-service:processTestResources NO-SOURCE
> Task :sdks:java:io:debezium:expansion-service:testClasses UP-TO-DATE
> Task :sdks:java:io:debezium:expansion-service:shadowTestJar
> Task :sdks:java:io:debezium:expansion-service:sourcesJar
> Task :sdks:java:io:debezium:expansion-service:testSourcesJar
> Task :sdks:java:io:debezium:expansion-service:publishMavenJavaPublicationToApache.snapshots.httpsRepository
> Task :sdks:java:io:debezium:expansion-service:publishMavenJavaPublicationToTestPublicationLocalRepository
> Task :sdks:java:io:debezium:expansion-service:publish
> Task :sdks:java:io:google-cloud-platform:expansion-service:generatePomFileForMavenJavaPublication
> Task :sdks:java:extensions:schemaio-expansion-service:jar
> Task :sdks:java:io:google-cloud-platform:expansion-service:compileJava NO-SOURCE
> Task :sdks:java:io:google-cloud-platform:expansion-service:processResources NO-SOURCE
> Task :sdks:java:io:google-cloud-platform:expansion-service:classes UP-TO-DATE
> Task :sdks:java:io:google-cloud-platform:expansion-service:javadoc NO-SOURCE
> Task :sdks:java:io:google-cloud-platform:expansion-service:javadocJar
> Task :sdks:java:io:google-cloud-platform:expansion-service:generatePomPropertiesFileForMavenJavaPublication
> Task :sdks:java:io:google-cloud-platform:expansion-service:shadowJar
> Task :sdks:java:io:google-cloud-platform:expansion-service:compileTestJava NO-SOURCE
> Task :sdks:java:io:google-cloud-platform:expansion-service:processTestResources NO-SOURCE
> Task :sdks:java:io:google-cloud-platform:expansion-service:testClasses UP-TO-DATE
> Task :sdks:java:io:google-cloud-platform:expansion-service:shadowTestJar
> Task :sdks:java:io:google-cloud-platform:expansion-service:sourcesJar
> Task :sdks:java:io:google-cloud-platform:expansion-service:testSourcesJar
> Task :sdks:java:io:google-cloud-platform:expansion-service:publishMavenJavaPublicationToApache.snapshots.httpsRepository
> Task :sdks:java:io:google-cloud-platform:expansion-service:publishMavenJavaPublicationToTestPublicationLocalRepository
> Task :sdks:java:io:google-cloud-platform:expansion-service:publish
> Task :sdks:java:io:kinesis:expansion-service:generatePomFileForMavenJavaPublication
> Task :sdks:java:io:kinesis:expansion-service:compileJava NO-SOURCE
> Task :sdks:java:io:kinesis:expansion-service:processResources NO-SOURCE
> Task :sdks:java:io:kinesis:expansion-service:classes UP-TO-DATE
> Task :sdks:java:io:kinesis:expansion-service:javadoc NO-SOURCE
> Task :sdks:java:io:kinesis:expansion-service:javadocJar
> Task :sdks:java:io:kinesis:expansion-service:generatePomPropertiesFileForMavenJavaPublication
> Task :sdks:java:io:kinesis:expansion-service:shadowJar
> Task :sdks:java:io:kinesis:expansion-service:compileTestJava NO-SOURCE
> Task :sdks:java:io:kinesis:expansion-service:processTestResources NO-SOURCE
> Task :sdks:java:io:kinesis:expansion-service:testClasses UP-TO-DATE
> Task :sdks:java:io:kinesis:expansion-service:shadowTestJar
> Task :sdks:java:io:kinesis:expansion-service:sourcesJar
> Task :sdks:java:io:kinesis:expansion-service:testSourcesJar
> Task :sdks:java:io:kinesis:expansion-service:publishMavenJavaPublicationToApache.snapshots.httpsRepository
> Task :sdks:java:io:kinesis:expansion-service:publishMavenJavaPublicationToTestPublicationLocalRepository
> Task :sdks:java:io:kinesis:expansion-service:publish
> Task :sdks:java:io:snowflake:expansion-service:generatePomFileForMavenJavaPublication
> Task :sdks:java:io:snowflake:expansion-service:compileJava NO-SOURCE
> Task :sdks:java:io:snowflake:expansion-service:processResources NO-SOURCE
> Task :sdks:java:io:snowflake:expansion-service:classes UP-TO-DATE
> Task :sdks:java:io:snowflake:expansion-service:javadoc NO-SOURCE
> Task :sdks:java:io:snowflake:expansion-service:javadocJar
> Task :sdks:java:io:snowflake:expansion-service:generatePomPropertiesFileForMavenJavaPublication
> Task :sdks:java:io:snowflake:expansion-service:shadowJar
> Task :sdks:java:io:snowflake:expansion-service:compileTestJava NO-SOURCE
> Task :sdks:java:io:snowflake:expansion-service:processTestResources NO-SOURCE
> Task :sdks:java:io:snowflake:expansion-service:testClasses UP-TO-DATE
> Task :sdks:java:io:snowflake:expansion-service:shadowTestJar
> Task :sdks:java:io:snowflake:expansion-service:sourcesJar
> Task :sdks:java:io:snowflake:expansion-service:testSourcesJar
> Task :sdks:java:io:snowflake:expansion-service:publishMavenJavaPublicationToApache.snapshots.httpsRepository
> Task :sdks:java:io:snowflake:expansion-service:publishMavenJavaPublicationToTestPublicationLocalRepository
> Task :sdks:java:io:snowflake:expansion-service:publish

FAILURE: Build failed with an exception.

* What went wrong:
Execution failed for task ':runners:flink:1.14:job-server:publishMavenJavaPublicationToApache.snapshots.httpsRepository'.
> Failed to publish publication 'mavenJava' to repository 'apache.snapshots.https'
   > Could not write to resource 'https://repository.apache.org/content/repositories/snapshots/org/apache/beam/beam-runners-flink-1.14-job-server/2.42.0-SNAPSHOT/beam-runners-flink-1.14-job-server-2.42.0-20220802.200748-7-javadoc.jar.md5'.
      > repository.apache.org:443 failed to respond

* Try:
> Run with --stacktrace option to get the stack trace.
> Run with --info or --debug option to get more log output.
> Run with --scan to get full insights.

* Get more help at https://help.gradle.org

Deprecated Gradle features were used in this build, making it incompatible with Gradle 8.0.

You can use '--warning-mode all' to show the individual deprecation warnings and determine if they come from your own scripts or plugins.

See https://docs.gradle.org/7.4/userguide/command_line_interface.html#sec:command_line_warnings

Execution optimizations have been disabled for 16 invalid unit(s) of work during this build to ensure correctness.
Please consult deprecation warnings for more details.

BUILD FAILED in 1h 17m 45s
1391 actionable tasks: 1292 executed, 89 from cache, 10 up-to-date

Publishing build scan...
https://gradle.com/s/fdyzkxl3bb2bs

Build step 'Invoke Gradle script' changed build result to FAILURE
Build step 'Invoke Gradle script' marked build as failure

---------------------------------------------------------------------
To unsubscribe, e-mail: builds-unsubscribe@beam.apache.org
For additional commands, e-mail: builds-help@beam.apache.org


Jenkins build is back to normal : beam_Release_NightlySnapshot #1633

Posted by Apache Jenkins Server <je...@builds.apache.org>.
See <https://ci-beam.apache.org/job/beam_Release_NightlySnapshot/1633/display/redirect?page=changes>


---------------------------------------------------------------------
To unsubscribe, e-mail: builds-unsubscribe@beam.apache.org
For additional commands, e-mail: builds-help@beam.apache.org